Hello,
I have built 'osmocon' and 'layer23' by using 'make osmocon' and 'make layer23' respectively in the terminal window. I get the same errors that I have written in my previous mail when i enter 'make firmware'. That means that my toolchain is running fine, it has something to do with the firmware. Please help me on this.
Awaiting your response, Zaki.
On Mon, Jun 7, 2010 at 1:21 AM, Zaki Ud Din fyproject14@gmail.com wrote:
Hello,
I have been trying to build osmocom but have been getting errors in doing so.
Firstly, I downloaded the following file,"* binutils-2.16.1, gcc-4.0.2-c-c++, newlib-1.14.0, insight-6.4, TAR BZ2 [65.5MB]*" under GCC-4.0 toolchain from www.gnuarm.com and extracted this to my home folder.
Secondly, I gave the following path "export PATH=/gnuarm-4.0.2/arm-elf/ bin:$PATH" in terminal window. Afterwards when I entered "make" under "/osmosom-bb/src", I got the following errors
zaki@zaki-desktop:~/osmocom-bb/src$ make cd shared/libosmocore/build-host && make make[1]: Entering directory `/home/zaki/osmocom-bb/src/shared/libosmocore/build-host' make all-recursive make[2]: Entering directory `/home/zaki/osmocom-bb/src/shared/libosmocore/build-host' Making all in include make[3]: Entering directory `/home/zaki/osmocom-bb/src/shared/libosmocore/build-host/include' Making all in osmocore make[4]: Entering directory `/home/zaki/osmocom-bb/src/shared/libosmocore/build-host/include/osmocore' Making all in protocol make[5]: Entering directory `/home/zaki/osmocom-bb/src/shared/libosmocore/build-host/include/osmocore/protocol' make[5]: Nothing to be done for `all'. make[5]: Leaving directory `/home/zaki/osmocom-bb/src/shared/libosmocore/build-host/include/osmocore/protocol' make[5]: Entering directory `/home/zaki/osmocom-bb/src/shared/libosmocore/build-host/include/osmocore' make[5]: Nothing to be done for `all-am'. make[5]: Leaving directory `/home/zaki/osmocom-bb/src/shared/libosmocore/build-host/include/osmocore' make[4]: Leaving directory `/home/zaki/osmocom-bb/src/shared/libosmocore/build-host/include/osmocore' make[4]: Entering directory `/home/zaki/osmocom-bb/src/shared/libosmocore/build-host/include' make[4]: Nothing to be done for `all-am'. make[4]: Leaving directory `/home/zaki/osmocom-bb/src/shared/libosmocore/build-host/include' make[3]: Leaving directory `/home/zaki/osmocom-bb/src/shared/libosmocore/build-host/include' Making all in src make[3]: Entering directory `/home/zaki/osmocom-bb/src/shared/libosmocore/build-host/src' make[3]: Nothing to be done for `all'. make[3]: Leaving directory `/home/zaki/osmocom-bb/src/shared/libosmocore/build-host/src' Making all in tests make[3]: Entering directory `/home/zaki/osmocom-bb/src/shared/libosmocore/build-host/tests' Making all in timer make[4]: Entering directory `/home/zaki/osmocom-bb/src/shared/libosmocore/build-host/tests/timer' make[4]: Nothing to be done for `all'. make[4]: Leaving directory `/home/zaki/osmocom-bb/src/shared/libosmocore/build-host/tests/timer' Making all in sms make[4]: Entering directory `/home/zaki/osmocom-bb/src/shared/libosmocore/build-host/tests/sms' make[4]: Nothing to be done for `all'. make[4]: Leaving directory `/home/zaki/osmocom-bb/src/shared/libosmocore/build-host/tests/sms' make[4]: Entering directory `/home/zaki/osmocom-bb/src/shared/libosmocore/build-host/tests' make[4]: Nothing to be done for `all-am'. make[4]: Leaving directory `/home/zaki/osmocom-bb/src/shared/libosmocore/build-host/tests' make[3]: Leaving directory `/home/zaki/osmocom-bb/src/shared/libosmocore/build-host/tests' make[3]: Entering directory `/home/zaki/osmocom-bb/src/shared/libosmocore/build-host' make[3]: Leaving directory `/home/zaki/osmocom-bb/src/shared/libosmocore/build-host' make[2]: Leaving directory `/home/zaki/osmocom-bb/src/shared/libosmocore/build-host' make[1]: Leaving directory `/home/zaki/osmocom-bb/src/shared/libosmocore/build-host' cd shared/libosmocore/build-target && ../configure \ --host=arm-elf-linux --disable-shared --disable-talloc --disable-tests \ CC="arm-elf-gcc" CFLAGS="-Os -ffunction-sections -I../../../../target/firmware/include" configure: WARNING: If you wanted to set the --build type, don't use --host. If a cross compiler is detected then cross compile mode will be used.
checking for a BSD-compatible install... /usr/bin/install -c checking whether build environment is sane... yes checking for a thread-safe mkdir -p... /bin/mkdir -p checking for gawk... no checking for mawk... mawk checking whether make sets $(MAKE)... yes checking for arm-elf-linux-strip... no checking for strip... strip checking whether make sets $(MAKE)... (cached) yes
checking for arm-elf-linux-gcc... arm-elf-gcc checking for C compiler default output file name... configure: error: in `/home/zaki/osmocom-bb/src/shared/libosmocore/build-target': configure: error: C compiler cannot create executables See `config.log' for more details. make: *** [shared/libosmocore/build-target/Makefile] Error 77
I shall be grateful to you if you could help me on this.
Awaiting your Response,
Zaki.