See <https://jenkins.osmocom.org/jenkins/job/master-osmo-remsim/a1=default,a2=de…>
Changes:
------------------------------------------
Started by upstream project "master-osmo-remsim" build number 3056
originally caused by:
Started by timer
Running as SYSTEM
Building remotely on build4-deb12build-ansible (ttcn3 obs osmo-gsm-tester-build qemu io_uring linux-shallow-clone osmocom-gerrit coverity osmocom-master) in workspace /home/osmocom-build/jenkins/workspace/master-osmo-remsim/a1/default/a2/default/a3/default/a4/default/label/osmocom-master
[ssh-agent] Looking for ssh-agent implementation...
$ ssh-agent
SSH_AUTH_SOCK=/tmp/ssh-9a9tUW0HvRKJ/agent.2210746
SSH_AGENT_PID=2210750
[ssh-agent] Started.
Running ssh-add (command line suppressed)
[ssh-agent] Using credentials docs (OS#5798)
The recommended git tool is: NONE
No credentials specified
Cloning the remote Git repository
Cloning repository https://gerrit.osmocom.org/osmo-remsim
> git init /home/osmocom-build/jenkins/workspace/master-osmo-remsim/a1/default/a2/default/a3/default/a4/default/label/osmocom-master # timeout=10
Fetching upstream changes from https://gerrit.osmocom.org/osmo-remsim
> git --version # timeout=10
> git --version # 'git version 2.39.5'
> git fetch --tags --force --progress -- https://gerrit.osmocom.org/osmo-remsim +refs/heads/*:refs/remotes/origin/* # timeout=10
> git config remote.origin.url https://gerrit.osmocom.org/osmo-remsim # timeout=10
> git config --add remote.origin.fetch +refs/heads/*:refs/remotes/origin/* # timeout=10
Avoid second fetch
Checking out Revision 07e504b5fa1d210b5891fbe85ffb527c1df24b18 (origin/master)
> git config core.sparsecheckout # timeout=10
> git checkout -f 07e504b5fa1d210b5891fbe85ffb527c1df24b18 # timeout=10
Commit message: "Bump version: 1.1.3 → 1.2.0"
> git rev-list --no-walk 07e504b5fa1d210b5891fbe85ffb527c1df24b18 # timeout=10
[osmocom-master] $ /bin/sh -xe /tmp/jenkins12718881483016519812.sh
+ CCACHE_DIR=/home/osmocom-build/ccache/master-builds
+ mkdir -p /home/osmocom-build/ccache/master-builds
+ chown osmocom-build:osmocom-build /home/osmocom-build/ccache/master-builds
+ readlink -f /tmp/ssh-9a9tUW0HvRKJ/agent.2210746
+ docker run --rm=true --cap-add SYS_PTRACE --security-opt seccomp=/home/osmocom-build/osmo-ci/_docker_playground/seccomp_profile.json --ulimit fsize=1000000000 -e ASCIIDOC_WARNINGS_CHECK=1 -e CFLAGS=-g -e HOME=/build -e IS_MASTER_BUILD=1 -e JOB_NAME=master-osmo-remsim/a1=default,a2=default,a3=default,a4=default,label=osmocom-master -e MAKE=make -e OSMOPY_DEBUG_TCP_SOCKETS=1 -e OSMO_GSM_MANUALS_DIR=/opt/osmo-gsm-manuals -e PARALLEL_MAKE=-j 12 -e PUBLISH=1 -e SSH_AUTH_SOCK=/ssh-agent -e WITH_MANUALS=1 -w /build -i -u build -v /tmp/ssh-9a9tUW0HvRKJ/agent.2210746:/ssh-agent -v /home/osmocom-build/osmo-ci:/osmo-ci:ro -v /home/osmocom-build/jenkins/workspace/master-osmo-remsim/a1/default/a2/default/a3/default/a4/default/label/osmocom-master:/build -v /home/osmocom-build/.ssh:/home/build/.ssh:ro -e CCACHE_DIR=/ccache -e PATH=/usr/lib/ccache:/usr/local/sbin:/usr/local/bin:/usr/sbin:/usr/bin:/sbin:/bin -v /home/osmocom-build/ccache/master-builds:/ccache osmocom-build/debian-trixie-build /usr/bin/timeout 30m /osmo-ci/scripts/wrapper_core_bt_on_error.sh /build/contrib/jenkins.sh
FATAL: command execution failed
Command Close created at
at hudson.remoting.Command.<init>(Command.java:69)
at hudson.remoting.Channel$CloseCommand.<init>(Channel.java:1424)
at hudson.remoting.Channel.close(Channel.java:1603)
at hudson.remoting.Channel.close(Channel.java:1567)
at hudson.remoting.Channel$CloseCommand.execute(Channel.java:1430)
at hudson.remoting.Channel$1.handle(Channel.java:664)
at hudson.remoting.SynchronousCommandTransport$ReaderThread.run(SynchronousCommandTransport.java:86)
Caused: hudson.remoting.Channel$OrderlyShutdown
at hudson.remoting.Channel$CloseCommand.execute(Channel.java:1431)
at hudson.remoting.Channel$1.handle(Channel.java:664)
at hudson.remoting.SynchronousCommandTransport$ReaderThread.run(SynchronousCommandTransport.java:86)
Caused: java.io.IOException: Backing channel 'build4-deb12build-ansible' is disconnected.
at hudson.remoting.RemoteInvocationHandler.channelOrFail(RemoteInvocationHandler.java:227)
at hudson.remoting.RemoteInvocationHandler.invoke(RemoteInvocationHandler.java:306)
at jdk.proxy2/jdk.proxy2.$Proxy111.isAlive(Unknown Source)
at hudson.Launcher$RemoteLauncher$ProcImpl.isAlive(Launcher.java:1227)
at hudson.Launcher$RemoteLauncher$ProcImpl.join(Launcher.java:1219)
at hudson.tasks.CommandInterpreter.join(CommandInterpreter.java:195)
at hudson.tasks.CommandInterpreter.perform(CommandInterpreter.java:145)
at hudson.tasks.CommandInterpreter.perform(CommandInterpreter.java:92)
at hudson.tasks.BuildStepMonitor$1.perform(BuildStepMonitor.java:20)
at hudson.model.AbstractBuild$AbstractBuildExecution.perform(AbstractBuild.java:817)
at hudson.model.Build$BuildExecution.build(Build.java:199)
at hudson.model.Build$BuildExecution.doRun(Build.java:164)
at hudson.model.AbstractBuild$AbstractBuildExecution.run(AbstractBuild.java:526)
at hudson.model.Run.execute(Run.java:1843)
at PluginClassLoader for matrix-project//hudson.matrix.MatrixRun.run(MatrixRun.java:153)
at hudson.model.ResourceController.execute(ResourceController.java:97)
at hudson.model.Executor.run(Executor.java:456)
FATAL: Unable to delete script file /tmp/jenkins12718881483016519812.sh
Command Close created at
at hudson.remoting.Command.<init>(Command.java:69)
at hudson.remoting.Channel$CloseCommand.<init>(Channel.java:1424)
at hudson.remoting.Channel.close(Channel.java:1603)
at hudson.remoting.Channel.close(Channel.java:1567)
at hudson.remoting.Channel$CloseCommand.execute(Channel.java:1430)
at hudson.remoting.Channel$1.handle(Channel.java:664)
at hudson.remoting.SynchronousCommandTransport$ReaderThread.run(SynchronousCommandTransport.java:86)
Caused: hudson.remoting.Channel$OrderlyShutdown
at hudson.remoting.Channel$CloseCommand.execute(Channel.java:1431)
at hudson.remoting.Channel$1.handle(Channel.java:664)
at hudson.remoting.SynchronousCommandTransport$ReaderThread.run(SynchronousCommandTransport.java:86)
Caused: hudson.remoting.ChannelClosedException: Channel "hudson.remoting.Channel@4988726b:build4-deb12build-ansible": Remote call on build4-deb12build-ansible failed. The channel is closing down or has closed down
at hudson.remoting.Channel.call(Channel.java:1101)
at hudson.FilePath.act(FilePath.java:1220)
at hudson.FilePath.act(FilePath.java:1209)
at hudson.FilePath.delete(FilePath.java:1756)
at hudson.tasks.CommandInterpreter.perform(CommandInterpreter.java:163)
at hudson.tasks.CommandInterpreter.perform(CommandInterpreter.java:92)
at hudson.tasks.BuildStepMonitor$1.perform(BuildStepMonitor.java:20)
at hudson.model.AbstractBuild$AbstractBuildExecution.perform(AbstractBuild.java:817)
at hudson.model.Build$BuildExecution.build(Build.java:199)
at hudson.model.Build$BuildExecution.doRun(Build.java:164)
at hudson.model.AbstractBuild$AbstractBuildExecution.run(AbstractBuild.java:526)
at hudson.model.Run.execute(Run.java:1843)
at PluginClassLoader for matrix-project//hudson.matrix.MatrixRun.run(MatrixRun.java:153)
at hudson.model.ResourceController.execute(ResourceController.java:97)
at hudson.model.Executor.run(Executor.java:456)
Build step 'Execute shell' marked build as failure
ERROR: Unable to tear down: Channel "hudson.remoting.Channel@4988726b:build4-deb12build-ansible": Remote call on build4-deb12build-ansible failed. The channel is closing down or has closed down
Command Close created at
at hudson.remoting.Command.<init>(Command.java:69)
at hudson.remoting.Channel$CloseCommand.<init>(Channel.java:1424)
at hudson.remoting.Channel.close(Channel.java:1603)
at hudson.remoting.Channel.close(Channel.java:1567)
at hudson.remoting.Channel$CloseCommand.execute(Channel.java:1430)
at hudson.remoting.Channel$1.handle(Channel.java:664)
at hudson.remoting.SynchronousCommandTransport$ReaderThread.run(SynchronousCommandTransport.java:86)
Caused: hudson.remoting.Channel$OrderlyShutdown
at hudson.remoting.Channel$CloseCommand.execute(Channel.java:1431)
at hudson.remoting.Channel$1.handle(Channel.java:664)
at hudson.remoting.SynchronousCommandTransport$ReaderThread.run(SynchronousCommandTransport.java:86)
Caused: hudson.remoting.ChannelClosedException: Channel "hudson.remoting.Channel@4988726b:build4-deb12build-ansible": Remote call on build4-deb12build-ansible failed. The channel is closing down or has closed down
at hudson.remoting.Channel.call(Channel.java:1101)
at hudson.Launcher$RemoteLauncher.launch(Launcher.java:1136)
at hudson.Launcher$ProcStarter.start(Launcher.java:507)
at PluginClassLoader for ssh-agent//com.cloudbees.jenkins.plugins.sshagent.exec.ExecRemoteAgent.stop(ExecRemoteAgent.java:172)
at PluginClassLoader for ssh-agent//com.cloudbees.jenkins.plugins.sshagent.SSHAgentBuildWrapper$SSHAgentEnvironment.tearDown(SSHAgentBuildWrapper.java:343)
at hudson.model.AbstractBuild$AbstractBuildExecution.tearDownBuildEnvironments(AbstractBuild.java:566)
at hudson.model.AbstractBuild$AbstractBuildExecution.run(AbstractBuild.java:530)
at hudson.model.Run.execute(Run.java:1843)
at PluginClassLoader for matrix-project//hudson.matrix.MatrixRun.run(MatrixRun.java:153)
at hudson.model.ResourceController.execute(ResourceController.java:97)
at hudson.model.Executor.run(Executor.java:456)
ERROR: Step ‘Archive the artifacts’ failed: no workspace for master-osmo-remsim/a1=default,a2=default,a3=default,a4=default,label=osmocom-master #3056
See <https://jenkins.osmocom.org/jenkins/job/master-osmo-msc/IU=--enable-iu,WITH…>
Changes:
------------------------------------------
[...truncated 253.11 KiB...]
checking the maximum length of command line arguments... 1572864
checking how to convert x86_64-pc-linux-gnu file names to x86_64-pc-linux-gnu format... func_convert_file_noop
checking how to convert x86_64-pc-linux-gnu file names to toolchain format... func_convert_file_noop
checking for /usr/bin/ld option to reload object files... -r
checking for file... file
checking for objdump... objdump
checking how to recognize dependent libraries... pass_all
checking for dlltool... no
checking how to associate runtime and link libraries... printf %s\n
checking for ranlib... ranlib
checking for ar... ar
checking for archiver @FILE support... @
checking for strip... strip
checking command to parse /usr/bin/nm -B output from gcc object... ok
checking for sysroot... no
checking for a working dd... /usr/bin/dd
checking how to truncate binary pipes... /usr/bin/dd bs=4096 count=1
checking for mt... no
checking if : is a manifest tool... no
checking for stdio.h... yes
checking for stdlib.h... yes
checking for string.h... yes
checking for inttypes.h... yes
checking for stdint.h... yes
checking for strings.h... yes
checking for sys/stat.h... yes
checking for sys/types.h... yes
checking for unistd.h... yes
checking for dlfcn.h... yes
checking for objdir... .libs
checking if gcc supports -fno-rtti -fno-exceptions... no
checking for gcc option to produce PIC... -fPIC -DPIC
checking if gcc PIC flag -fPIC -DPIC works... yes
checking if gcc static flag -static works... yes
checking if gcc supports -c -o file.o... yes
checking if gcc supports -c -o file.o... (cached) yes
checking whether the gcc linker (/usr/bin/ld -m elf_x86_64) supports shared libraries... yes
checking whether -lc should be explicitly linked in... no
checking dynamic linker characteristics... GNU/Linux ld.so
checking how to hardcode library paths into programs... immediate
checking whether stripping libraries is possible... yes
checking if libtool supports shared libraries... yes
checking whether to build shared libraries... yes
checking whether to build static libraries... yes
checking for pkg-config... /usr/bin/pkg-config
checking pkg-config is at least version 0.9.0... yes
checking for talloc... yes
checking if gcc supports -fvisibility=hidden... yes
CFLAGS="-g"
CPPFLAGS=""
checking that generated files are newer than configure... done
configure: creating ./config.status
config.status: creating libasn1c.pc
config.status: creating src/Makefile
config.status: creating include/Makefile
config.status: creating include/asn1c/Makefile
config.status: creating Makefile
config.status: executing depfiles commands
config.status: executing libtool commands
configure: WARNING: unrecognized options: --with-systemdsystemunitdir
+ [ -n ]
+ make -j 12 install
Making install in src
make[1]: Entering directory '/build/deps/libasn1c/src'
CC ANY.lo
CC constraints.lo
CC GeneralizedTime.lo
CC NumericString.lo
CC T61String.lo
CC asn_codecs_prim.lo
CC constr_CHOICE.lo
CC GeneralString.lo
CC ObjectDescriptor.lo
CC TeletexString.lo
CC asn_SEQUENCE_OF.lo
CC constr_SEQUENCE.lo
CC GraphicString.lo
CC OBJECT_IDENTIFIER.lo
CC UniversalString.lo
CC asn_SET_OF.lo
CC constr_SEQUENCE_OF.lo
CC IA5String.lo
CC OCTET_STRING.lo
CC UTCTime.lo
CC ber_decoder.lo
CC constr_SET.lo
CC INTEGER.lo
CC per_decoder.lo
CC UTF8String.lo
CC ber_tlv_length.lo
CC constr_SET_OF.lo
CC ISO646String.lo
CC per_encoder.lo
CC VideotexString.lo
CC ber_tlv_tag.lo
CC constr_TYPE.lo
CC NativeEnumerated.lo
CC per_support.lo
CC VisibleString.lo
CC BIT_STRING.lo
CC NativeInteger.lo
CC PrintableString.lo
CC xer_decoder.lo
CC BMPString.lo
CC der_encoder.lo
CC NativeReal.lo
CC REAL.lo
CC xer_encoder.lo
CC BOOLEAN.lo
CC NULL.lo
CC ENUMERATED.lo
CC RELATIVE-OID.lo
CC xer_support.lo
CC per_opentype.lo
CC asn1helpers.lo
CCLD libasn1c.la
make[2]: Entering directory '/build/deps/libasn1c/src'
make[2]: Nothing to be done for 'install-data-am'.
/usr/bin/mkdir -p '/build/deps/install/stow/libasn1c/lib'
/bin/bash ../libtool --mode=install /usr/bin/install -c libasn1c.la '/build/deps/install/stow/libasn1c/lib'
libtool: install: /usr/bin/install -c .libs/libasn1c.so.1.0.2 /build/deps/install/stow/libasn1c/lib/libasn1c.so.1.0.2
libtool: install: (cd /build/deps/install/stow/libasn1c/lib && { ln -s -f libasn1c.so.1.0.2 libasn1c.so.1 || { rm -f libasn1c.so.1 && ln -s libasn1c.so.1.0.2 libasn1c.so.1; }; })
libtool: install: (cd /build/deps/install/stow/libasn1c/lib && { ln -s -f libasn1c.so.1.0.2 libasn1c.so || { rm -f libasn1c.so && ln -s libasn1c.so.1.0.2 libasn1c.so; }; })
libtool: install: /usr/bin/install -c .libs/libasn1c.lai /build/deps/install/stow/libasn1c/lib/libasn1c.la
libtool: install: /usr/bin/install -c .libs/libasn1c.a /build/deps/install/stow/libasn1c/lib/libasn1c.a
libtool: install: chmod 644 /build/deps/install/stow/libasn1c/lib/libasn1c.a
libtool: install: ranlib /build/deps/install/stow/libasn1c/lib/libasn1c.a
libtool: finish: PATH="/build/deps/install/bin:/usr/lib/ccache:/usr/local/sbin:/usr/local/bin:/usr/sbin:/usr/bin:/sbin:/bin:/sbin" ldconfig -n /build/deps/install/stow/libasn1c/lib
----------------------------------------------------------------------
Libraries have been installed in:
/build/deps/install/stow/libasn1c/lib
If you ever happen to want to link against installed libraries
in a given directory, LIBDIR, you must either use libtool, and
specify the full pathname of the library, or use the '-LLIBDIR'
flag during linking and do at least one of the following:
- add LIBDIR to the 'LD_LIBRARY_PATH' environment variable
during execution
- add LIBDIR to the 'LD_RUN_PATH' environment variable
during linking
- use the '-Wl,-rpath -Wl,LIBDIR' linker flag
- have your system administrator add LIBDIR to '/etc/ld.so.conf'
See any operating system documentation about shared libraries for
more information, such as the ld(1) and ld.so(8) manual pages.
----------------------------------------------------------------------
make[2]: Leaving directory '/build/deps/libasn1c/src'
make[1]: Leaving directory '/build/deps/libasn1c/src'
Making install in include
make[1]: Entering directory '/build/deps/libasn1c/include'
Making install in asn1c
make[2]: Entering directory '/build/deps/libasn1c/include/asn1c'
make[3]: Entering directory '/build/deps/libasn1c/include/asn1c'
make[3]: Nothing to be done for 'install-exec-am'.
/usr/bin/mkdir -p '/build/deps/install/stow/libasn1c/include/asn1c'
/usr/bin/install -c -m 644 ANY.h asn_application.h asn_codecs.h asn_codecs_prim.h asn_internal.h asn_SEQUENCE_OF.h asn_SET_OF.h asn_system.h ber_decoder.h ber_tlv_length.h ber_tlv_tag.h BIT_STRING.h BMPString.h BOOLEAN.h constraints.h constr_CHOICE.h constr_SEQUENCE.h constr_SEQUENCE_OF.h constr_SET.h constr_SET_OF.h constr_TYPE.h der_encoder.h ENUMERATED.h GeneralizedTime.h GeneralString.h GraphicString.h IA5String.h INTEGER.h ISO646String.h NativeEnumerated.h NativeInteger.h NativeReal.h NULL.h NumericString.h ObjectDescriptor.h OBJECT_IDENTIFIER.h OCTET_STRING.h per_decoder.h per_encoder.h per_support.h '/build/deps/install/stow/libasn1c/include/asn1c'
/usr/bin/install -c -m 644 PrintableString.h REAL.h RELATIVE-OID.h T61String.h TeletexString.h UniversalString.h UTCTime.h UTF8String.h VideotexString.h VisibleString.h xer_decoder.h xer_encoder.h xer_support.h per_opentype.h asn1helpers.h '/build/deps/install/stow/libasn1c/include/asn1c'
make[3]: Leaving directory '/build/deps/libasn1c/include/asn1c'
make[2]: Leaving directory '/build/deps/libasn1c/include/asn1c'
make[2]: Entering directory '/build/deps/libasn1c/include'
make[3]: Entering directory '/build/deps/libasn1c/include'
make[3]: Nothing to be done for 'install-exec-am'.
make[3]: Nothing to be done for 'install-data-am'.
make[3]: Leaving directory '/build/deps/libasn1c/include'
make[2]: Leaving directory '/build/deps/libasn1c/include'
make[1]: Leaving directory '/build/deps/libasn1c/include'
make[1]: Entering directory '/build/deps/libasn1c'
make[2]: Entering directory '/build/deps/libasn1c'
make[2]: Nothing to be done for 'install-exec-am'.
/usr/bin/mkdir -p '/build/deps/install/stow/libasn1c/lib/pkgconfig'
/usr/bin/install -c -m 644 libasn1c.pc '/build/deps/install/stow/libasn1c/lib/pkgconfig'
make[2]: Leaving directory '/build/deps/libasn1c'
make[1]: Leaving directory '/build/deps/libasn1c'
+ STOW_DIR=/build/deps/install/stow stow --restow libasn1c
+ osmo-build-dep.sh osmo-iuh
=============================== osmo-iuh ===============================
+ mkdir -p /build/deps
+ cd /build/deps
+ osmo-deps.sh osmo-iuh
+ project=osmo-iuh
+ branch=master
+ git branch -a
+ grep -c remotes/origin/master$
+ [ x1 != x0 ]
+ branch=origin/master
+ test -d osmo-iuh
+ osmo_git_clone_url osmo-iuh
+ echo https://gerrit.osmocom.org/osmo-iuh
+ git clone https://gerrit.osmocom.org/osmo-iuh osmo-iuh
Cloning into 'osmo-iuh'...
+ cd osmo-iuh
+ git fetch --tags origin
+ git fetch origin
+ deps= osmo-clean-workspace.sh
+ chmod -R +w .
+ git checkout -f HEAD
Your branch is up to date with 'origin/master'.
+ git clean -dxf
+ [ -d ]
+ [ -d layer1-headers ]
+ git checkout -f origin/master
Note: switching to 'origin/master'.
You are in 'detached HEAD' state. You can look around, make experimental
changes and commit them, and you can discard any commits you make in this
state without impacting any branches by switching back to a branch.
If you want to create a new branch to retain commits you create, you may
do so (now or later) by using -c with the switch command. Example:
git switch -c <new-branch-name>
Or undo this operation with:
git switch -
Turn off this advice by setting config variable advice.detachedHead to false
HEAD is now at aee3ce7 ranap: Introduce new APIs to encode rab_ass for gtp and rtp
+ git rev-parse HEAD
aee3ce7df037a2978738b87519114d0321c0f2b6
+ cd osmo-iuh
+ mkdir -p /build/deps/install/stow
+ osmo_source_subdir osmo-iuh
+ subdir=
+ [ -n ]
+ autoreconf --install --force
aclocal: warning: couldn't open directory 'm4': No such file or directory
libtoolize: putting auxiliary files in AC_CONFIG_AUX_DIR, '.'.
libtoolize: copying file './ltmain.sh'
libtoolize: putting macros in AC_CONFIG_MACRO_DIRS, 'm4'.
libtoolize: copying file 'm4/libtool.m4'
libtoolize: error: copying '/usr/share/aclocal/ltoptions.m4' to 'm4/' failed
libtoolize: error: copying '/usr/share/aclocal/ltsugar.m4' to 'm4/' failed
libtoolize: error: copying '/usr/share/aclocal/ltversion.m4' to 'm4/' failed
libtoolize: error: copying '/usr/share/aclocal/lt~obsolete.m4' to 'm4/' failed
libtoolize: Consider adding '-I m4' to ACLOCAL_AMFLAGS in Makefile.am.
autoreconf: error: libtoolize failed with exit status: 1
Build step 'Execute shell' marked build as failure
$ ssh-agent -k
unset SSH_AUTH_SOCK;
unset SSH_AGENT_PID;
echo Agent pid 3311842 killed;
[ssh-agent] Stopped.
Archiving artifacts
See <https://jenkins.osmocom.org/jenkins/job/master-osmo-iuh/a1=default,a2=defau…>
Changes:
------------------------------------------
[...truncated 429.61 KiB...]
Compiled SABP_Kill-Failure.c
Compiled SABP_Kill-Failure.h
Compiled SABP_Load-Query.c
Compiled SABP_Load-Query.h
Compiled SABP_Load-Query-Complete.c
Compiled SABP_Load-Query-Complete.h
Compiled SABP_Load-Query-Failure.c
Compiled SABP_Load-Query-Failure.h
Compiled SABP_Message-Status-Query.c
Compiled SABP_Message-Status-Query.h
Compiled SABP_Message-Status-Query-Complete.c
Compiled SABP_Message-Status-Query-Complete.h
Compiled SABP_Message-Status-Query-Failure.c
Compiled SABP_Message-Status-Query-Failure.h
Compiled SABP_Reset.c
Compiled SABP_Reset.h
Compiled SABP_Reset-Complete.c
Compiled SABP_Reset-Complete.h
Compiled SABP_Reset-Failure.c
Compiled SABP_Reset-Failure.h
Compiled SABP_Restart.c
Compiled SABP_Restart.h
Compiled SABP_Failure.c
Compiled SABP_Failure.h
Compiled SABP_Error-Indication.c
Compiled SABP_Error-Indication.h
Compiled SABP_IE.c
Compiled SABP_IE.h
sed -i '/#include "SABP_Serial-Number.h"/a #include <constr_CHOICE.h>' SABP_Old-Serial-Number.h SABP_New-Serial-Number.h
../../move-asn1-header-files.sh osmocom/sabp SABP_InitiatingMessage.h SABP_SABP-PDU.h SABP_SuccessfulOutcome.h SABP_UnsuccessfulOutcome.h SABP_Criticality.h SABP_Presence.h SABP_ProcedureCode.h SABP_ProtocolExtensionID.h SABP_ProtocolIE-ID.h SABP_TriggeringMessage.h SABP_IE-Extensions.h SABP_Available-Bandwidth.h SABP_Broadcast-Message-Content.h SABP_Broadcast-Message-Content-Validity-Indicator.h SABP_Category.h SABP_Cause.h SABP_Criticality-Diagnostics.h SABP_CriticalityDiagnostics-IE-List.h SABP_CriticalityDiagnostics-IE-List-Value.h SABP_MessageStructure.h SABP_MessageStructure-Value.h SABP_Data-Coding-Scheme.h SABP_Failure-List.h SABP_Failure-List-Item.h SABP_Message-Identifier.h SABP_New-Serial-Number.h SABP_Number-of-Broadcasts-Completed-List.h SABP_Number-of-Broadcasts-Completed-List-Item.h SABP_Number-Of-Broadcasts-Completed-Info.h SABP_Number-of-Broadcasts-Requested.h SABP_Old-Serial-Number.h SABP_Paging-ETWS-Indicator.h SABP_Radio-Resource-Loading-List.h SABP_Radio-Resource-Loading-List-Item.h SABP_Recovery-Indication.h SABP_RepetitionNumber0.h SABP_RepetitionNumber1.h SABP_Repetition-Period.h SABP_Serial-Number.h SABP_Service-Area-Identifier.h SABP_Service-Areas-List.h SABP_TypeOfError.h SABP_WarningSecurityInfo.h SABP_Warning-Type.h SABP_Write-Replace.h SABP_Write-Replace-Complete.h SABP_Write-Replace-Failure.h SABP_Kill.h SABP_Kill-Complete.h SABP_Kill-Failure.h SABP_Load-Query.h SABP_Load-Query-Complete.h SABP_Load-Query-Failure.h SABP_Message-Status-Query.h SABP_Message-Status-Query-Complete.h SABP_Message-Status-Query-Failure.h SABP_Reset.h SABP_Reset-Complete.h SABP_Reset-Failure.h SABP_Restart.h SABP_Failure.h SABP_Error-Indication.h SABP_IE.h
/build/src/sabp/*.h --> ../../include/osmocom/sabp
collecting sed commands...
sed -i -f "/tmp/tmp.MM1HG3Jd6u" *.[hc]
mv SABP_InitiatingMessage.h SABP_SABP-PDU.h SABP_SuccessfulOutcome.h SABP_UnsuccessfulOutcome.h SABP_Criticality.h SABP_Presence.h SABP_ProcedureCode.h SABP_ProtocolExtensionID.h SABP_ProtocolIE-ID.h SABP_TriggeringMessage.h SABP_IE-Extensions.h SABP_Available-Bandwidth.h SABP_Broadcast-Message-Content.h SABP_Broadcast-Message-Content-Validity-Indicator.h SABP_Category.h SABP_Cause.h SABP_Criticality-Diagnostics.h SABP_CriticalityDiagnostics-IE-List.h SABP_CriticalityDiagnostics-IE-List-Value.h SABP_MessageStructure.h SABP_MessageStructure-Value.h SABP_Data-Coding-Scheme.h SABP_Failure-List.h SABP_Failure-List-Item.h SABP_Message-Identifier.h SABP_New-Serial-Number.h SABP_Number-of-Broadcasts-Completed-List.h SABP_Number-of-Broadcasts-Completed-List-Item.h SABP_Number-Of-Broadcasts-Completed-Info.h SABP_Number-of-Broadcasts-Requested.h SABP_Old-Serial-Number.h SABP_Paging-ETWS-Indicator.h SABP_Radio-Resource-Loading-List.h SABP_Radio-Resource-Loading-List-Item.h SABP_Recovery-Indication.h SABP_RepetitionNumber0.h SABP_RepetitionNumber1.h SABP_Repetition-Period.h SABP_Serial-Number.h SABP_Service-Area-Identifier.h SABP_Service-Areas-List.h SABP_TypeOfError.h SABP_WarningSecurityInfo.h SABP_Warning-Type.h SABP_Write-Replace.h SABP_Write-Replace-Complete.h SABP_Write-Replace-Failure.h SABP_Kill.h SABP_Kill-Complete.h SABP_Kill-Failure.h SABP_Load-Query.h SABP_Load-Query-Complete.h SABP_Load-Query-Failure.h SABP_Message-Status-Query.h SABP_Message-Status-Query-Complete.h SABP_Message-Status-Query-Failure.h SABP_Reset.h SABP_Reset-Complete.h SABP_Reset-Failure.h SABP_Restart.h SABP_Failure.h SABP_Error-Indication.h SABP_IE.h ../../include/osmocom/sabp/
if test "/build/src/sabp" != "/build/src/sabp"; then \
cp *.c ../../src/sabp/; \
fi
make[1]: Leaving directory '/build/src/sabp'
make: Leaving directory '/build/src'
+ sleep 1
+ git status
HEAD detached at aee3ce7
Untracked files:
(use "git add <file>..." to include in what will be committed)
deps/
nothing added to commit but untracked files present (use "git add" to track)
+ git diff
+ cat
+ git diff-files --quiet
+ make -j 12
echo 1.8.0.4-aee3 > .version-t && mv .version-t .version
make all-recursive
make[1]: Entering directory '/build'
Making all in src
make[2]: Entering directory '/build/src'
../asn1/utils/asn1tostruct.py -p HNBAP_ -f ../asn1/hnbap/HNBAP-PDU-Contents.asn
../asn1/utils/asn1tostruct.py -p RUA_ -f ../asn1/rua/RUA-PDU-Contents.asn
../asn1/utils/asn1tostruct.py -p SABP_ -f ../asn1/sabp/SABP-PDU-Contents.asn
../asn1/utils/asn1tostruct.py -p RANAP_ -f ../asn1/ranap/RANAP-PDU-Contents.asn
/build/src/../asn1/utils/asn1tostruct.py:37: DeprecationWarning: datetime.datetime.utcfromtimestamp() is deprecated and scheduled for removal in a future version. Use timezone-aware objects to represent datetimes in UTC: datetime.datetime.fromtimestamp(timestamp, datetime.UTC).
now = datetime.datetime.utcfromtimestamp(int(os.environ.get('SOURCE_DATE_EPOCH', time.time())))
[93mDidn't find any information element for message: PrivateMessage-IEs[0m
/build/src/../asn1/utils/asn1tostruct.py:37: DeprecationWarning: datetime.datetime.utcfromtimestamp() is deprecated and scheduled for removal in a future version. Use timezone-aware objects to represent datetimes in UTC: datetime.datetime.fromtimestamp(timestamp, datetime.UTC).
now = datetime.datetime.utcfromtimestamp(int(os.environ.get('SOURCE_DATE_EPOCH', time.time())))
sed -i 's,^#include "rua_ies_defs.h",#include <osmocom/rua/rua_ies_defs.h>,' rua_encoder.c rua_decoder.c
sed -i 's,^#include "rua_common.h",#include <osmocom/rua/rua_common.h>,' rua_encoder.c rua_decoder.c rua_ies_defs.h
/build/src/../asn1/utils/asn1tostruct.py:37: DeprecationWarning: datetime.datetime.utcfromtimestamp() is deprecated and scheduled for removal in a future version. Use timezone-aware objects to represent datetimes in UTC: datetime.datetime.fromtimestamp(timestamp, datetime.UTC).
now = datetime.datetime.utcfromtimestamp(int(os.environ.get('SOURCE_DATE_EPOCH', time.time())))
[93mDidn't find any information element for message: PrivateMessage-IEs[0m
mv rua_ies_defs.h ../include/osmocom/rua/
touch ../src/gen_rua.stamp
sed -i 's,^#include "hnbap_ies_defs.h",#include <osmocom/hnbap/hnbap_ies_defs.h>,' hnbap_encoder.c hnbap_decoder.c
sed -i 's,^#include "hnbap_common.h",#include <osmocom/hnbap/hnbap_common.h>,' hnbap_encoder.c hnbap_decoder.c hnbap_ies_defs.h
sed -i 's,^#include "sabp_ies_defs.h",#include <osmocom/sabp/sabp_ies_defs.h>,' sabp_encoder.c sabp_decoder.c
mv hnbap_ies_defs.h ../include/osmocom/hnbap/
sed -i 's,^#include "sabp_common.h",#include <osmocom/sabp/sabp_common.h>,' sabp_encoder.c sabp_decoder.c sabp_ies_defs.h
touch ../src/gen_hnbap.stamp
mv sabp_ies_defs.h ../include/osmocom/sabp/
touch ../src/gen_sabp.stamp
/build/src/../asn1/utils/asn1tostruct.py:37: DeprecationWarning: datetime.datetime.utcfromtimestamp() is deprecated and scheduled for removal in a future version. Use timezone-aware objects to represent datetimes in UTC: datetime.datetime.fromtimestamp(timestamp, datetime.UTC).
now = datetime.datetime.utcfromtimestamp(int(os.environ.get('SOURCE_DATE_EPOCH', time.time())))
[93mDidn't find any information element for message: RelocationDetectIEs[0m
[93mDidn't find any information element for message: RelocationCompleteIEs[0m
[93mDidn't find any information element for message: RAB-SetupOrModifyItem-IEs[0m
[93mDidn't find any information element for message: PrivateMessage-IEs[0m
[93mDidn't find any information element for message: DirectTransferInformationItemIEs-RANAP-RelocInf[0m
[93mDidn't find any information element for message: SRVCC-CSKeysRequestIEs[0m
[93mDidn't find any information element for message: UeRadioCapabilityMatchRequestIEs[0m
sed -i 's,^#include "ranap_ies_defs.h",#include <osmocom/ranap/ranap_ies_defs.h>,' ranap_encoder.c ranap_decoder.c
sed -i 's,^#include "ranap_common.h",#include <osmocom/ranap/ranap_common.h>,' ranap_encoder.c ranap_decoder.c ranap_ies_defs.h
mv ranap_ies_defs.h ../include/osmocom/ranap/
touch ../src/gen_ranap.stamp
make all-recursive
make[3]: Entering directory '/build/src'
Making all in hnbap
make[4]: Entering directory '/build/src/hnbap'
CC HNBAP_Presence.lo
CC HNBAP_Criticality.lo
CC HNBAP_PrivateIE-ID.lo
CC HNBAP_ProcedureCode.lo
CC HNBAP_ProtocolIE-ID.lo
CC HNBAP_TriggeringMessage.lo
CC HNBAP_IE-Extensions.lo
CC HNBAP_Access-stratum-release-indicator.lo
CC HNBAP_AccessResult.lo
CC HNBAP_AltitudeAndDirection.lo
CC HNBAP_BackoffTimer.lo
CC HNBAP_BindingID.lo
CC HNBAP_Cause.lo
CC HNBAP_CauseRadioNetwork.lo
CC HNBAP_CauseTransport.lo
CC HNBAP_CauseProtocol.lo
CC HNBAP_CauseMisc.lo
CC HNBAP_CellIdentity.lo
CC HNBAP_CELL-FACHMobilitySupport.lo
CC HNBAP_Context-ID.lo
CC HNBAP_CriticalityDiagnostics.lo
CC HNBAP_CriticalityDiagnostics-IE-List.lo
CC HNBAP_CriticalityDiagnostics-IE-List-Value.lo
CC HNBAP_CSG-ID.lo
CC HNBAP_CSG-Capability.lo
CC HNBAP_CSGMembershipStatus.lo
CC HNBAP_CGI.lo
CC HNBAP_CI.lo
CC HNBAP_CN-DomainIndicator.lo
CC HNBAP_ESN.lo
CC HNBAP_GeographicalLocation.lo
CC HNBAP_GeographicalCoordinates.lo
CC HNBAP_GTP-TEI.lo
CC HNBAP_HNBCapacity.lo
CC HNBAP_HNB-Cell-Access-Mode.lo
CC HNBAP_HNB-Cell-Identifier.lo
CC HNBAP_HNB-GWResponse.lo
CC HNBAP_HNB-RNL-Identity.lo
CC HNBAP_HNBConfigInfo.lo
CC HNBAP_ConfigurationInformation.lo
CC HNBAP_HNBConfigurationInformationProvided.lo
CC HNBAP_HNBConfigurationInformationMissing.lo
CC HNBAP_HNB-Location-Information.lo
CC HNBAP_HNB-Identity.lo
CC HNBAP_HNB-Identity-Info.lo
CC HNBAP_IMEI.lo
CC HNBAP_IMSI.lo
CC HNBAP_IMSIDS41.lo
CC HNBAP_IMSIESN.lo
CC HNBAP_IP-Address.lo
CC HNBAP_Ipv4Address.lo
CC HNBAP_Ipv6Address.lo
CC HNBAP_Iurh-Signalling-TNL-AddressList.lo
CC HNBAP_LAC.lo
CC HNBAP_LAI.lo
CC HNBAP_MacroCoverageInformation.lo
CC HNBAP_MacroCellID.lo
CC HNBAP_MuxPortNumber.lo
CC HNBAP_NeighbourCellIdentityList.lo
CC HNBAP_NeighbourIdentity.lo
CC HNBAP_NeighbourInfoList.lo
CC HNBAP_AdditionalNeighbourInfoList.lo
CC HNBAP_NeighbourInfoRequestList.lo
CC HNBAP_NeighbourInfoRequestItem.lo
CC HNBAP_PLMNidentity.lo
CC HNBAP_PSC.lo
CC HNBAP_PTMSI.lo
CC HNBAP_PTMSIRAI.lo
CC HNBAP_RAB-ID.lo
CC HNBAP_RABList.lo
CC HNBAP_RABListItem.lo
CC HNBAP_RAC.lo
CC HNBAP_RAI.lo
CC HNBAP_Registration-Cause.lo
CC HNBAP_RNC-ID.lo
CC HNBAP_SAC.lo
CC HNBAP_S-RNTIPrefix.lo
CC HNBAP_TMSILAI.lo
CC HNBAP_TMSIDS41.lo
CC HNBAP_TransportInfo.lo
cat: write error: No space left on device
CC HNBAP_TransportLayerAddress.lo
cat: write error: No space left on device
CC HNBAP_Tunnel-Information.lo
HNBAP_RAI.c:71:1: fatal error: closing dependency file .deps/HNBAP_RAI.Tpo: No space left on device
71 | };
| ^
compilation terminated.
HNBAP_TMSILAI.c:107:1: fatal error: closing dependency file .deps/HNBAP_TMSILAI.Tpo: No space left on device
107 | };
| ^
compilation terminated.
make[4]: *** [Makefile:906: HNBAP_RAI.lo] Error 1
make[4]: *** Waiting for unfinished jobs....
make[4]: *** [Makefile:906: HNBAP_TMSILAI.lo] Error 1
HNBAP_TransportInfo.c:148:1: fatal error: closing dependency file .deps/HNBAP_TransportInfo.Tpo: No space left on device
148 | };
| ^
compilation terminated.
make[4]: *** [Makefile:906: HNBAP_TransportInfo.lo] Error 1
HNBAP_TMSIDS41.c:166:1: fatal error: closing dependency file .deps/HNBAP_TMSIDS41.Tpo: No space left on device
166 | };
| ^
compilation terminated.
HNBAP_RNC-ID.c:165:1: fatal error: closing dependency file .deps/HNBAP_RNC-ID.Tpo: No space left on device
165 | };
| ^
compilation terminated.
make[4]: *** [Makefile:906: HNBAP_RNC-ID.lo] Error 1
make[4]: *** [Makefile:906: HNBAP_TMSIDS41.lo] Error 1
HNBAP_Registration-Cause.c:169:1: fatal error: closing dependency file .deps/HNBAP_Registration-Cause.Tpo: No space left on device
169 | };
| ^
compilation terminated.
HNBAP_S-RNTIPrefix.c:171:1: fatal error: closing dependency file .deps/HNBAP_S-RNTIPrefix.Tpo: No space left on device
171 | };
| ^
compilation terminated.
make[4]: *** [Makefile:906: HNBAP_Registration-Cause.lo] Error 1
make[4]: *** [Makefile:906: HNBAP_S-RNTIPrefix.lo] Error 1
make[4]: *** [Makefile:906: HNBAP_PTMSI.lo] Error 1
HNBAP_SAC.c:166:1: fatal error: closing dependency file .deps/HNBAP_SAC.Tpo: No space left on device
166 | };
| ^
compilation terminated.
make[4]: *** [Makefile:906: HNBAP_SAC.lo] Error 1
HNBAP_TransportLayerAddress.c:171:1: fatal error: closing dependency file .deps/HNBAP_TransportLayerAddress.Tpo: No space left on device
171 | };
| ^
compilation terminated.
make[4]: *** [Makefile:906: HNBAP_TransportLayerAddress.lo] Error 1
HNBAP_Tunnel-Information.c:83:1: fatal error: closing dependency file .deps/HNBAP_Tunnel-Information.Tpo: No space left on device
83 | };
| ^
compilation terminated.
make[4]: *** [Makefile:906: HNBAP_Tunnel-Information.lo] Error 1
make[4]: *** [Makefile:906: HNBAP_RAC.lo] Error 1
make[4]: Leaving directory '/build/src/hnbap'
make[3]: *** [Makefile:642: all-recursive] Error 1
make[3]: Leaving directory '/build/src'
make[2]: *** [Makefile:497: all] Error 2
make[2]: Leaving directory '/build/src'
make[1]: *** [Makefile:477: all-recursive] Error 1
make[1]: Leaving directory '/build'
make: *** [Makefile:395: all] Error 2
Build step 'Execute shell' marked build as failure
$ ssh-agent -k
unset SSH_AUTH_SOCK;
unset SSH_AGENT_PID;
echo Agent pid 3311968 killed;
[ssh-agent] Stopped.
Archiving artifacts