See <https://jenkins.osmocom.org/jenkins/job/master-osmo-msc/IU=--disable-iu,WIT…>
Changes:
------------------------------------------
[...truncated 262.87 KiB...]
CC transaction_cc.o
CC msc_net_init.o
CC ctrl_commands.o
CC sgs_iface.o
CC sgs_server.o
CC sgs_vty.o
CC asci_gcr.o
CC asci_vty.o
AR libmsc.a
make[3]: Leaving directory '/build/src/libmsc'
Making all in libsmpputil
make[3]: Entering directory '/build/src/libsmpputil'
CC smpp_utils.o
CC smpp_vty.o
CC smpp_msc.o
CC smpp_smsc.o
smpp_msc.c: In function 'submit_to_sms':
smpp_msc.c:213:2: warning: #warning Implement reply path [-Wcpp]
213 | #warning Implement reply path
| ^~~~~~~
AR libsmpputil.a
make[3]: Leaving directory '/build/src/libsmpputil'
Making all in utils
make[3]: Entering directory '/build/src/utils'
CC smpp_mirror-smpp_mirror.o
CCLD smpp_mirror
make[3]: Leaving directory '/build/src/utils'
Making all in osmo-msc
make[3]: Entering directory '/build/src/osmo-msc'
CC msc_main.o
CCLD osmo-msc
make[3]: Leaving directory '/build/src/osmo-msc'
make[3]: Entering directory '/build/src'
make[3]: Nothing to be done for 'all-am'.
make[3]: Leaving directory '/build/src'
make[2]: Leaving directory '/build/src'
Making all in doc
make[2]: Entering directory '/build/doc'
Making all in examples
make[3]: Entering directory '/build/doc/examples'
make[3]: Nothing to be done for 'all'.
make[3]: Leaving directory '/build/doc/examples'
Making all in manuals
make[3]: Entering directory '/build/doc/manuals'
make[3]: Nothing to be done for 'all'.
make[3]: Leaving directory '/build/doc/manuals'
Making all in sequence_charts
make[3]: Entering directory '/build/doc/sequence_charts'
echo "built only on manual invocation, needs mscgen and dot (graphviz) programs: invoke 'make charts'"
built only on manual invocation, needs mscgen and dot (graphviz) programs: invoke 'make charts'
make[3]: Leaving directory '/build/doc/sequence_charts'
make[3]: Entering directory '/build/doc'
make[3]: Nothing to be done for 'all-am'.
make[3]: Leaving directory '/build/doc'
make[2]: Leaving directory '/build/doc'
Making all in contrib
make[2]: Entering directory '/build/contrib'
Making all in systemd
make[3]: Entering directory '/build/contrib/systemd'
make[3]: Nothing to be done for 'all'.
make[3]: Leaving directory '/build/contrib/systemd'
make[3]: Entering directory '/build/contrib'
make[3]: Nothing to be done for 'all-am'.
make[3]: Leaving directory '/build/contrib'
make[2]: Leaving directory '/build/contrib'
Making all in tests
make[2]: Entering directory '/build/tests'
Making all in sms_queue
make[3]: Entering directory '/build/tests/sms_queue'
make[3]: Nothing to be done for 'all'.
make[3]: Leaving directory '/build/tests/sms_queue'
Making all in msc_vlr
make[3]: Entering directory '/build/tests/msc_vlr'
make[3]: Nothing to be done for 'all'.
make[3]: Leaving directory '/build/tests/msc_vlr'
Making all in db_sms
make[3]: Entering directory '/build/tests/db_sms'
make[3]: Nothing to be done for 'all'.
make[3]: Leaving directory '/build/tests/db_sms'
Making all in sdp_msg
make[3]: Entering directory '/build/tests/sdp_msg'
make[3]: Nothing to be done for 'all'.
make[3]: Leaving directory '/build/tests/sdp_msg'
Making all in mncc
make[3]: Entering directory '/build/tests/mncc'
make[3]: Nothing to be done for 'all'.
make[3]: Leaving directory '/build/tests/mncc'
Making all in csd
make[3]: Entering directory '/build/tests/csd'
make[3]: Nothing to be done for 'all'.
make[3]: Leaving directory '/build/tests/csd'
Making all in smpp
make[3]: Entering directory '/build/tests/smpp'
make[3]: Nothing to be done for 'all'.
make[3]: Leaving directory '/build/tests/smpp'
make[3]: Entering directory '/build/tests'
make[3]: Nothing to be done for 'all-am'.
make[3]: Leaving directory '/build/tests'
make[2]: Leaving directory '/build/tests'
make[2]: Entering directory '/build'
make[2]: Leaving directory '/build'
make[1]: Leaving directory '/build'
+ LD_LIBRARY_PATH=/build/deps/install/lib
+ make check
make check-recursive
make[1]: Entering directory '/build'
Making check in include
make[2]: Entering directory '/build/include'
Making check in osmocom
make[3]: Entering directory '/build/include/osmocom'
Making check in msc
make[4]: Entering directory '/build/include/osmocom/msc'
make[4]: Nothing to be done for 'check'.
make[4]: Leaving directory '/build/include/osmocom/msc'
Making check in smpp
make[4]: Entering directory '/build/include/osmocom/smpp'
make[4]: Nothing to be done for 'check'.
make[4]: Leaving directory '/build/include/osmocom/smpp'
Making check in vlr
make[4]: Entering directory '/build/include/osmocom/vlr'
make[4]: Nothing to be done for 'check'.
make[4]: Leaving directory '/build/include/osmocom/vlr'
make[4]: Entering directory '/build/include/osmocom'
make[4]: Nothing to be done for 'check-am'.
make[4]: Leaving directory '/build/include/osmocom'
make[3]: Leaving directory '/build/include/osmocom'
make[3]: Entering directory '/build/include'
make[3]: Nothing to be done for 'check-am'.
make[3]: Leaving directory '/build/include'
make[2]: Leaving directory '/build/include'
Making check in src
make[2]: Entering directory '/build/src'
Making check in libvlr
make[3]: Entering directory '/build/src/libvlr'
make[3]: Nothing to be done for 'check'.
make[3]: Leaving directory '/build/src/libvlr'
Making check in libmsc
make[3]: Entering directory '/build/src/libmsc'
make[3]: Nothing to be done for 'check'.
make[3]: Leaving directory '/build/src/libmsc'
Making check in libsmpputil
make[3]: Entering directory '/build/src/libsmpputil'
make[3]: Nothing to be done for 'check'.
make[3]: Leaving directory '/build/src/libsmpputil'
Making check in utils
make[3]: Entering directory '/build/src/utils'
make[3]: Nothing to be done for 'check'.
make[3]: Leaving directory '/build/src/utils'
Making check in osmo-msc
make[3]: Entering directory '/build/src/osmo-msc'
make[3]: Nothing to be done for 'check'.
make[3]: Leaving directory '/build/src/osmo-msc'
make[3]: Entering directory '/build/src'
make[3]: Nothing to be done for 'check-am'.
make[3]: Leaving directory '/build/src'
make[2]: Leaving directory '/build/src'
Making check in doc
make[2]: Entering directory '/build/doc'
Making check in examples
make[3]: Entering directory '/build/doc/examples'
make[3]: Nothing to be done for 'check'.
make[3]: Leaving directory '/build/doc/examples'
Making check in manuals
make[3]: Entering directory '/build/doc/manuals'
make[3]: Nothing to be done for 'check'.
make[3]: Leaving directory '/build/doc/manuals'
Making check in sequence_charts
make[3]: Entering directory '/build/doc/sequence_charts'
make[3]: Nothing to be done for 'check'.
make[3]: Leaving directory '/build/doc/sequence_charts'
make[3]: Entering directory '/build/doc'
make[3]: Nothing to be done for 'check-am'.
make[3]: Leaving directory '/build/doc'
make[2]: Leaving directory '/build/doc'
Making check in contrib
make[2]: Entering directory '/build/contrib'
Making check in systemd
make[3]: Entering directory '/build/contrib/systemd'
make[3]: Nothing to be done for 'check'.
make[3]: Leaving directory '/build/contrib/systemd'
make[3]: Entering directory '/build/contrib'
make[3]: Nothing to be done for 'check-am'.
make[3]: Leaving directory '/build/contrib'
make[2]: Leaving directory '/build/contrib'
Making check in tests
make[2]: Entering directory '/build/tests'
Making check in sms_queue
make[3]: Entering directory '/build/tests/sms_queue'
make sms_queue_test
make[4]: Entering directory '/build/tests/sms_queue'
CC sms_queue_test.o
CC stubs.o
CCLD sms_queue_test
make[4]: Leaving directory '/build/tests/sms_queue'
make[3]: Leaving directory '/build/tests/sms_queue'
Making check in msc_vlr
make[3]: Entering directory '/build/tests/msc_vlr'
make msc_vlr_test_no_authen msc_vlr_test_gsm_authen msc_vlr_test_gsm_ciph msc_vlr_test_umts_authen msc_vlr_test_authen_reuse msc_vlr_test_hlr_reject msc_vlr_test_hlr_timeout msc_vlr_test_ms_timeout msc_vlr_test_reject_concurrency msc_vlr_test_call msc_vlr_test_rest msc_vlr_test_ss
make[4]: Entering directory '/build/tests/msc_vlr'
CC msc_vlr_test_no_authen.o
CC msc_vlr_tests.o
CC stubs.o
CCLD msc_vlr_test_no_authen
CC msc_vlr_test_gsm_authen.o
CCLD msc_vlr_test_gsm_authen
CC msc_vlr_test_gsm_ciph.o
CCLD msc_vlr_test_gsm_ciph
CC msc_vlr_test_umts_authen.o
CCLD msc_vlr_test_umts_authen
CC msc_vlr_test_authen_reuse.o
CCLD msc_vlr_test_authen_reuse
CC msc_vlr_test_hlr_reject.o
CCLD msc_vlr_test_hlr_reject
CC msc_vlr_test_hlr_timeout.o
CCLD msc_vlr_test_hlr_timeout
CC msc_vlr_test_ms_timeout.o
CCLD msc_vlr_test_ms_timeout
CC msc_vlr_test_reject_concurrency.o
CCLD msc_vlr_test_reject_concurrency
CC msc_vlr_test_call.o
CCLD msc_vlr_test_call
CC msc_vlr_test_rest.o
CCLD msc_vlr_test_rest
CC msc_vlr_test_ss.o
CCLD msc_vlr_test_ss
/usr/bin/ld: final link failed: No space left on device
collect2: error: ld returned 1 exit status
make[4]: *** [Makefile:773: msc_vlr_test_ss] Error 1
make[4]: Leaving directory '/build/tests/msc_vlr'
make[3]: *** [Makefile:932: check-am] Error 2
make[3]: Leaving directory '/build/tests/msc_vlr'
make[2]: *** [Makefile:426: check-recursive] Error 1
make[2]: Leaving directory '/build/tests'
make[1]: *** [Makefile:477: check-recursive] Error 1
make[1]: Leaving directory '/build'
make: *** [Makefile:776: check] Error 2
+ exit_tar_workspace
+ '[' 1 = 1 ']'
+ tar -cJf /tmp/workspace.tar.xz /build
tar: Removing leading `/' from member names
+ mv /tmp/workspace.tar.xz /build
mv: error writing '/build/workspace.tar.xz': No space left on device
Build step 'Execute shell' marked build as failure
$ ssh-agent -k
unset SSH_AUTH_SOCK;
unset SSH_AGENT_PID;
echo Agent pid 3311854 killed;
[ssh-agent] Stopped.
Archiving artifacts
See <https://jenkins.osmocom.org/jenkins/job/ttcn3-gbproxy-test-latest/1513/disp…>
Changes:
------------------------------------------
Started by timer
Running as SYSTEM
Building remotely on build5-deb12build-ansible (ttcn3 obs osmo-gsm-tester-build qemu io_uring linux-shallow-clone osmocom-gerrit coverity osmocom-master) in workspace <https://jenkins.osmocom.org/jenkins/job/ttcn3-gbproxy-test-latest/ws/>
The recommended git tool is: NONE
No credentials specified
> git rev-parse --resolve-git-dir <https://jenkins.osmocom.org/jenkins/job/ttcn3-gbproxy-test-latest/ws/.git> # timeout=10
Fetching changes from the remote Git repository
Also: hudson.remoting.Channel$CallSiteStackTrace: Remote call to build5-deb12build-ansible
at hudson.remoting.Channel.attachCallSiteStackTrace(Channel.java:1916)
at hudson.remoting.UserRequest$ExceptionResponse.retrieve(UserRequest.java:384)
at hudson.remoting.Channel.call(Channel.java:1108)
at hudson.remoting.RemoteInvocationHandler.invoke(RemoteInvocationHandler.java:306)
at PluginClassLoader for git-client/jdk.proxy48/jdk.proxy48.$Proxy107.withRepository(Unknown Source)
at PluginClassLoader for git-client//org.jenkinsci.plugins.gitclient.RemoteGitImpl.withRepository(RemoteGitImpl.java:264)
at PluginClassLoader for git//jenkins.plugins.git.GitHooksConfiguration.configure(GitHooksConfiguration.java:104)
at PluginClassLoader for git//jenkins.plugins.git.GitHooksConfiguration.configure(GitHooksConfiguration.java:94)
at PluginClassLoader for git//jenkins.plugins.git.GitHooksConfiguration.configure(GitHooksConfiguration.java:83)
at PluginClassLoader for git//hudson.plugins.git.GitSCM.retrieveChanges(GitSCM.java:1231)
at PluginClassLoader for git//hudson.plugins.git.GitSCM._checkout(GitSCM.java:1310)
at PluginClassLoader for git//hudson.plugins.git.GitSCM.checkout(GitSCM.java:1277)
at hudson.scm.SCM.checkout(SCM.java:540)
at hudson.model.AbstractProject.checkout(AbstractProject.java:1250)
at hudson.model.AbstractBuild$AbstractBuildExecution.defaultCheckout(AbstractBuild.java:648)
at jenkins.scm.SCMCheckoutStrategy.checkout(SCMCheckoutStrategy.java:84)
at hudson.model.AbstractBuild$AbstractBuildExecution.run(AbstractBuild.java:521)
at hudson.model.Run.execute(Run.java:1843)
at hudson.model.FreeStyleBuild.run(FreeStyleBuild.java:44)
at hudson.model.ResourceController.execute(ResourceController.java:97)
at hudson.model.Executor.run(Executor.java:456)
java.io.IOException: No space left on device
at java.base/java.io.FileOutputStream.writeBytes(Native Method)
at java.base/java.io.FileOutputStream.write(FileOutputStream.java:332)
at PluginClassLoader for git-client//org.eclipse.jgit.internal.storage.file.LockFile.write(LockFile.java:305)
at PluginClassLoader for git-client//org.eclipse.jgit.storage.file.FileBasedConfig.save(FileBasedConfig.java:205)
at PluginClassLoader for git//jenkins.plugins.git.DisableHooks.invoke(DisableHooks.java:27)
at PluginClassLoader for git-client//org.jenkinsci.plugins.gitclient.AbstractGitAPIImpl.withRepository(AbstractGitAPIImpl.java:28)
at PluginClassLoader for git-client//org.jenkinsci.plugins.gitclient.CliGitAPIImpl.withRepository(CliGitAPIImpl.java:83)
at java.base/jdk.internal.reflect.DirectMethodHandleAccessor.invoke(DirectMethodHandleAccessor.java:104)
at java.base/java.lang.reflect.Method.invoke(Method.java:565)
at hudson.remoting.RemoteInvocationHandler$RPCRequest.perform(RemoteInvocationHandler.java:986)
at hudson.remoting.RemoteInvocationHandler$RPCRequest.call(RemoteInvocationHandler.java:961)
at hudson.remoting.RemoteInvocationHandler$RPCRequest.call(RemoteInvocationHandler.java:907)
at hudson.remoting.UserRequest.perform(UserRequest.java:225)
at hudson.remoting.UserRequest.perform(UserRequest.java:50)
at hudson.remoting.Request$2.run(Request.java:391)
at hudson.remoting.InterceptingExecutorService.lambda$wrap$0(InterceptingExecutorService.java:81)
at java.base/java.util.concurrent.FutureTask.run(FutureTask.java:330)
at java.base/java.util.concurrent.ThreadPoolExecutor.runWorker(ThreadPoolExecutor.java:1090)
at java.base/java.util.concurrent.ThreadPoolExecutor$Worker.run(ThreadPoolExecutor.java:614)
at java.base/java.lang.Thread.run(Thread.java:1516)
Recording test results
[Checks API] No suitable checks publisher found.