lists.osmocom.org
Sign In
Sign Up
Sign In
Sign Up
Manage this list
×
Keyboard Shortcuts
Thread View
j
: Next unread message
k
: Previous unread message
j a
: Jump to all threads
j l
: Jump to MailingList overview
2026
October
September
August
July
June
May
April
March
February
January
2025
December
November
October
September
August
July
June
May
April
March
February
January
2024
December
November
October
September
August
July
June
May
April
March
February
January
2023
December
November
October
September
August
July
June
May
April
March
February
January
2022
December
November
October
September
August
July
June
May
April
March
February
January
2021
December
November
October
September
August
July
June
May
April
March
February
January
2020
December
November
October
September
August
July
June
May
April
March
February
January
2019
December
November
October
September
August
July
June
May
April
March
List overview
Download
jenkins-notifications
August 2026
----- 2026 -----
October 2026
September 2026
August 2026
July 2026
June 2026
May 2026
April 2026
March 2026
February 2026
January 2026
----- 2025 -----
December 2025
November 2025
October 2025
September 2025
August 2025
July 2025
June 2025
May 2025
April 2025
March 2025
February 2025
January 2025
----- 2024 -----
December 2024
November 2024
October 2024
September 2024
August 2024
July 2024
June 2024
May 2024
April 2024
March 2024
February 2024
January 2024
----- 2023 -----
December 2023
November 2023
October 2023
September 2023
August 2023
July 2023
June 2023
May 2023
April 2023
March 2023
February 2023
January 2023
----- 2022 -----
December 2022
November 2022
October 2022
September 2022
August 2022
July 2022
June 2022
May 2022
April 2022
March 2022
February 2022
January 2022
----- 2021 -----
December 2021
November 2021
October 2021
September 2021
August 2021
July 2021
June 2021
May 2021
April 2021
March 2021
February 2021
January 2021
----- 2020 -----
December 2020
November 2020
October 2020
September 2020
August 2020
July 2020
June 2020
May 2020
April 2020
March 2020
February 2020
January 2020
----- 2019 -----
December 2019
November 2019
October 2019
September 2019
August 2019
July 2019
June 2019
May 2019
April 2019
March 2019
jenkins-notifications@lists.osmocom.org
1 participants
117 discussions
Start a n
N
ew thread
Build failed in Jenkins: ttcn3-bts-test-asan #808
by jenkins@lists.osmocom.org
28 Aug '26
28 Aug '26
See <
https://jenkins.osmocom.org/jenkins/job/ttcn3-bts-test-asan/808/display/red…
> Changes: ------------------------------------------ [...truncated 12.19 MiB...] <failure type='fail-verdict'>"BTS_Tests.ttcn:732 : Tguard timeout" BTS_Tests.ttcn:9557 BTS_Tests control part BTS_Tests.ttcn:7525 TC_rll_rel_req testcase </failure> </testcase> <testcase classname='BTS_Tests:hopping' name='TC_rll_unit_data_req_DCCH' time='2.353122'/> <testcase classname='BTS_Tests:hopping' name='TC_rll_unit_data_req_ACCH' time='5.307861'/> <testcase classname='BTS_Tests:hopping' name='TC_rll_unit_data_ind_DCCH' time='2.922271'/> <testcase classname='BTS_Tests:hopping' name='TC_rll_unit_data_ind_ACCH' time='11.488366'/> <testcase classname='BTS_Tests:hopping' name='TC_chan_act_a51' time='2.648871'/> <testcase classname='BTS_Tests:hopping' name='TC_chan_act_a52' time='2.706149'/> <testcase classname='BTS_Tests:hopping' name='TC_chan_act_a53' time='2.707738'/> <testcase classname='BTS_Tests:hopping' name='TC_chan_act_a54' time='2.732125'/> <testcase classname='BTS_Tests:hopping' name='TC_encr_cmd_a51' time='5.228676'/> <testcase classname='BTS_Tests:hopping' name='TC_encr_cmd_a52' time='5.223174'/> <testcase classname='BTS_Tests:hopping' name='TC_encr_cmd_a53' time='5.178758'/> <testcase classname='BTS_Tests:hopping' name='TC_encr_cmd_a54' time='5.208047'/> <testcase classname='BTS_Tests:hopping' name='TC_err_rep_wrong_mdisc' time='1.279400'/> <testcase classname='BTS_Tests:hopping' name='TC_err_rep_wrong_msg_type' time='1.334564'/> <testcase classname='BTS_Tests:hopping' name='TC_err_rep_wrong_sequence' time='1.263112'/> <testcase classname='BTS_Tests:hopping' name='TC_lapdm_selftest' time='0.005533'/> <testcase classname='BTS_Tests:hopping' name='TC_tch_sign_l2_fill_frame' time='18.446193'/> <testcase classname='BTS_Tests:hopping' name='TC_tch_sign_l2_fill_frame_dtxd' time='2.133871'> <failure type='fail-verdict'>Received DTX TCH fill frame with bad frame number: 175 (mod 104: 71) (mod 26: 19) BTS_Tests.ttcn:9579 BTS_Tests control part BTS_Tests.ttcn:8110 TC_tch_sign_l2_fill_frame_dtxd testcase </failure> </testcase> <testcase classname='BTS_Tests:hopping' name='TC_chopped_ipa_ping' time='24.700912'/> <testcase classname='BTS_Tests:hopping' name='TC_chopped_ipa_payload' time='42.632750'/> <testcase classname='BTS_Tests:hopping' name='TC_ms_pwr_ctrl_constant' time='16.899149'/> <testcase classname='BTS_Tests:hopping' name='TC_ms_pwr_ctrl_pf_ewma' time='32.010154'/> <testcase classname='BTS_Tests:hopping' name='TC_speech_no_rtp_tchf' time='7.373688'/> <testcase classname='BTS_Tests:hopping' name='TC_speech_no_rtp_tchh' time='5.497687'/> <testcase classname='BTS_Tests:hopping' name='TC_speech_rtp_tchf' time='7.540386'/> <testcase classname='BTS_Tests:hopping' name='TC_speech_rtp_tchh' time='5.398473'/> <testcase classname='BTS_Tests:hopping' name='TC_speech_osmux_tchf' time='3.417101'/> <testcase classname='BTS_Tests:hopping' name='TC_speech_osmux_tchh' time='3.486492'/> <testcase classname='BTS_Tests:hopping' name='TC_data_rtp_tchf144' time='2.094561'/> <testcase classname='BTS_Tests:hopping' name='TC_data_rtp_tchf96' time='2.161126'/> <testcase classname='BTS_Tests:hopping' name='TC_data_rtp_tchf48' time='2.130632'/> <testcase classname='BTS_Tests:hopping' name='TC_data_rtp_tchh48' time='5.355024'> <failure type='fail-verdict'>Timeout waiting for matching Downlink data frame BTS_Tests.ttcn:9597 BTS_Tests control part BTS_Tests.ttcn:8880 TC_data_rtp_tchh48 testcase </failure> </testcase> <testcase classname='BTS_Tests:hopping' name='TC_data_rtp_tchf24' time='1.799166'/> <testcase classname='BTS_Tests:hopping' name='TC_data_rtp_tchh24' time='5.373083'> <failure type='fail-verdict'>Timeout waiting for matching Downlink data frame BTS_Tests.ttcn:9599 BTS_Tests control part BTS_Tests.ttcn:8949 TC_data_rtp_tchh24 testcase </failure> </testcase> <testcase classname='BTS_Tests:hopping' name='TC_data_facch_tchf144' time='2.005185'/> <testcase classname='BTS_Tests:hopping' name='TC_data_facch_tchf96' time='2.085572'/> <testcase classname='BTS_Tests:hopping' name='TC_data_facch_tchf48' time='2.001227'/> <testcase classname='BTS_Tests:hopping' name='TC_data_facch_tchh48' time='2.181063'/> <testcase classname='BTS_Tests:hopping' name='TC_data_facch_tchf24' time='2.032678'/> <testcase classname='BTS_Tests:hopping' name='TC_data_facch_tchh24' time='2.190155'/> <testcase classname='BTS_Tests:hopping' name='TC_early_immediate_assignment' time='3.603802'/> <testcase classname='BTS_Tests:hopping' name='TC_acch_overpower_rxqual_thresh' time='9.084614'> <failure type='fail-verdict'>Timeout waiting for L1CTL DATA.ind BTS_Tests.ttcn:9610 BTS_Tests control part BTS_Tests.ttcn:9244 TC_acch_overpower_rxqual_thresh testcase </failure> </testcase> <testcase classname='BTS_Tests:hopping' name='TC_acch_overpower_rxqual_thresh_dtx' time='9.025614'> <failure type='fail-verdict'>Timeout waiting for L1CTL DATA.ind BTS_Tests.ttcn:9611 BTS_Tests control part BTS_Tests.ttcn:9285 TC_acch_overpower_rxqual_thresh_dtx testcase </failure> </testcase> <testcase classname='BTS_Tests:hopping' name='TC_acch_overpower_always_on_facch' time='9.041125'> <failure type='fail-verdict'>Timeout waiting for L1CTL DATA.ind BTS_Tests.ttcn:9612 BTS_Tests control part BTS_Tests.ttcn:9317 TC_acch_overpower_always_on_facch testcase </failure> </testcase> <testcase classname='BTS_Tests:hopping' name='TC_acch_overpower_always_on_sacch' time='9.031235'> <failure type='fail-verdict'>Timeout waiting for L1CTL DATA.ind BTS_Tests.ttcn:9613 BTS_Tests control part BTS_Tests.ttcn:9349 TC_acch_overpower_always_on_sacch testcase </failure> </testcase> <testcase classname='BTS_Tests:hopping' name='TC_acch_overpower_limit' time='9.052134'> <failure type='fail-verdict'>Timeout waiting for L1CTL DATA.ind BTS_Tests.ttcn:9614 BTS_Tests control part BTS_Tests.ttcn:9380 TC_acch_overpower_limit testcase </failure> </testcase> <testcase classname='BTS_Tests_SMSCB:hopping' name='TC_cbch_load_idle_no_cbch' time='11.173447'/> <testcase classname='BTS_Tests_SMSCB:hopping' name='TC_sms_cb_cmd_sdcch4_1block' time='14.293743'/> <testcase classname='BTS_Tests_SMSCB:hopping' name='TC_sms_cb_cmd_sdcch4_2block' time='14.210683'/> <testcase classname='BTS_Tests_SMSCB:hopping' name='TC_sms_cb_cmd_sdcch4_3block' time='14.198692'/> <testcase classname='BTS_Tests_SMSCB:hopping' name='TC_sms_cb_cmd_sdcch4_4block' time='14.207385'/> <testcase classname='BTS_Tests_SMSCB:hopping' name='TC_sms_cb_cmd_sdcch4_multi' time='20.218501'/> <testcase classname='BTS_Tests_SMSCB:hopping' name='TC_sms_cb_cmd_sdcch4_schedule' time='14.187106'/> <testcase classname='BTS_Tests_SMSCB:hopping' name='TC_sms_cb_cmd_sdcch4_default_only' time='16.239933'/> <testcase classname='BTS_Tests_SMSCB:hopping' name='TC_sms_cb_cmd_sdcch4_default_and_normal' time='17.227747'/> <testcase classname='BTS_Tests_SMSCB:hopping' name='TC_sms_cb_cmd_sdcch4_default_then_null' time='26.229405'/> <testcase classname='BTS_Tests_SMSCB:hopping' name='TC_cbc_sdcch4_load_idle' time='16.057168'/> <testcase classname='BTS_Tests_SMSCB:hopping' name='TC_cbc_sdcch4_load_overload' time='18.219841'/> <testcase classname='BTS_Tests_SMSCB:hopping' name='TC_sms_cb_cmd_sdcch8_1block' time='14.218253'/> <testcase classname='BTS_Tests_SMSCB:hopping' name='TC_sms_cb_cmd_sdcch8_2block' time='14.213689'/> <testcase classname='BTS_Tests_SMSCB:hopping' name='TC_sms_cb_cmd_sdcch8_3block' time='14.234283'/> <testcase classname='BTS_Tests_SMSCB:hopping' name='TC_sms_cb_cmd_sdcch8_4block' time='14.226202'/> <testcase classname='BTS_Tests_SMSCB:hopping' name='TC_sms_cb_cmd_sdcch8_multi' time='20.241718'/> <testcase classname='BTS_Tests_SMSCB:hopping' name='TC_sms_cb_cmd_sdcch8_schedule' time='14.207886'/> <testcase classname='BTS_Tests_SMSCB:hopping' name='TC_sms_cb_cmd_sdcch8_default_only' time='16.217499'/> <testcase classname='BTS_Tests_SMSCB:hopping' name='TC_sms_cb_cmd_sdcch8_default_and_normal' time='17.234609'/> <testcase classname='BTS_Tests_SMSCB:hopping' name='TC_cbc_sdcch8_load_idle' time='16.252674'/> <testcase classname='BTS_Tests_SMSCB:hopping' name='TC_cbc_sdcch8_load_overload' time='18.223815'/> <testcase classname='BTS_Tests_SMSCB:hopping' name='TC_etws_p1ro' time='12.202176'/> <testcase classname='BTS_Tests_SMSCB:hopping' name='TC_etws_p1ro_end' time='16.165251'/> <testcase classname='BTS_Tests_SMSCB:hopping' name='TC_etws_pcu' time='1.137940'/> <testcase classname='BTS_Tests_LAPDm:hopping' name='TC_sabm_ua_dcch_sapi0' time='2.917496'/> <testcase classname='BTS_Tests_LAPDm:hopping' name='TC_sabm_ua_dcch_sapi0_nopayload' time='21.541848'/> <testcase classname='BTS_Tests_LAPDm:hopping' name='TC_sabm_ua_dcch_sapi3' time='21.354890'/> <testcase classname='BTS_Tests_LAPDm:hopping' name='TC_sabm_ua_dcch_sapi4' time='21.322296'/> <testcase classname='BTS_Tests_LAPDm:hopping' name='TC_sabm_contention' time='21.378375'/> <testcase classname='BTS_Tests_LAPDm:hopping' name='TC_sabm_retransmit' time='3.173914'/> <testcase classname='BTS_Tests_LAPDm:hopping' name='TC_sabm_retransmit_bts' time='81.480303'/> <testcase classname='BTS_Tests_LAPDm:hopping' name='TC_sabm_invalid_resp' time='23.359856'/> <testcase classname='BTS_Tests_LAPDm:hopping' name='TC_sabm_dm' time='14.059428'/> <testcase classname='BTS_Tests_LAPDm:hopping' name='TC_establish_ign_first_sabm' time='8.185970'/> <testcase classname='BTS_Tests_LAPDm:hopping' name='TC_iframe_seq_and_ack' time='29.606374'> <failure type='fail-verdict'>Received RSL ERROR IND { msg_disc := { msg_group := RSL_MDISC_RLL (1), transparent := false }, msg_type := RSL_MT_ERROR_IND (3), ies := { { iei := RSL_IE_CHAN_NR (1), body := { chan_nr := { u := { sdcch8 := { tag := '01'B, sub_chan := 4 } }, tn := 6 } } }, { iei := RSL_IE_LINK_IDENT (2), body := { link_id := { c := FACCH_SDCCH (0), na := false, prio := SAPI0_PRIO_NORMAL (0), sapi := 0 } } }, { iei := RSL_IE_RLM_CAUSE (22), body := { rlm_cause := { len := 1, payload := '01'O } } } } } BTS_Tests_LAPDm.ttcn:1484 BTS_Tests_LAPDm control part BTS_Tests_LAPDm.ttcn:579 TC_iframe_seq_and_ack testcase </failure> </testcase> <testcase classname='BTS_Tests_LAPDm:hopping' name='TC_iframe_timer_recovery' time='24.622007'> <failure type='fail-verdict'>Received RSL ERROR IND { msg_disc := { msg_group := RSL_MDISC_RLL (1), transparent := false }, msg_type := RSL_MT_ERROR_IND (3), ies := { { iei := RSL_IE_CHAN_NR (1), body := { chan_nr := { u := { sdcch8 := { tag := '01'B, sub_chan := 4 } }, tn := 6 } } }, { iei := RSL_IE_LINK_IDENT (2), body := { link_id := { c := FACCH_SDCCH (0), na := false, prio := SAPI0_PRIO_NORMAL (0), sapi := 0 } } }, { iei := RSL_IE_RLM_CAUSE (22), body := { rlm_cause := { len := 1, payload := '01'O } } } } } BTS_Tests_LAPDm.ttcn:1485 BTS_Tests_LAPDm control part BTS_Tests_LAPDm.ttcn:685 TC_iframe_timer_recovery testcase </failure> </testcase> <testcase classname='BTS_Tests_LAPDm:hopping' name='TC_ns_seq_error' time='29.610135'> <failure type='fail-verdict'>"BTS_Tests.ttcn:732 : Tguard timeout" BTS_Tests_LAPDm.ttcn:1486 BTS_Tests_LAPDm control part BTS_Tests_LAPDm.ttcn:768 TC_ns_seq_error testcase </failure> </testcase> <testcase classname='BTS_Tests_LAPDm:hopping' name='TC_nr_seq_error' time='2.892187'/> <testcase classname='BTS_Tests_LAPDm:hopping' name='TC_rec_invalid_frame' time='119.165223'> <failure type='fail-verdict'>"BTS_Tests_LAPDm.ttcn:909 : Missing LAPDm_RR RSP" BTS_Tests_LAPDm.ttcn:1488 BTS_Tests_LAPDm control part BTS_Tests_LAPDm.ttcn:961 TC_rec_invalid_frame testcase </failure> </testcase> <testcase classname='BTS_Tests_LAPDm:hopping' name='TC_segm_concat_dcch' time='13.531586'> <failure type='fail-verdict'>"BTS_Tests_LAPDm.ttcn:1023 : received unexpected LAPDm { sacch := false, sapi := 0, lapdm := { ab := { addr := { spare := '0'B, lpd := 0, sapi := 0, c_r := false, ea := true }, ctrl := { s := { n_r := 1, p_f := false, s := '10'B, spare := '01'B } }, len := 0, m := false, el := 1, payload := ''O, padding := '2B2B2B2B2B2B2B2B2B2B2B2B2B2B2B2B2B2B2B2B'O (\"++++++++++++++++++++\") } } }" BTS_Tests_LAPDm.ttcn:1489 BTS_Tests_LAPDm control part BTS_Tests_LAPDm.ttcn:1088 TC_segm_concat_dcch testcase </failure> </testcase> <testcase classname='BTS_Tests_LAPDm:hopping' name='TC_segm_concat_sacch' time='48.554278'> <failure type='fail-verdict'>"BTS_Tests_LAPDm.ttcn:1023 : received unexpected LAPDm { sacch := true, sapi := 0, lapdm := { ab := { addr := { spare := '0'B, lpd := 0, sapi := 0, c_r := false, ea := true }, ctrl := { u := { u := '011'B, p_f := true, u2 := '00'B, spare := '11'B } }, len := 0, m := false, el := 1, payload := ''O, padding := '2B2B2B2B2B2B2B2B2B2B2B2B2B2B2B2B2B2B'O (\"++++++++++++++++++\") } } }" BTS_Tests_LAPDm.ttcn:1490 BTS_Tests_LAPDm control part BTS_Tests_LAPDm.ttcn:1093 TC_segm_concat_sacch testcase </failure> </testcase> <testcase classname='BTS_Tests_LAPDm:hopping' name='TC_t200_n200' time='39.848821'> <failure type='fail-verdict'>Missing RSL RLL ERROR INDICATION BTS_Tests_LAPDm.ttcn:1491 BTS_Tests_LAPDm control part BTS_Tests_LAPDm.ttcn:1182 TC_t200_n200 testcase </failure> </testcase> <testcase classname='BTS_Tests_LAPDm:hopping' name='TC_rr_response_frame_loss' time='6.702357'> <failure type='fail-verdict'>Timeout waiting for RR or REJ BTS_Tests_LAPDm.ttcn:1492 BTS_Tests_LAPDm control part BTS_Tests_LAPDm.ttcn:1239 TC_rr_response_frame_loss testcase </failure> </testcase> <testcase classname='BTS_Tests_LAPDm:hopping' name='TC_incorrect_cr' time='15.812903'/> <testcase classname='BTS_Tests_LAPDm:hopping' name='TC_sabm_incorrect_c' time='23.310870'> <failure type='fail-verdict'>"BTS_Tests.ttcn:732 : Tguard timeout" BTS_Tests_LAPDm.ttcn:1494 BTS_Tests_LAPDm control part BTS_Tests_LAPDm.ttcn:1341 TC_sabm_incorrect_c testcase </failure> </testcase> <testcase classname='BTS_Tests_LAPDm:hopping' name='TC_normal_reestablishment' time='16.162026'> <failure type='fail-verdict'>"BTS_Tests_LAPDm.ttcn:1023 : received unexpected LAPDm { sacch := false, sapi := 0, lapdm := { ab := { addr := { spare := '0'B, lpd := 0, sapi := 0, c_r := false, ea := true }, ctrl := { u := { u := '011'B, p_f := true, u2 := '00'B, spare := '11'B } }, len := 5, m := false, el := 1, payload := 'B876A5165A'O, padding := '2B2B2B2B2B2B2B2B2B2B2B2B2B2B2B'O (\"+++++++++++++++\") } } }" BTS_Tests_LAPDm.ttcn:1495 BTS_Tests_LAPDm control part BTS_Tests_LAPDm.ttcn:1403 TC_normal_reestablishment testcase </failure> </testcase> <testcase classname='BTS_Tests_LAPDm:hopping' name='TC_normal_reestablishment_state_unacked' time='12.423618'> <failure type='fail-verdict'>"BTS_Tests_LAPDm.ttcn:1023 : received unexpected LAPDm { sacch := false, sapi := 0, lapdm := { ab := { addr := { spare := '0'B, lpd := 0, sapi := 0, c_r := false, ea := true }, ctrl := { s := { n_r := 1, p_f := false, s := '10'B, spare := '01'B } }, len := 0, m := false, el := 1, payload := ''O, padding := '2B2B2B2B2B2B2B2B2B2B2B2B2B2B2B2B2B2B2B2B'O (\"++++++++++++++++++++\") } } }" BTS_Tests_LAPDm.ttcn:1496 BTS_Tests_LAPDm control part BTS_Tests_LAPDm.ttcn:1470 TC_normal_reestablishment_state_unacked testcase </failure> </testcase> <testcase classname='BTS_Tests_VAMOS:hopping' name='TC_vamos_chan_act_vff' time='2.479479'/> <testcase classname='BTS_Tests_VAMOS:hopping' name='TC_vamos_chan_act_vhh' time='2.618032'/> <testcase classname='BTS_Tests_VAMOS:hopping' name='TC_vamos_chan_act_hvhh' time='2.598360'/> <testcase classname='BTS_Tests_VAMOS:hopping' name='TC_vamos_chan_act_dyn_ipa_vff' time='2.608472'/> <testcase classname='BTS_Tests_VAMOS:hopping' name='TC_vamos_chan_act_dyn_osmo_vff' time='2.570475'/> <testcase classname='BTS_Tests_VAMOS:hopping' name='TC_vamos_chan_act_dyn_osmo_vhh' time='2.627261'/> <testcase classname='BTS_Tests_VAMOS:hopping' name='TC_vamos_chan_act_dyn_osmo_hvhh' time='2.607882'/> <testcase classname='BTS_Tests_VAMOS:hopping' name='TC_vamos_chan_mode_modify_vff' time='1.370943'/> <testcase classname='BTS_Tests_VAMOS:hopping' name='TC_vamos_chan_mode_modify_vhh' time='1.404542'/> <testcase classname='BTS_Tests_VAMOS:hopping' name='TC_vamos_chan_mode_modify_hvhh' time='1.379716'/> <testcase classname='BTS_Tests_VAMOS:hopping' name='TC_vamos_chan_mode_modify_dyn_ipa_vff' time='1.386331'/> <testcase classname='BTS_Tests_VAMOS:hopping' name='TC_vamos_chan_mode_modify_dyn_osmo_vff' time='1.352873'/> <testcase classname='BTS_Tests_VAMOS:hopping' name='TC_vamos_chan_mode_modify_dyn_osmo_vhh' time='1.403295'/> <testcase classname='BTS_Tests_VAMOS:hopping' name='TC_vamos_chan_mode_modify_dyn_osmo_hvhh' time='1.404273'/> <testcase classname='BTS_Tests_ASCI:hopping' name='TC_vbs_notification' time='4.687643'/> <testcase classname='BTS_Tests_ASCI:hopping' name='TC_vgcs_uplink_free_and_busy' time='1.805969'/> <testcase classname='BTS_Tests_ASCI:hopping' name='TC_vgcs_talker_fail' time='17.061344'/> <testcase classname='BTS_Tests_ASCI:hopping' name='TC_vgcs_talker_est_rel' time='1.460796'/> <testcase classname='BTS_Tests_ASCI:hopping' name='TC_vgcs_listener_det' time='3.402357'/> </testsuite> <?xml version="1.0"?> <testsuite name='Titan' tests='17' failures='0' errors='0' skipped='0' inconc='0' time='95.00'> <testcase classname='BTS_Tests_OML' name='TC_wrong_mdisc' time='10.482701'/> <testcase classname='BTS_Tests_OML' name='TC_wrong_msgtype' time='0.667549'/> <testcase classname='BTS_Tests_OML' name='TC_short_length' time='0.696763'/> <testcase classname='BTS_Tests_OML' name='TC_long_length' time='0.683144'/> <testcase classname='BTS_Tests_OML' name='TC_wrong_placement' time='0.686608'/> <testcase classname='BTS_Tests_OML' name='TC_wrong_seq' time='0.696512'/> <testcase classname='BTS_Tests_OML' name='TC_wrong_obj_class' time='0.684646'/> <testcase classname='BTS_Tests_OML' name='TC_wrong_bts_nr' time='0.703402'/> <testcase classname='BTS_Tests_OML' name='TC_wrong_trx_nr' time='0.686851'/> <testcase classname='BTS_Tests_OML' name='TC_radio_carrier_opstart_noattr' time='0.689540'/> <testcase classname='BTS_Tests_OML' name='TC_bts_opstart' time='0.685996'/> <testcase classname='BTS_Tests_OML' name='TC_bts_opstart_noattr' time='0.709454'/> <testcase classname='BTS_Tests_OML' name='TC_ts_opstart' time='0.700030'/> <testcase classname='BTS_Tests_OML' name='TC_ts_opstart_noattr' time='0.686162'/> <testcase classname='BTS_Tests_OML' name='TC_initial_state_reports' time='0.687781'/> <testcase classname='BTS_Tests_OML' name='TC_ipa_osmo_pcu_anr_fwd' time='0.710998'/> <testcase classname='BTS_Tests_OML' name='TC_ipa_rsl_connect_nack' time='0.685494'/> </testsuite> + check_respawn_count + set +x [0;31m ================================================================ WARNING: osmo-bts was respawned 5 times (expected: 3)! (OS#6794) ================================================================ [0m+ RC=1 + uptime + grep --color=always -o load.* [01;31m[Kload average: 0.45, 0.57, 0.57[m[K + exit 1 Build step 'Execute shell' marked build as failure Recording test results [Checks API] No suitable checks publisher found.
1
0
0
0
Jenkins build became unstable: ttcn3-stp-test-io_uring #897
by jenkins@lists.osmocom.org
27 Aug '26
27 Aug '26
See <
https://jenkins.osmocom.org/jenkins/job/ttcn3-stp-test-io_uring/897/display…
>
1
1
0
0
Build failed in Jenkins: linux-shallow-clone » build4-deb12build-ansible #205
by jenkins@lists.osmocom.org
27 Aug '26
27 Aug '26
See <
https://jenkins.osmocom.org/jenkins/job/linux-shallow-clone/label=build4-de…
> Changes: ------------------------------------------ Started by upstream project "linux-shallow-clone" build number 205 originally caused by: Started by timer Running as SYSTEM Building remotely on build4-deb12build-ansible (ttcn3 obs osmo-gsm-tester-build qemu io_uring linux-shallow-clone osmocom-gerrit coverity osmocom-master) in workspace <
https://jenkins.osmocom.org/jenkins/job/linux-shallow-clone/label=build4-de…
> The recommended git tool is: NONE No credentials specified Wiping out workspace first. Cloning the remote Git repository Cloning repository
https://gerrit.osmocom.org/osmo-ci
> git init <
https://jenkins.osmocom.org/jenkins/job/linux-shallow-clone/label=build4-de…
> # timeout=10 Fetching upstream changes from
https://gerrit.osmocom.org/osmo-ci
> git --version # timeout=10 > git --version # 'git version 2.39.5' > git fetch --tags --force --progress --
https://gerrit.osmocom.org/osmo-ci
+refs/heads/*:refs/remotes/origin/* # timeout=10 > git config remote.origin.url
https://gerrit.osmocom.org/osmo-ci
# timeout=10 > git config --add remote.origin.fetch +refs/heads/*:refs/remotes/origin/* # timeout=10 Avoid second fetch Checking out Revision 99eb9b825e7b5d8ba7cf94085f10bcc3f5aedacb (origin/master) > git config core.sparsecheckout # timeout=10 > git checkout -f 99eb9b825e7b5d8ba7cf94085f10bcc3f5aedacb # timeout=10 Commit message: "obs-mirror: restart on failure" > git rev-list --no-walk 99eb9b825e7b5d8ba7cf94085f10bcc3f5aedacb # timeout=10 [build4-deb12build-ansible] $ /bin/sh -xe /tmp/jenkins1220041072902647920.sh + scripts/kernel/linux-shallow-clone.sh /home/osmocom-build/linux.git + set_dest /home/osmocom-build/linux.git + [ -n /home/osmocom-build/linux.git ] + DEST=/home/osmocom-build/linux.git + [ -e /home/osmocom-build/linux.git/.month ] + cat /home/osmocom-build/linux.git/.month + date +%m + [ 08 != 08 ] + init + [ -d /home/osmocom-build/linux.git ] + return + cd /home/osmocom-build/linux.git + fetch_branches + fetch_branch torvalds master + local remote=torvalds + local branch=master + local head + git fetch --no-tags --depth=1 torvalds master From
https://git.kernel.org/pub/scm/linux/kernel/git/torvalds/linux
* branch master -> FETCH_HEAD + 73ae59e975...502d45774a master -> torvalds/master (forced update) + git log -n1 --pretty=format:%H torvalds/master + head=502d45774af09f1c681c754c4b7cdfb5d7f72fd9 + git branch --force torvalds-master 502d45774af09f1c681c754c4b7cdfb5d7f72fd9 + git -c color.ui=always log -1 --oneline torvalds-master [33m502d45774a[m Merge tag 'clk-for-linus' of
git://git.kernel.org/pub/scm/linux/kernel/git/clk/linux
+ fetch_branch stable linux-rolling-stable + local remote=stable + local branch=linux-rolling-stable + local head + git fetch --no-tags --depth=1 stable linux-rolling-stable From
https://git.kernel.org/pub/scm/linux/kernel/git/stable/linux
* branch linux-rolling-stable -> FETCH_HEAD + git log -n1 --pretty=format:%H stable/linux-rolling-stable + head=20dacf4ccdbe4de0bc9d0427e88cb624243b253c + git branch --force stable-linux-rolling-stable 20dacf4ccdbe4de0bc9d0427e88cb624243b253c + git -c color.ui=always log -1 --oneline stable-linux-rolling-stable [33m20dacf4ccd[m Merge v7.1.10 + fetch_branch stable linux-4.19.y + local remote=stable + local branch=linux-4.19.y + local head + git fetch --no-tags --depth=1 stable linux-4.19.y From
https://git.kernel.org/pub/scm/linux/kernel/git/stable/linux
* branch linux-4.19.y -> FETCH_HEAD + git log -n1 --pretty=format:%H stable/linux-4.19.y + head=a67e7cdde7cc7984ae24c3c81a70dc1aa34424b1 + git branch --force stable-linux-4.19.y a67e7cdde7cc7984ae24c3c81a70dc1aa34424b1 + git -c color.ui=always log -1 --oneline stable-linux-4.19.y [33ma67e7cdde7[m Linux 4.19.325 + fetch_branch stable linux-5.10.y + local remote=stable + local branch=linux-5.10.y + local head + git fetch --no-tags --depth=1 stable linux-5.10.y fatal: unable to access '
https://git.kernel.org/pub/scm/linux/kernel/git/stable/linux.git/
': gnutls_handshake() failed: The TLS connection was non-properly terminated. Build step 'Execute shell' marked build as failure
1
1
0
0
Build failed in Jenkins: linux-shallow-clone » build5-deb12build-ansible #205
by jenkins@lists.osmocom.org
27 Aug '26
27 Aug '26
See <
https://jenkins.osmocom.org/jenkins/job/linux-shallow-clone/label=build5-de…
> Changes: ------------------------------------------ Started by upstream project "linux-shallow-clone" build number 205 originally caused by: Started by timer Running as SYSTEM Building remotely on build5-deb12build-ansible (ttcn3 obs osmo-gsm-tester-build qemu io_uring linux-shallow-clone osmocom-gerrit coverity osmocom-master) in workspace <
https://jenkins.osmocom.org/jenkins/job/linux-shallow-clone/label=build5-de…
> The recommended git tool is: NONE No credentials specified Wiping out workspace first. Cloning the remote Git repository Cloning repository
https://gerrit.osmocom.org/osmo-ci
> git init <
https://jenkins.osmocom.org/jenkins/job/linux-shallow-clone/label=build5-de…
> # timeout=10 Fetching upstream changes from
https://gerrit.osmocom.org/osmo-ci
> git --version # timeout=10 > git --version # 'git version 2.39.5' > git fetch --tags --force --progress --
https://gerrit.osmocom.org/osmo-ci
+refs/heads/*:refs/remotes/origin/* # timeout=10 > git config remote.origin.url
https://gerrit.osmocom.org/osmo-ci
# timeout=10 > git config --add remote.origin.fetch +refs/heads/*:refs/remotes/origin/* # timeout=10 Avoid second fetch Checking out Revision 99eb9b825e7b5d8ba7cf94085f10bcc3f5aedacb (origin/master) > git config core.sparsecheckout # timeout=10 > git checkout -f 99eb9b825e7b5d8ba7cf94085f10bcc3f5aedacb # timeout=10 Commit message: "obs-mirror: restart on failure" > git rev-list --no-walk 99eb9b825e7b5d8ba7cf94085f10bcc3f5aedacb # timeout=10 [build5-deb12build-ansible] $ /bin/sh -xe /tmp/jenkins9323880158776788458.sh + scripts/kernel/linux-shallow-clone.sh /home/osmocom-build/linux.git + set_dest /home/osmocom-build/linux.git + [ -n /home/osmocom-build/linux.git ] + DEST=/home/osmocom-build/linux.git + [ -e /home/osmocom-build/linux.git/.month ] + cat /home/osmocom-build/linux.git/.month + date +%m + [ 08 != 08 ] + init + [ -d /home/osmocom-build/linux.git ] + return + cd /home/osmocom-build/linux.git + fetch_branches + fetch_branch torvalds master + local remote=torvalds + local branch=master + local head + git fetch --no-tags --depth=1 torvalds master From
https://git.kernel.org/pub/scm/linux/kernel/git/torvalds/linux
* branch master -> FETCH_HEAD + 73ae59e975...502d45774a master -> torvalds/master (forced update) + git log -n1 --pretty=format:%H torvalds/master + head=502d45774af09f1c681c754c4b7cdfb5d7f72fd9 + git branch --force torvalds-master 502d45774af09f1c681c754c4b7cdfb5d7f72fd9 + git -c color.ui=always log -1 --oneline torvalds-master [33m502d45774a[m Merge tag 'clk-for-linus' of
git://git.kernel.org/pub/scm/linux/kernel/git/clk/linux
+ fetch_branch stable linux-rolling-stable + local remote=stable + local branch=linux-rolling-stable + local head + git fetch --no-tags --depth=1 stable linux-rolling-stable From
https://git.kernel.org/pub/scm/linux/kernel/git/stable/linux
* branch linux-rolling-stable -> FETCH_HEAD + git log -n1 --pretty=format:%H stable/linux-rolling-stable + head=20dacf4ccdbe4de0bc9d0427e88cb624243b253c + git branch --force stable-linux-rolling-stable 20dacf4ccdbe4de0bc9d0427e88cb624243b253c + git -c color.ui=always log -1 --oneline stable-linux-rolling-stable [33m20dacf4ccd[m Merge v7.1.10 + fetch_branch stable linux-4.19.y + local remote=stable + local branch=linux-4.19.y + local head + git fetch --no-tags --depth=1 stable linux-4.19.y From
https://git.kernel.org/pub/scm/linux/kernel/git/stable/linux
* branch linux-4.19.y -> FETCH_HEAD + git log -n1 --pretty=format:%H stable/linux-4.19.y + head=a67e7cdde7cc7984ae24c3c81a70dc1aa34424b1 + git branch --force stable-linux-4.19.y a67e7cdde7cc7984ae24c3c81a70dc1aa34424b1 + git -c color.ui=always log -1 --oneline stable-linux-4.19.y [33ma67e7cdde7[m Linux 4.19.325 + fetch_branch stable linux-5.10.y + local remote=stable + local branch=linux-5.10.y + local head + git fetch --no-tags --depth=1 stable linux-5.10.y error: RPC failed; curl 16 Error in the HTTP2 framing layer fatal: expected flush after ref listing Build step 'Execute shell' marked build as failure
1
1
0
0
Build failed in Jenkins: ttcn3-5gc-test-ogs-latest #287
by jenkins@lists.osmocom.org
26 Aug '26
26 Aug '26
See <
https://jenkins.osmocom.org/jenkins/job/ttcn3-5gc-test-ogs-latest/287/displ…
> Changes: ------------------------------------------ [...truncated 162.10 MiB...] MTC@f3254cbf2c87: Local verdict of PTC TC_ng_register_ping46-NGAP0(567): none (error -> error) MTC@f3254cbf2c87: Local verdict of PTC TC_ng_register_ping46-NGAP1(568): none (error -> error) MTC@f3254cbf2c87: Local verdict of PTC TC_ng_register_ping460(569): none (error -> error) MTC@f3254cbf2c87: Test case TC_ng_register_ping46 finished. Verdict: error MTC@f3254cbf2c87: Starting external command `<
https://jenkins.osmocom.org/jenkins/job/ttcn3-5gc-test-ogs-latest/ws/ttcn3-…
> C5G_Tests.TC_ng_register_ping46 error'. (13:45:46) load average: 4.43, 5.96, 4.89 [1;31m------ C5G_Tests.TC_ng_register_ping46 error ------[0m Waiting for packet dumper to finish... 0 (prev_count=-1, count=436) [32m08/26 13:45:47.092[0m: [[33mscp[0m] [1;37mDEBUG[0m: scp_state_operational(): OGS_EVENT_NAME_SBI_TIMER (../src/scp/scp-sm.c:54) [32m08/26 13:45:47.092[0m: [[33msbi[0m] [1;37mDEBUG[0m: ogs_sbi_nf_state_registered(): OGS_EVENT_NAME_SBI_TIMER (../lib/sbi/nf-sm.c:358) [32m08/26 13:45:47.092[0m: [[33msbi[0m] [1;37mDEBUG[0m: [PATCH]
http://127.0.0.10:7777/nnrf-nfm/v1/nf-instances/2f725fc0-a154-41f1-b1cd-3b1…
(../lib/sbi/client.c:797) [32m08/26 13:45:47.092[0m: [[33msbi[0m] [1;37mDEBUG[0m: SENDING...[100] (../lib/sbi/client.c:546) [32m08/26 13:45:47.092[0m: [[33msbi[0m] [1;37mDEBUG[0m: [{"op":"replace","path":"/nfStatus","value":"REGISTERED"},{"op":"replace","path":"/load","value":0}] (../lib/sbi/client.c:548) [32m08/26 13:45:47.092[0m: [[33msbi[0m] [1;37mDEBUG[0m: STREAM added [431] (../lib/sbi/nghttp2-server.c:1737) [32m08/26 13:45:47.092[0m: [[33msbi[0m] [1;37mDEBUG[0m: [PATCH] /nnrf-nfm/v1/nf-instances/2f725fc0-a154-41f1-b1cd-3b113f8a78b3 (../lib/sbi/nghttp2-server.c:1308) [32m08/26 13:45:47.092[0m: [[33msbi[0m] [1;37mDEBUG[0m: RECEIVED: 100 (../lib/sbi/nghttp2-server.c:1312) [32m08/26 13:45:47.092[0m: [[33msbi[0m] [1;37mDEBUG[0m: [{"op":"replace","path":"/nfStatus","value":"REGISTERED"},{"op":"replace","path":"/load","value":0}] (../lib/sbi/nghttp2-server.c:1314) [32m08/26 13:45:47.092[0m: [[33mnrf[0m] [1;37mDEBUG[0m: nrf_state_operational(): OGS_EVENT_NAME_SBI_SERVER (../src/nrf/nrf-sm.c:54) [32m08/26 13:45:47.092[0m: [[33mnrf[0m] [1;37mDEBUG[0m: nrf_nf_state_registered(): OGS_EVENT_NAME_SBI_SERVER (../src/nrf/nf-sm.c:201) [32m08/26 13:45:47.092[0m: [[33msbi[0m] [1;37mDEBUG[0m: STATUS [204] (../lib/sbi/nghttp2-server.c:702) [32m08/26 13:45:47.092[0m: [[33msbi[0m] [1;37mDEBUG[0m: STREAM closed [431] (../lib/sbi/nghttp2-server.c:1419) 0000: 00001a01 05000001 af89e161 96e4593e ...........a..Y> 0010: 94138a43 6cca0802 7140b371 a6ee34ea ...Cl...q@.q..4. 0020: 98b46f ..o [32m08/26 13:45:47.093[0m: [[33msbi[0m] [1;37mDEBUG[0m: [204:PATCH]
http://127.0.0.10:7777/nnrf-nfm/v1/nf-instances/2f725fc0-a154-41f1-b1cd-3b1…
(../lib/sbi/client.c:744) [32m08/26 13:45:47.093[0m: [[33msbi[0m] [1;37mDEBUG[0m: RECEIVED[0] (../lib/sbi/client.c:755) [32m08/26 13:45:47.093[0m: [[33mscp[0m] [1;37mDEBUG[0m: scp_state_operational(): OGS_EVENT_NAME_SBI_CLIENT (../src/scp/scp-sm.c:54) [32m08/26 13:45:47.093[0m: [[33msbi[0m] [1;37mDEBUG[0m: ogs_sbi_nf_state_registered(): OGS_EVENT_NAME_SBI_CLIENT (../lib/sbi/nf-sm.c:358) Waiting for packet dumper to finish... 1 (prev_count=436, count=4648) [32m08/26 13:45:47.372[0m: [[33msepp[0m] [1;37mDEBUG[0m: sepp_state_operational(): OGS_EVENT_NAME_SBI_TIMER (../src/sepp/sepp-sm.c:55) [32m08/26 13:45:47.372[0m: [[33msbi[0m] [1;37mDEBUG[0m: ogs_sbi_nf_state_registered(): OGS_EVENT_NAME_SBI_TIMER (../lib/sbi/nf-sm.c:358) [32m08/26 13:45:47.372[0m: [[33msbi[0m] [1;37mDEBUG[0m: [PATCH]
http://127.0.0.200:7777/nnrf-nfm/v1/nf-instances/2f916bcc-a154-41f1-9f73-a3…
(../lib/sbi/client.c:797) [32m08/26 13:45:47.372[0m: [[33msbi[0m] [1;37mDEBUG[0m: SENDING...[100] (../lib/sbi/client.c:546) [32m08/26 13:45:47.372[0m: [[33msbi[0m] [1;37mDEBUG[0m: [{"op":"replace","path":"/nfStatus","value":"REGISTERED"},{"op":"replace","path":"/load","value":0}] (../lib/sbi/client.c:548) [32m08/26 13:45:47.372[0m: [[33msbi[0m] [1;37mDEBUG[0m: STREAM added [31] (../lib/sbi/nghttp2-server.c:1737) [32m08/26 13:45:47.372[0m: [[33msbi[0m] [1;37mDEBUG[0m: [PATCH] /nnrf-nfm/v1/nf-instances/2f916bcc-a154-41f1-9f73-a3a0fe7b0fdb (../lib/sbi/nghttp2-server.c:1308) [32m08/26 13:45:47.372[0m: [[33msbi[0m] [1;37mDEBUG[0m: RECEIVED: 100 (../lib/sbi/nghttp2-server.c:1312) [32m08/26 13:45:47.372[0m: [[33msbi[0m] [1;37mDEBUG[0m: [{"op":"replace","path":"/nfStatus","value":"REGISTERED"},{"op":"replace","path":"/load","value":0}] (../lib/sbi/nghttp2-server.c:1314) [32m08/26 13:45:47.372[0m: [[33msbi[0m] [1;37mDEBUG[0m: [PATCH]
http://127.0.0.10:7777/nnrf-nfm/v1/nf-instances/2f916bcc-a154-41f1-9f73-a3a…
(../lib/sbi/client.c:797) [32m08/26 13:45:47.372[0m: [[33msbi[0m] [1;37mDEBUG[0m: SENDING...[100] (../lib/sbi/client.c:546) [32m08/26 13:45:47.372[0m: [[33msbi[0m] [1;37mDEBUG[0m: [{"op":"replace","path":"/nfStatus","value":"REGISTERED"},{"op":"replace","path":"/load","value":0}] (../lib/sbi/client.c:548) [32m08/26 13:45:47.373[0m: [[33msbi[0m] [1;37mDEBUG[0m: STREAM added [433] (../lib/sbi/nghttp2-server.c:1737) [32m08/26 13:45:47.373[0m: [[33msbi[0m] [1;37mDEBUG[0m: [PATCH] /nnrf-nfm/v1/nf-instances/2f916bcc-a154-41f1-9f73-a3a0fe7b0fdb (../lib/sbi/nghttp2-server.c:1308) [32m08/26 13:45:47.373[0m: [[33msbi[0m] [1;37mDEBUG[0m: RECEIVED: 100 (../lib/sbi/nghttp2-server.c:1312) [32m08/26 13:45:47.373[0m: [[33msbi[0m] [1;37mDEBUG[0m: [{"op":"replace","path":"/nfStatus","value":"REGISTERED"},{"op":"replace","path":"/load","value":0}] (../lib/sbi/nghttp2-server.c:1314) [32m08/26 13:45:47.373[0m: [[33mnrf[0m] [1;37mDEBUG[0m: nrf_state_operational(): OGS_EVENT_NAME_SBI_SERVER (../src/nrf/nrf-sm.c:54) [32m08/26 13:45:47.373[0m: [[33mnrf[0m] [1;37mDEBUG[0m: nrf_nf_state_registered(): OGS_EVENT_NAME_SBI_SERVER (../src/nrf/nf-sm.c:201) [32m08/26 13:45:47.373[0m: [[33msbi[0m] [1;37mDEBUG[0m: STATUS [204] (../lib/sbi/nghttp2-server.c:702) [32m08/26 13:45:47.373[0m: [[33msbi[0m] [1;37mDEBUG[0m: STREAM closed [433] (../lib/sbi/nghttp2-server.c:1419) 0000: 00000301 05000001 b189e2be ............ [32m08/26 13:45:47.373[0m: [[33msbi[0m] [1;37mDEBUG[0m: [204:PATCH]
http://127.0.0.10:7777/nnrf-nfm/v1/nf-instances/2f916bcc-a154-41f1-9f73-a3a…
(../lib/sbi/client.c:744) [32m08/26 13:45:47.373[0m: [[33msbi[0m] [1;37mDEBUG[0m: RECEIVED[0] (../lib/sbi/client.c:755) [32m08/26 13:45:47.373[0m: [[33msbi[0m] [1;37mDEBUG[0m: STATUS [204] (../lib/sbi/nghttp2-server.c:702) [32m08/26 13:45:47.373[0m: [[33msbi[0m] [1;37mDEBUG[0m: STREAM closed [31] (../lib/sbi/nghttp2-server.c:1419) 0000: 00001a01 05000000 1f89cb61 96e4593e ...........a..Y> 0010: 94138a43 6cca0802 7140b371 a6ee34ea ...Cl...q@.q..4. 0020: 98b46f ..o [32m08/26 13:45:47.374[0m: [[33msbi[0m] [1;37mDEBUG[0m: [204:PATCH]
http://127.0.0.200:7777/nnrf-nfm/v1/nf-instances/2f916bcc-a154-41f1-9f73-a3…
(../lib/sbi/client.c:744) [32m08/26 13:45:47.374[0m: [[33msbi[0m] [1;37mDEBUG[0m: RECEIVED[0] (../lib/sbi/client.c:755) [32m08/26 13:45:47.374[0m: [[33msepp[0m] [1;37mDEBUG[0m: sepp_state_operational(): OGS_EVENT_NAME_SBI_CLIENT (../src/sepp/sepp-sm.c:55) [32m08/26 13:45:47.374[0m: [[33msbi[0m] [1;37mDEBUG[0m: ogs_sbi_nf_state_registered(): OGS_EVENT_NAME_SBI_CLIENT (../lib/sbi/nf-sm.c:358) [32m08/26 13:45:47.630[0m: [[33msepp[0m] [1;37mDEBUG[0m: sepp_state_operational(): OGS_EVENT_NAME_SBI_TIMER (../src/sepp/sepp-sm.c:55) [32m08/26 13:45:47.630[0m: [[33msbi[0m] [1;37mDEBUG[0m: ogs_sbi_nf_state_registered(): OGS_EVENT_NAME_SBI_TIMER (../lib/sbi/nf-sm.c:358) [32m08/26 13:45:47.630[0m: [[33msbi[0m] [1;37mDEBUG[0m: [PATCH]
http://127.0.0.200:7777/nnrf-nfm/v1/nf-instances/2fb63fc4-a154-41f1-b8e8-15…
(../lib/sbi/client.c:797) [32m08/26 13:45:47.630[0m: [[33msbi[0m] [1;37mDEBUG[0m: SENDING...[100] (../lib/sbi/client.c:546) [32m08/26 13:45:47.631[0m: [[33msbi[0m] [1;37mDEBUG[0m: [{"op":"replace","path":"/nfStatus","value":"REGISTERED"},{"op":"replace","path":"/load","value":0}] (../lib/sbi/client.c:548) [32m08/26 13:45:47.631[0m: [[33msbi[0m] [1;37mDEBUG[0m: STREAM added [33] (../lib/sbi/nghttp2-server.c:1737) [32m08/26 13:45:47.631[0m: [[33msbi[0m] [1;37mDEBUG[0m: [PATCH] /nnrf-nfm/v1/nf-instances/2fb63fc4-a154-41f1-b8e8-15530b617c84 (../lib/sbi/nghttp2-server.c:1308) [32m08/26 13:45:47.631[0m: [[33msbi[0m] [1;37mDEBUG[0m: RECEIVED: 100 (../lib/sbi/nghttp2-server.c:1312) [32m08/26 13:45:47.631[0m: [[33msbi[0m] [1;37mDEBUG[0m: [{"op":"replace","path":"/nfStatus","value":"REGISTERED"},{"op":"replace","path":"/load","value":0}] (../lib/sbi/nghttp2-server.c:1314) [32m08/26 13:45:47.631[0m: [[33msbi[0m] [1;37mDEBUG[0m: [PATCH]
http://127.0.0.10:7777/nnrf-nfm/v1/nf-instances/2fb63fc4-a154-41f1-b8e8-155…
(../lib/sbi/client.c:797) [32m08/26 13:45:47.631[0m: [[33msbi[0m] [1;37mDEBUG[0m: SENDING...[100] (../lib/sbi/client.c:546) [32m08/26 13:45:47.631[0m: [[33msbi[0m] [1;37mDEBUG[0m: [{"op":"replace","path":"/nfStatus","value":"REGISTERED"},{"op":"replace","path":"/load","value":0}] (../lib/sbi/client.c:548) [32m08/26 13:45:47.632[0m: [[33msbi[0m] [1;37mDEBUG[0m: STREAM added [435] (../lib/sbi/nghttp2-server.c:1737) [32m08/26 13:45:47.632[0m: [[33msbi[0m] [1;37mDEBUG[0m: [PATCH] /nnrf-nfm/v1/nf-instances/2fb63fc4-a154-41f1-b8e8-15530b617c84 (../lib/sbi/nghttp2-server.c:1308) [32m08/26 13:45:47.632[0m: [[33msbi[0m] [1;37mDEBUG[0m: RECEIVED: 100 (../lib/sbi/nghttp2-server.c:1312) [32m08/26 13:45:47.632[0m: [[33msbi[0m] [1;37mDEBUG[0m: [{"op":"replace","path":"/nfStatus","value":"REGISTERED"},{"op":"replace","path":"/load","value":0}] (../lib/sbi/nghttp2-server.c:1314) [32m08/26 13:45:47.632[0m: [[33mnrf[0m] [1;37mDEBUG[0m: nrf_state_operational(): OGS_EVENT_NAME_SBI_SERVER (../src/nrf/nrf-sm.c:54) [32m08/26 13:45:47.632[0m: [[33mnrf[0m] [1;37mDEBUG[0m: nrf_nf_state_registered(): OGS_EVENT_NAME_SBI_SERVER (../src/nrf/nf-sm.c:201) [32m08/26 13:45:47.632[0m: [[33msbi[0m] [1;37mDEBUG[0m: STATUS [204] (../lib/sbi/nghttp2-server.c:702) [32m08/26 13:45:47.632[0m: [[33msbi[0m] [1;37mDEBUG[0m: STREAM closed [435] (../lib/sbi/nghttp2-server.c:1419) 0000: 00000301 05000001 b389e2be ............ [32m08/26 13:45:47.632[0m: [[33msbi[0m] [1;37mDEBUG[0m: [204:PATCH]
http://127.0.0.10:7777/nnrf-nfm/v1/nf-instances/2fb63fc4-a154-41f1-b8e8-155…
(../lib/sbi/client.c:744) [32m08/26 13:45:47.632[0m: [[33msbi[0m] [1;37mDEBUG[0m: RECEIVED[0] (../lib/sbi/client.c:755) [32m08/26 13:45:47.632[0m: [[33msbi[0m] [1;37mDEBUG[0m: STATUS [204] (../lib/sbi/nghttp2-server.c:702) [32m08/26 13:45:47.632[0m: [[33msbi[0m] [1;37mDEBUG[0m: STREAM closed [33] (../lib/sbi/nghttp2-server.c:1419) 0000: 00001a01 05000000 2189cb61 96e4593e ........!..a..Y> 0010: 94138a43 6cca0802 7140b371 a6ee34ea ...Cl...q@.q..4. 0020: 98b46f ..o [32m08/26 13:45:47.633[0m: [[33msbi[0m] [1;37mDEBUG[0m: [204:PATCH]
http://127.0.0.200:7777/nnrf-nfm/v1/nf-instances/2fb63fc4-a154-41f1-b8e8-15…
(../lib/sbi/client.c:744) [32m08/26 13:45:47.633[0m: [[33msbi[0m] [1;37mDEBUG[0m: RECEIVED[0] (../lib/sbi/client.c:755) [32m08/26 13:45:47.633[0m: [[33msepp[0m] [1;37mDEBUG[0m: sepp_state_operational(): OGS_EVENT_NAME_SBI_CLIENT (../src/sepp/sepp-sm.c:55) [32m08/26 13:45:47.633[0m: [[33msbi[0m] [1;37mDEBUG[0m: ogs_sbi_nf_state_registered(): OGS_EVENT_NAME_SBI_CLIENT (../lib/sbi/nf-sm.c:358) [32m08/26 13:45:47.786[0m: [[33mbsf[0m] [1;37mDEBUG[0m: bsf_state_operational(): OGS_EVENT_NAME_SBI_TIMER (../src/bsf/bsf-sm.c:59) [32m08/26 13:45:47.786[0m: [[33msbi[0m] [1;37mDEBUG[0m: ogs_sbi_nf_state_registered(): OGS_EVENT_NAME_SBI_TIMER (../lib/sbi/nf-sm.c:358) [32m08/26 13:45:47.787[0m: [[33msbi[0m] [1;37mDEBUG[0m: [PATCH]
http://127.0.0.200:7777/nnrf-nfm/v1/nf-instances/2fd7ced2-a154-41f1-aa85-63…
(../lib/sbi/client.c:797) [32m08/26 13:45:47.787[0m: [[33msbi[0m] [1;37mDEBUG[0m: SENDING...[100] (../lib/sbi/client.c:546) [32m08/26 13:45:47.787[0m: [[33msbi[0m] [1;37mDEBUG[0m: [{"op":"replace","path":"/nfStatus","value":"REGISTERED"},{"op":"replace","path":"/load","value":6}] (../lib/sbi/client.c:548) [32m08/26 13:45:47.787[0m: [[33msbi[0m] [1;37mDEBUG[0m: STREAM added [37] (../lib/sbi/nghttp2-server.c:1737) [32m08/26 13:45:47.787[0m: [[33msbi[0m] [1;37mDEBUG[0m: [PATCH] /nnrf-nfm/v1/nf-instances/2fd7ced2-a154-41f1-aa85-63608022bdf5 (../lib/sbi/nghttp2-server.c:1308) [32m08/26 13:45:47.787[0m: [[33msbi[0m] [1;37mDEBUG[0m: RECEIVED: 100 (../lib/sbi/nghttp2-server.c:1312) [32m08/26 13:45:47.787[0m: [[33msbi[0m] [1;37mDEBUG[0m: [{"op":"replace","path":"/nfStatus","value":"REGISTERED"},{"op":"replace","path":"/load","value":6}] (../lib/sbi/nghttp2-server.c:1314) [32m08/26 13:45:47.787[0m: [[33msbi[0m] [1;37mDEBUG[0m: [PATCH]
http://127.0.0.10:7777/nnrf-nfm/v1/nf-instances/2fd7ced2-a154-41f1-aa85-636…
(../lib/sbi/client.c:797) [32m08/26 13:45:47.788[0m: [[33msbi[0m] [1;37mDEBUG[0m: SENDING...[100] (../lib/sbi/client.c:546) [32m08/26 13:45:47.788[0m: [[33msbi[0m] [1;37mDEBUG[0m: [{"op":"replace","path":"/nfStatus","value":"REGISTERED"},{"op":"replace","path":"/load","value":6}] (../lib/sbi/client.c:548) [32m08/26 13:45:47.788[0m: [[33msbi[0m] [1;37mDEBUG[0m: STREAM added [437] (../lib/sbi/nghttp2-server.c:1737) [32m08/26 13:45:47.788[0m: [[33msbi[0m] [1;37mDEBUG[0m: [PATCH] /nnrf-nfm/v1/nf-instances/2fd7ced2-a154-41f1-aa85-63608022bdf5 (../lib/sbi/nghttp2-server.c:1308) [32m08/26 13:45:47.788[0m: [[33msbi[0m] [1;37mDEBUG[0m: RECEIVED: 100 (../lib/sbi/nghttp2-server.c:1312) [32m08/26 13:45:47.788[0m: [[33msbi[0m] [1;37mDEBUG[0m: [{"op":"replace","path":"/nfStatus","value":"REGISTERED"},{"op":"replace","path":"/load","value":6}] (../lib/sbi/nghttp2-server.c:1314) [32m08/26 13:45:47.788[0m: [[33mnrf[0m] [1;37mDEBUG[0m: nrf_state_operational(): OGS_EVENT_NAME_SBI_SERVER (../src/nrf/nrf-sm.c:54) [32m08/26 13:45:47.788[0m: [[33mnrf[0m] [1;37mDEBUG[0m: nrf_nf_state_registered(): OGS_EVENT_NAME_SBI_SERVER (../src/nrf/nf-sm.c:201) [32m08/26 13:45:47.788[0m: [[33msbi[0m] [1;37mDEBUG[0m: STATUS [204] (../lib/sbi/nghttp2-server.c:702) [32m08/26 13:45:47.788[0m: [[33msbi[0m] [1;37mDEBUG[0m: STREAM closed [437] (../lib/sbi/nghttp2-server.c:1419) 0000: 00000301 05000001 b589e2be ............ [32m08/26 13:45:47.789[0m: [[33msbi[0m] [1;37mDEBUG[0m: [204:PATCH]
http://127.0.0.10:7777/nnrf-nfm/v1/nf-instances/2fd7ced2-a154-41f1-aa85-636…
(../lib/sbi/client.c:744) [32m08/26 13:45:47.789[0m: [[33msbi[0m] [1;37mDEBUG[0m: RECEIVED[0] (../lib/sbi/client.c:755) [32m08/26 13:45:47.789[0m: [[33msbi[0m] [1;37mDEBUG[0m: STATUS [204] (../lib/sbi/nghttp2-server.c:702) [32m08/26 13:45:47.789[0m: [[33msbi[0m] [1;37mDEBUG[0m: STREAM closed [37] (../lib/sbi/nghttp2-server.c:1419) 0000: 00001a01 05000000 2589cb61 96e4593e ........%..a..Y> 0010: 94138a43 6cca0802 7140b371 a6ee34ea ...Cl...q@.q..4. 0020: 98b46f ..o [32m08/26 13:45:47.789[0m: [[33msbi[0m] [1;37mDEBUG[0m: [204:PATCH]
http://127.0.0.200:7777/nnrf-nfm/v1/nf-instances/2fd7ced2-a154-41f1-aa85-63…
(../lib/sbi/client.c:744) [32m08/26 13:45:47.789[0m: [[33msbi[0m] [1;37mDEBUG[0m: RECEIVED[0] (../lib/sbi/client.c:755) [32m08/26 13:45:47.789[0m: [[33mbsf[0m] [1;37mDEBUG[0m: bsf_state_operational(): OGS_EVENT_NAME_SBI_CLIENT (../src/bsf/bsf-sm.c:59) [32m08/26 13:45:47.789[0m: [[33msbi[0m] [1;37mDEBUG[0m: ogs_sbi_nf_state_registered(): OGS_EVENT_NAME_SBI_CLIENT (../lib/sbi/nf-sm.c:358) [32m08/26 13:45:48.106[0m: [[33msmf[0m] [1;37mDEBUG[0m: smf_state_operational(): OGS_EVENT_NAME_SBI_TIMER (../src/smf/smf-sm.c:94) [32m08/26 13:45:48.106[0m: [[33msbi[0m] [1;37mDEBUG[0m: ogs_sbi_nf_state_registered(): OGS_EVENT_NAME_SBI_TIMER (../lib/sbi/nf-sm.c:358) [32m08/26 13:45:48.107[0m: [[33msbi[0m] [1;37mDEBUG[0m: [PATCH]
http://127.0.0.200:7777/nnrf-nfm/v1/nf-instances/300a2ce2-a154-41f1-bf9b-d1…
(../lib/sbi/client.c:797) [32m08/26 13:45:48.107[0m: [[33msbi[0m] [1;37mDEBUG[0m: SENDING...[100] (../lib/sbi/client.c:546) [32m08/26 13:45:48.107[0m: [[33msbi[0m] [1;37mDEBUG[0m: [{"op":"replace","path":"/nfStatus","value":"REGISTERED"},{"op":"replace","path":"/load","value":6}] (../lib/sbi/client.c:548) [32m08/26 13:45:48.107[0m: [[33msbi[0m] [1;37mDEBUG[0m: STREAM added [7321] (../lib/sbi/nghttp2-server.c:1737) [32m08/26 13:45:48.107[0m: [[33msbi[0m] [1;37mDEBUG[0m: [PATCH] /nnrf-nfm/v1/nf-instances/300a2ce2-a154-41f1-bf9b-d1c16010b0f1 (../lib/sbi/nghttp2-server.c:1308) [32m08/26 13:45:48.107[0m: [[33msbi[0m] [1;37mDEBUG[0m: RECEIVED: 100 (../lib/sbi/nghttp2-server.c:1312) [32m08/26 13:45:48.107[0m: [[33msbi[0m] [1;37mDEBUG[0m: [{"op":"replace","path":"/nfStatus","value":"REGISTERED"},{"op":"replace","path":"/load","value":6}] (../lib/sbi/nghttp2-server.c:1314) [32m08/26 13:45:48.107[0m: [[33msbi[0m] [1;37mDEBUG[0m: [PATCH]
http://127.0.0.10:7777/nnrf-nfm/v1/nf-instances/300a2ce2-a154-41f1-bf9b-d1c…
(../lib/sbi/client.c:797) [32m08/26 13:45:48.107[0m: [[33msbi[0m] [1;37mDEBUG[0m: SENDING...[100] (../lib/sbi/client.c:546) [32m08/26 13:45:48.107[0m: [[33msbi[0m] [1;37mDEBUG[0m: [{"op":"replace","path":"/nfStatus","value":"REGISTERED"},{"op":"replace","path":"/load","value":6}] (../lib/sbi/client.c:548) [32m08/26 13:45:48.108[0m: [[33msbi[0m] [1;37mDEBUG[0m: STREAM added [439] (../lib/sbi/nghttp2-server.c:1737) [32m08/26 13:45:48.108[0m: [[33msbi[0m] [1;37mDEBUG[0m: [PATCH] /nnrf-nfm/v1/nf-instances/300a2ce2-a154-41f1-bf9b-d1c16010b0f1 (../lib/sbi/nghttp2-server.c:1308) [32m08/26 13:45:48.108[0m: [[33msbi[0m] [1;37mDEBUG[0m: RECEIVED: 100 (../lib/sbi/nghttp2-server.c:1312) [32m08/26 13:45:48.108[0m: [[33msbi[0m] [1;37mDEBUG[0m: [{"op":"replace","path":"/nfStatus","value":"REGISTERED"},{"op":"replace","path":"/load","value":6}] (../lib/sbi/nghttp2-server.c:1314) [32m08/26 13:45:48.108[0m: [[33mnrf[0m] [1;37mDEBUG[0m: nrf_state_operational(): OGS_EVENT_NAME_SBI_SERVER (../src/nrf/nrf-sm.c:54) [32m08/26 13:45:48.108[0m: [[33mnrf[0m] [1;37mDEBUG[0m: nrf_nf_state_registered(): OGS_EVENT_NAME_SBI_SERVER (../src/nrf/nf-sm.c:201) [32m08/26 13:45:48.108[0m: [[33msbi[0m] [1;37mDEBUG[0m: STATUS [204] (../lib/sbi/nghttp2-server.c:702) [32m08/26 13:45:48.108[0m: [[33msbi[0m] [1;37mDEBUG[0m: STREAM closed [439] (../lib/sbi/nghttp2-server.c:1419) 0000: 00001a01 05000001 b789e261 96e4593e ...........a..Y> 0010: 94138a43 6cca0802 7140b371 a6ee34f2 ...Cl...q@.q..4. 0020: 98b46f ..o [32m08/26 13:45:48.108[0m: [[33msbi[0m] [1;37mDEBUG[0m: [204:PATCH]
http://127.0.0.10:7777/nnrf-nfm/v1/nf-instances/300a2ce2-a154-41f1-bf9b-d1c…
(../lib/sbi/client.c:744) [32m08/26 13:45:48.108[0m: [[33msbi[0m] [1;37mDEBUG[0m: RECEIVED[0] (../lib/sbi/client.c:755) [32m08/26 13:45:48.108[0m: [[33msbi[0m] [1;37mDEBUG[0m: STATUS [204] (../lib/sbi/nghttp2-server.c:702) [32m08/26 13:45:48.108[0m: [[33msbi[0m] [1;37mDEBUG[0m: STREAM closed [7321] (../lib/sbi/nghttp2-server.c:1419) 0000: 00001a01 0500001c 9989e461 96e4593e ...........a..Y> 0010: 94138a43 6cca0802 7140b371 a6ee34f2 ...Cl...q@.q..4. 0020: 98b46f ..o [32m08/26 13:45:48.109[0m: [[33msbi[0m] [1;37mDEBUG[0m: [204:PATCH]
http://127.0.0.200:7777/nnrf-nfm/v1/nf-instances/300a2ce2-a154-41f1-bf9b-d1…
(../lib/sbi/client.c:744) [32m08/26 13:45:48.109[0m: [[33msbi[0m] [1;37mDEBUG[0m: RECEIVED[0] (../lib/sbi/client.c:755) [32m08/26 13:45:48.109[0m: [[33msmf[0m] [1;37mDEBUG[0m: smf_state_operational(): OGS_EVENT_NAME_SBI_CLIENT (../src/smf/smf-sm.c:94) [32m08/26 13:45:48.109[0m: [[33msbi[0m] [1;37mDEBUG[0m: ogs_sbi_nf_state_registered(): OGS_EVENT_NAME_SBI_CLIENT (../lib/sbi/nf-sm.c:358) MTC@f3254cbf2c87: External command `<
https://jenkins.osmocom.org/jenkins/job/ttcn3-5gc-test-ogs-latest/ws/ttcn3-…
> C5G_Tests.TC_ng_register_ping46 error' was executed successfully (exit status: 0). MTC@f3254cbf2c87: Starting external command `<
https://jenkins.osmocom.org/jenkins/job/ttcn3-5gc-test-ogs-latest/ws/ttcn3-…
> C5G_Tests.TC_ng_register_ping46_256'. [32m08/26 13:45:48.406[0m: [[33mausf[0m] [1;37mDEBUG[0m: ausf_state_operational(): OGS_EVENT_NAME_SBI_TIMER (../src/ausf/ausf-sm.c:56) [32m08/26 13:45:48.406[0m: [[33msbi[0m] [1;37mDEBUG[0m: ogs_sbi_nf_state_registered(): OGS_EVENT_NAME_SBI_TIMER (../lib/sbi/nf-sm.c:358) [32m08/26 13:45:48.406[0m: [[33msbi[0m] [1;37mDEBUG[0m: [PATCH]
http://127.0.0.200:7777/nnrf-nfm/v1/nf-instances/3039a206-a154-41f1-9007-f5…
(../lib/sbi/client.c:797) [32m08/26 13:45:48.406[0m: [[33msbi[0m] [1;37mDEBUG[0m: SENDING...[101] (../lib/sbi/client.c:546) [32m08/26 13:45:48.406[0m: [[33msbi[0m] [1;37mDEBUG[0m: [{"op":"replace","path":"/nfStatus","value":"REGISTERED"},{"op":"replace","path":"/load","value":25}] (../lib/sbi/client.c:548) [32m08/26 13:45:48.406[0m: [[33msbi[0m] [1;37mDEBUG[0m: STREAM added [3163] (../lib/sbi/nghttp2-server.c:1737) [32m08/26 13:45:48.406[0m: [[33msbi[0m] [1;37mDEBUG[0m: [PATCH] /nnrf-nfm/v1/nf-instances/3039a206-a154-41f1-9007-f5679e5e8c5d (../lib/sbi/nghttp2-server.c:1308) [32m08/26 13:45:48.406[0m: [[33msbi[0m] [1;37mDEBUG[0m: RECEIVED: 101 (../lib/sbi/nghttp2-server.c:1312) [32m08/26 13:45:48.406[0m: [[33msbi[0m] [1;37mDEBUG[0m: [{"op":"replace","path":"/nfStatus","value":"REGISTERED"},{"op":"replace","path":"/load","value":25}] (../lib/sbi/nghttp2-server.c:1314) [32m08/26 13:45:48.406[0m: [[33msbi[0m] [1;37mDEBUG[0m: [PATCH]
http://127.0.0.10:7777/nnrf-nfm/v1/nf-instances/3039a206-a154-41f1-9007-f56…
(../lib/sbi/client.c:797) [32m08/26 13:45:48.406[0m: [[33msbi[0m] [1;37mDEBUG[0m: SENDING...[101] (../lib/sbi/client.c:546) [32m08/26 13:45:48.406[0m: [[33msbi[0m] [1;37mDEBUG[0m: [{"op":"replace","path":"/nfStatus","value":"REGISTERED"},{"op":"replace","path":"/load","value":25}] (../lib/sbi/client.c:548) [32m08/26 13:45:48.407[0m: [[33msbi[0m] [1;37mDEBUG[0m: STREAM added [441] (../lib/sbi/nghttp2-server.c:1737) [32m08/26 13:45:48.407[0m: [[33msbi[0m] [1;37mDEBUG[0m: [PATCH] /nnrf-nfm/v1/nf-instances/3039a206-a154-41f1-9007-f5679e5e8c5d (../lib/sbi/nghttp2-server.c:1308) [32m08/26 13:45:48.407[0m: [[33msbi[0m] [1;37mDEBUG[0m: RECEIVED: 101 (../lib/sbi/nghttp2-server.c:1312) [32m08/26 13:45:48.407[0m: [[33msbi[0m] [1;37mDEBUG[0m: [{"op":"replace","path":"/nfStatus","value":"REGISTERED"},{"op":"replace","path":"/load","value":25}] (../lib/sbi/nghttp2-server.c:1314) [32m08/26 13:45:48.407[0m: [[33mnrf[0m] [1;37mDEBUG[0m: nrf_state_operational(): OGS_EVENT_NAME_SBI_SERVER (../src/nrf/nrf-sm.c:54) [32m08/26 13:45:48.407[0m: [[33mnrf[0m] [1;37mDEBUG[0m: nrf_nf_state_registered(): OGS_EVENT_NAME_SBI_SERVER (../src/nrf/nf-sm.c:201) [32m08/26 13:45:48.407[0m: [[33msbi[0m] [1;37mDEBUG[0m: STATUS [204] (../lib/sbi/nghttp2-server.c:702) [32m08/26 13:45:48.407[0m: [[33msbi[0m] [1;37mDEBUG[0m: STREAM closed [441] (../lib/sbi/nghttp2-server.c:1419) 0000: 00000301 05000001 b989e3be ............ [32m08/26 13:45:48.407[0m: [[33msbi[0m] [1;37mDEBUG[0m: [204:PATCH]
http://127.0.0.10:7777/nnrf-nfm/v1/nf-instances/3039a206-a154-41f1-9007-f56…
(../lib/sbi/client.c:744) [32m08/26 13:45:48.407[0m: [[33msbi[0m] [1;37mDEBUG[0m: RECEIVED[0] (../lib/sbi/client.c:755) [32m08/26 13:45:48.407[0m: [[33msbi[0m] [1;37mDEBUG[0m: STATUS [204] (../lib/sbi/nghttp2-server.c:702) [32m08/26 13:45:48.407[0m: [[33msbi[0m] [1;37mDEBUG[0m: STREAM closed [3163] (../lib/sbi/nghttp2-server.c:1419) 0000: 00001a01 0500000c 5b89eb61 96e4593e ........[..a..Y> 0010: 94138a43 6cca0802 7140b371 a6ee34f2 ...Cl...q@.q..4. 0020: 98b46f ..o [32m08/26 13:45:48.407[0m: [[33msbi[0m] [1;37mDEBUG[0m: [204:PATCH]
http://127.0.0.200:7777/nnrf-nfm/v1/nf-instances/3039a206-a154-41f1-9007-f5…
(../lib/sbi/client.c:744) [32m08/26 13:45:48.407[0m: [[33msbi[0m] [1;37mDEBUG[0m: RECEIVED[0] (../lib/sbi/client.c:755) [32m08/26 13:45:48.407[0m: [[33mausf[0m] [1;37mDEBUG[0m: ausf_state_operational(): OGS_EVENT_NAME_SBI_CLIENT (../src/ausf/ausf-sm.c:56) [32m08/26 13:45:48.407[0m: [[33msbi[0m] [1;37mDEBUG[0m: ogs_sbi_nf_state_registered(): OGS_EVENT_NAME_SBI_CLIENT (../lib/sbi/nf-sm.c:358) ------ C5G_Tests.TC_ng_register_ping46_256 ------ (13:45:48) load average: 4.08, 5.87, 4.87 /usr/bin/dumpcap -q -s 1520 -n -i any -w "<
https://jenkins.osmocom.org/jenkins/job/ttcn3-5gc-test-ogs-latest/287/artif…
"> ><
https://jenkins.osmocom.org/jenkins/job/ttcn3-5gc-test-ogs-latest/287/artif…
> 2>/tmp/cmderr & Waiting for packet dumper to start... 0 [1;34m[testenv] Stopping podman container[0m [0;94m[testenv] + ['podman', 'kill', 'testenv-5gc-osmocom-latest-20260826-1343-0ab2c250-1'][0m [32m08/26 13:45:48.582[0m: [[33mudm[0m] [1;37mDEBUG[0m: udm_state_operational(): OGS_EVENT_NAME_SBI_TIMER (../src/udm/udm-sm.c:61) [32m08/26 13:45:48.582[0m: [[33msbi[0m] [1;37mDEBUG[0m: ogs_sbi_nf_state_registered(): OGS_EVENT_NAME_SBI_TIMER (../lib/sbi/nf-sm.c:358) [32m08/26 13:45:48.582[0m: [[33msbi[0m] [1;37mDEBUG[0m: [PATCH]
http://127.0.0.200:7777/nnrf-nfm/v1/nf-instances/305555c8-a154-41f1-9421-d7…
(../lib/sbi/client.c:797) [32m08/26 13:45:48.582[0m: [[33msbi[0m] [1;37mDEBUG[0m: SENDING...[101] (../lib/sbi/client.c:546) [32m08/26 13:45:48.582[0m: [[33msbi[0m] [1;37mDEBUG[0m: [{"op":"replace","path":"/nfStatus","value":"REGISTERED"},{"op":"replace","path":"/load","value":25}] (../lib/sbi/client.c:548) [32m08/26 13:45:48.582[0m: [[33msbi[0m] [1;37mDEBUG[0m: STREAM added [9413] (../lib/sbi/nghttp2-server.c:1737) [32m08/26 13:45:48.582[0m: [[33msbi[0m] [1;37mDEBUG[0m: [PATCH] /nnrf-nfm/v1/nf-instances/305555c8-a154-41f1-9421-d7ba35ad20aa (../lib/sbi/nghttp2-server.c:1308) [32m08/26 13:45:48.582[0m: [[33msbi[0m] [1;37mDEBUG[0m: RECEIVED: 101 (../lib/sbi/nghttp2-server.c:1312) [32m08/26 13:45:48.582[0m: [[33msbi[0m] [1;37mDEBUG[0m: [{"op":"replace","path":"/nfStatus","value":"REGISTERED"},{"op":"replace","path":"/load","value":25}] (../lib/sbi/nghttp2-server.c:1314) [32m08/26 13:45:48.582[0m: [[33msbi[0m] [1;37mDEBUG[0m: [PATCH]
http://127.0.0.10:7777/nnrf-nfm/v1/nf-instances/305555c8-a154-41f1-9421-d7b…
(../lib/sbi/client.c:797) [32m08/26 13:45:48.582[0m: [[33msbi[0m] [1;37mDEBUG[0m: SENDING...[101] (../lib/sbi/client.c:546) [32m08/26 13:45:48.582[0m: [[33msbi[0m] [1;37mDEBUG[0m: [{"op":"replace","path":"/nfStatus","value":"REGISTERED"},{"op":"replace","path":"/load","value":25}] (../lib/sbi/client.c:548) [32m08/26 13:45:48.582[0m: [[33msbi[0m] [1;37mDEBUG[0m: STREAM added [443] (../lib/sbi/nghttp2-server.c:1737) [32m08/26 13:45:48.582[0m: [[33msbi[0m] [1;37mDEBUG[0m: [PATCH] /nnrf-nfm/v1/nf-instances/305555c8-a154-41f1-9421-d7ba35ad20aa (../lib/sbi/nghttp2-server.c:1308) [32m08/26 13:45:48.582[0m: [[33msbi[0m] [1;37mDEBUG[0m: RECEIVED: 101 (../lib/sbi/nghttp2-server.c:1312) [32m08/26 13:45:48.582[0m: [[33msbi[0m] [1;37mDEBUG[0m: [{"op":"replace","path":"/nfStatus","value":"REGISTERED"},{"op":"replace","path":"/load","value":25}] (../lib/sbi/nghttp2-server.c:1314) [32m08/26 13:45:48.582[0m: [[33mnrf[0m] [1;37mDEBUG[0m: nrf_state_operational(): OGS_EVENT_NAME_SBI_SERVER (../src/nrf/nrf-sm.c:54) [32m08/26 13:45:48.582[0m: [[33mnrf[0m] [1;37mDEBUG[0m: nrf_nf_state_registered(): OGS_EVENT_NAME_SBI_SERVER (../src/nrf/nf-sm.c:201) [32m08/26 13:45:48.582[0m: [[33msbi[0m] [1;37mDEBUG[0m: STATUS [204] (../lib/sbi/nghttp2-server.c:702) [32m08/26 13:45:48.582[0m: [[33msbi[0m] [1;37mDEBUG[0m: STREAM closed [443] (../lib/sbi/nghttp2-server.c:1419) 0000: 00000301 05000001 bb89e3be ............ [32m08/26 13:45:48.582[0m: [[33msbi[0m] [1;37mDEBUG[0m: [204:PATCH]
http://127.0.0.10:7777/nnrf-nfm/v1/nf-instances/305555c8-a154-41f1-9421-d7b…
(../lib/sbi/client.c:744) [32m08/26 13:45:48.582[0m: [[33msbi[0m] [1;37mDEBUG[0m: RECEIVED[0] (../lib/sbi/client.c:755) [32m08/26 13:45:48.582[0m: [[33msbi[0m] [1;37mDEBUG[0m: STATUS [204] (../lib/sbi/nghttp2-server.c:702) [32m08/26 13:45:48.582[0m: [[33msbi[0m] [1;37mDEBUG[0m: STREAM closed [9413] (../lib/sbi/nghttp2-server.c:1419) 0000: 00001a01 05000024 c589ef61 96e4593e .......$...a..Y> 0010: 94138a43 6cca0802 7140b371 a6ee34f2 ...Cl...q@.q..4. 0020: 98b46f ..o [32m08/26 13:45:48.583[0m: [[33msbi[0m] [1;37mDEBUG[0m: [204:PATCH]
http://127.0.0.200:7777/nnrf-nfm/v1/nf-instances/305555c8-a154-41f1-9421-d7…
(../lib/sbi/client.c:744) [32m08/26 13:45:48.583[0m: [[33msbi[0m] [1;37mDEBUG[0m: RECEIVED[0] (../lib/sbi/client.c:755) [32m08/26 13:45:48.583[0m: [[33mudm[0m] [1;37mDEBUG[0m: udm_state_operational(): OGS_EVENT_NAME_SBI_CLIENT (../src/udm/udm-sm.c:61) [32m08/26 13:45:48.583[0m: [[33msbi[0m] [1;37mDEBUG[0m: ogs_sbi_nf_state_registered(): OGS_EVENT_NAME_SBI_CLIENT (../lib/sbi/nf-sm.c:358) testenv-5gc-osmocom-latest-20260826-1343-0ab2c250-1 [0;94m[testenv] Skipping clean up scripts, podman container has already stopped[0m [1;34m[testenv] Stopping testsuite (3853148)[0m Error: container has already been removed Error: container has already been removed Error: container has already been removed [0;94m[testenv] feed_watchdog_loop: podman container has stopped[0m [1;34m[testenv] Logs saved to:
https://jenkins.osmocom.org/jenkins/job/ttcn3-5gc-test-ogs-latest/287/artif…
[0m + RC=1 + [ 1 = 0 ] + uptime + grep --color=always -o load.* [01;31m[Kload average: 4.08, 5.87, 4.87[m[K + exit 1 Build step 'Execute shell' marked build as failure Recording test results [Checks API] No suitable checks publisher found.
1
0
0
0
Build failed in Jenkins: ttcn3-bts-test #3244
by jenkins@lists.osmocom.org
26 Aug '26
26 Aug '26
See <
https://jenkins.osmocom.org/jenkins/job/ttcn3-bts-test/3244/display/redirect
> Changes: ------------------------------------------ [...truncated 12.60 MiB...] <failure type='fail-verdict'>"BTS_Tests.ttcn:732 : Tguard timeout" BTS_Tests.ttcn:9557 BTS_Tests control part BTS_Tests.ttcn:7525 TC_rll_rel_req testcase </failure> </testcase> <testcase classname='BTS_Tests:hopping' name='TC_rll_unit_data_req_DCCH' time='2.117695'/> <testcase classname='BTS_Tests:hopping' name='TC_rll_unit_data_req_ACCH' time='5.295519'/> <testcase classname='BTS_Tests:hopping' name='TC_rll_unit_data_ind_DCCH' time='2.913204'/> <testcase classname='BTS_Tests:hopping' name='TC_rll_unit_data_ind_ACCH' time='10.567383'/> <testcase classname='BTS_Tests:hopping' name='TC_chan_act_a51' time='2.652164'/> <testcase classname='BTS_Tests:hopping' name='TC_chan_act_a52' time='2.756586'/> <testcase classname='BTS_Tests:hopping' name='TC_chan_act_a53' time='2.739691'/> <testcase classname='BTS_Tests:hopping' name='TC_chan_act_a54' time='2.723807'/> <testcase classname='BTS_Tests:hopping' name='TC_encr_cmd_a51' time='5.280650'/> <testcase classname='BTS_Tests:hopping' name='TC_encr_cmd_a52' time='5.227337'/> <testcase classname='BTS_Tests:hopping' name='TC_encr_cmd_a53' time='5.148172'/> <testcase classname='BTS_Tests:hopping' name='TC_encr_cmd_a54' time='5.233058'/> <testcase classname='BTS_Tests:hopping' name='TC_err_rep_wrong_mdisc' time='1.205502'/> <testcase classname='BTS_Tests:hopping' name='TC_err_rep_wrong_msg_type' time='1.268555'/> <testcase classname='BTS_Tests:hopping' name='TC_err_rep_wrong_sequence' time='1.238923'/> <testcase classname='BTS_Tests:hopping' name='TC_lapdm_selftest' time='0.002955'/> <testcase classname='BTS_Tests:hopping' name='TC_tch_sign_l2_fill_frame' time='18.500021'/> <testcase classname='BTS_Tests:hopping' name='TC_tch_sign_l2_fill_frame_dtxd' time='1.984618'> <failure type='fail-verdict'>Received DTX TCH fill frame with bad frame number: 175 (mod 104: 71) (mod 26: 19) BTS_Tests.ttcn:9579 BTS_Tests control part BTS_Tests.ttcn:8110 TC_tch_sign_l2_fill_frame_dtxd testcase </failure> </testcase> <testcase classname='BTS_Tests:hopping' name='TC_chopped_ipa_ping' time='24.707376'/> <testcase classname='BTS_Tests:hopping' name='TC_chopped_ipa_payload' time='42.613122'/> <testcase classname='BTS_Tests:hopping' name='TC_ms_pwr_ctrl_constant' time='16.462220'/> <testcase classname='BTS_Tests:hopping' name='TC_ms_pwr_ctrl_pf_ewma' time='31.574722'/> <testcase classname='BTS_Tests:hopping' name='TC_speech_no_rtp_tchf' time='7.367614'/> <testcase classname='BTS_Tests:hopping' name='TC_speech_no_rtp_tchh' time='5.421244'/> <testcase classname='BTS_Tests:hopping' name='TC_speech_rtp_tchf' time='7.548002'/> <testcase classname='BTS_Tests:hopping' name='TC_speech_rtp_tchh' time='5.415715'/> <testcase classname='BTS_Tests:hopping' name='TC_speech_osmux_tchf' time='3.315989'/> <testcase classname='BTS_Tests:hopping' name='TC_speech_osmux_tchh' time='3.479924'/> <testcase classname='BTS_Tests:hopping' name='TC_data_rtp_tchf144' time='2.152001'/> <testcase classname='BTS_Tests:hopping' name='TC_data_rtp_tchf96' time='2.125280'/> <testcase classname='BTS_Tests:hopping' name='TC_data_rtp_tchf48' time='2.140429'/> <testcase classname='BTS_Tests:hopping' name='TC_data_rtp_tchh48' time='5.343604'> <failure type='fail-verdict'>Timeout waiting for matching Downlink data frame BTS_Tests.ttcn:9597 BTS_Tests control part BTS_Tests.ttcn:8880 TC_data_rtp_tchh48 testcase </failure> </testcase> <testcase classname='BTS_Tests:hopping' name='TC_data_rtp_tchf24' time='1.765006'/> <testcase classname='BTS_Tests:hopping' name='TC_data_rtp_tchh24' time='5.365565'> <failure type='fail-verdict'>Timeout waiting for matching Downlink data frame BTS_Tests.ttcn:9599 BTS_Tests control part BTS_Tests.ttcn:8949 TC_data_rtp_tchh24 testcase </failure> </testcase> <testcase classname='BTS_Tests:hopping' name='TC_data_facch_tchf144' time='2.056670'/> <testcase classname='BTS_Tests:hopping' name='TC_data_facch_tchf96' time='2.043067'/> <testcase classname='BTS_Tests:hopping' name='TC_data_facch_tchf48' time='2.032552'/> <testcase classname='BTS_Tests:hopping' name='TC_data_facch_tchh48' time='2.196818'/> <testcase classname='BTS_Tests:hopping' name='TC_data_facch_tchf24' time='2.040241'/> <testcase classname='BTS_Tests:hopping' name='TC_data_facch_tchh24' time='2.194105'/> <testcase classname='BTS_Tests:hopping' name='TC_early_immediate_assignment' time='3.554200'/> <testcase classname='BTS_Tests:hopping' name='TC_acch_overpower_rxqual_thresh' time='9.072371'> <failure type='fail-verdict'>Timeout waiting for L1CTL DATA.ind BTS_Tests.ttcn:9610 BTS_Tests control part BTS_Tests.ttcn:9244 TC_acch_overpower_rxqual_thresh testcase </failure> </testcase> <testcase classname='BTS_Tests:hopping' name='TC_acch_overpower_rxqual_thresh_dtx' time='9.048062'> <failure type='fail-verdict'>Timeout waiting for L1CTL DATA.ind BTS_Tests.ttcn:9611 BTS_Tests control part BTS_Tests.ttcn:9285 TC_acch_overpower_rxqual_thresh_dtx testcase </failure> </testcase> <testcase classname='BTS_Tests:hopping' name='TC_acch_overpower_always_on_facch' time='9.025469'> <failure type='fail-verdict'>Timeout waiting for L1CTL DATA.ind BTS_Tests.ttcn:9612 BTS_Tests control part BTS_Tests.ttcn:9317 TC_acch_overpower_always_on_facch testcase </failure> </testcase> <testcase classname='BTS_Tests:hopping' name='TC_acch_overpower_always_on_sacch' time='9.046429'> <failure type='fail-verdict'>Timeout waiting for L1CTL DATA.ind BTS_Tests.ttcn:9613 BTS_Tests control part BTS_Tests.ttcn:9349 TC_acch_overpower_always_on_sacch testcase </failure> </testcase> <testcase classname='BTS_Tests:hopping' name='TC_acch_overpower_limit' time='9.051739'> <failure type='fail-verdict'>Timeout waiting for L1CTL DATA.ind BTS_Tests.ttcn:9614 BTS_Tests control part BTS_Tests.ttcn:9380 TC_acch_overpower_limit testcase </failure> </testcase> <testcase classname='BTS_Tests_SMSCB:hopping' name='TC_cbch_load_idle_no_cbch' time='11.174637'/> <testcase classname='BTS_Tests_SMSCB:hopping' name='TC_sms_cb_cmd_sdcch4_1block' time='14.316260'/> <testcase classname='BTS_Tests_SMSCB:hopping' name='TC_sms_cb_cmd_sdcch4_2block' time='14.209365'/> <testcase classname='BTS_Tests_SMSCB:hopping' name='TC_sms_cb_cmd_sdcch4_3block' time='14.220695'/> <testcase classname='BTS_Tests_SMSCB:hopping' name='TC_sms_cb_cmd_sdcch4_4block' time='14.195693'/> <testcase classname='BTS_Tests_SMSCB:hopping' name='TC_sms_cb_cmd_sdcch4_multi' time='20.186697'/> <testcase classname='BTS_Tests_SMSCB:hopping' name='TC_sms_cb_cmd_sdcch4_schedule' time='14.177057'/> <testcase classname='BTS_Tests_SMSCB:hopping' name='TC_sms_cb_cmd_sdcch4_default_only' time='16.210282'/> <testcase classname='BTS_Tests_SMSCB:hopping' name='TC_sms_cb_cmd_sdcch4_default_and_normal' time='17.194915'/> <testcase classname='BTS_Tests_SMSCB:hopping' name='TC_sms_cb_cmd_sdcch4_default_then_null' time='26.163237'/> <testcase classname='BTS_Tests_SMSCB:hopping' name='TC_cbc_sdcch4_load_idle' time='16.098525'/> <testcase classname='BTS_Tests_SMSCB:hopping' name='TC_cbc_sdcch4_load_overload' time='18.262184'/> <testcase classname='BTS_Tests_SMSCB:hopping' name='TC_sms_cb_cmd_sdcch8_1block' time='14.213898'/> <testcase classname='BTS_Tests_SMSCB:hopping' name='TC_sms_cb_cmd_sdcch8_2block' time='14.222185'/> <testcase classname='BTS_Tests_SMSCB:hopping' name='TC_sms_cb_cmd_sdcch8_3block' time='14.217344'/> <testcase classname='BTS_Tests_SMSCB:hopping' name='TC_sms_cb_cmd_sdcch8_4block' time='14.254603'/> <testcase classname='BTS_Tests_SMSCB:hopping' name='TC_sms_cb_cmd_sdcch8_multi' time='20.218236'/> <testcase classname='BTS_Tests_SMSCB:hopping' name='TC_sms_cb_cmd_sdcch8_schedule' time='14.196205'/> <testcase classname='BTS_Tests_SMSCB:hopping' name='TC_sms_cb_cmd_sdcch8_default_only' time='16.196782'/> <testcase classname='BTS_Tests_SMSCB:hopping' name='TC_sms_cb_cmd_sdcch8_default_and_normal' time='21.040261'/> <testcase classname='BTS_Tests_SMSCB:hopping' name='TC_cbc_sdcch8_load_idle' time='16.155309'/> <testcase classname='BTS_Tests_SMSCB:hopping' name='TC_cbc_sdcch8_load_overload' time='18.221300'/> <testcase classname='BTS_Tests_SMSCB:hopping' name='TC_etws_p1ro' time='12.177901'/> <testcase classname='BTS_Tests_SMSCB:hopping' name='TC_etws_p1ro_end' time='16.164010'/> <testcase classname='BTS_Tests_SMSCB:hopping' name='TC_etws_pcu' time='1.143598'/> <testcase classname='BTS_Tests_LAPDm:hopping' name='TC_sabm_ua_dcch_sapi0' time='2.867387'/> <testcase classname='BTS_Tests_LAPDm:hopping' name='TC_sabm_ua_dcch_sapi0_nopayload' time='21.488380'/> <testcase classname='BTS_Tests_LAPDm:hopping' name='TC_sabm_ua_dcch_sapi3' time='21.303407'/> <testcase classname='BTS_Tests_LAPDm:hopping' name='TC_sabm_ua_dcch_sapi4' time='21.266235'/> <testcase classname='BTS_Tests_LAPDm:hopping' name='TC_sabm_contention' time='21.278532'/> <testcase classname='BTS_Tests_LAPDm:hopping' name='TC_sabm_retransmit' time='3.181031'/> <testcase classname='BTS_Tests_LAPDm:hopping' name='TC_sabm_retransmit_bts' time='81.433285'/> <testcase classname='BTS_Tests_LAPDm:hopping' name='TC_sabm_invalid_resp' time='23.393032'/> <testcase classname='BTS_Tests_LAPDm:hopping' name='TC_sabm_dm' time='14.028833'/> <testcase classname='BTS_Tests_LAPDm:hopping' name='TC_establish_ign_first_sabm' time='7.941568'/> <testcase classname='BTS_Tests_LAPDm:hopping' name='TC_iframe_seq_and_ack' time='29.585216'> <failure type='fail-verdict'>Received RSL ERROR IND { msg_disc := { msg_group := RSL_MDISC_RLL (1), transparent := false }, msg_type := RSL_MT_ERROR_IND (3), ies := { { iei := RSL_IE_CHAN_NR (1), body := { chan_nr := { u := { sdcch8 := { tag := '01'B, sub_chan := 4 } }, tn := 6 } } }, { iei := RSL_IE_LINK_IDENT (2), body := { link_id := { c := FACCH_SDCCH (0), na := false, prio := SAPI0_PRIO_NORMAL (0), sapi := 0 } } }, { iei := RSL_IE_RLM_CAUSE (22), body := { rlm_cause := { len := 1, payload := '01'O } } } } } BTS_Tests_LAPDm.ttcn:1484 BTS_Tests_LAPDm control part BTS_Tests_LAPDm.ttcn:579 TC_iframe_seq_and_ack testcase </failure> </testcase> <testcase classname='BTS_Tests_LAPDm:hopping' name='TC_iframe_timer_recovery' time='24.606461'> <failure type='fail-verdict'>Received RSL ERROR IND { msg_disc := { msg_group := RSL_MDISC_RLL (1), transparent := false }, msg_type := RSL_MT_ERROR_IND (3), ies := { { iei := RSL_IE_CHAN_NR (1), body := { chan_nr := { u := { sdcch8 := { tag := '01'B, sub_chan := 4 } }, tn := 6 } } }, { iei := RSL_IE_LINK_IDENT (2), body := { link_id := { c := FACCH_SDCCH (0), na := false, prio := SAPI0_PRIO_NORMAL (0), sapi := 0 } } }, { iei := RSL_IE_RLM_CAUSE (22), body := { rlm_cause := { len := 1, payload := '01'O } } } } } BTS_Tests_LAPDm.ttcn:1485 BTS_Tests_LAPDm control part BTS_Tests_LAPDm.ttcn:685 TC_iframe_timer_recovery testcase </failure> </testcase> <testcase classname='BTS_Tests_LAPDm:hopping' name='TC_ns_seq_error' time='29.619958'> <failure type='fail-verdict'>"BTS_Tests.ttcn:732 : Tguard timeout" BTS_Tests_LAPDm.ttcn:1486 BTS_Tests_LAPDm control part BTS_Tests_LAPDm.ttcn:768 TC_ns_seq_error testcase </failure> </testcase> <testcase classname='BTS_Tests_LAPDm:hopping' name='TC_nr_seq_error' time='2.881489'/> <testcase classname='BTS_Tests_LAPDm:hopping' name='TC_rec_invalid_frame' time='119.140360'> <failure type='fail-verdict'>"BTS_Tests_LAPDm.ttcn:909 : Missing LAPDm_RR RSP" BTS_Tests_LAPDm.ttcn:1488 BTS_Tests_LAPDm control part BTS_Tests_LAPDm.ttcn:961 TC_rec_invalid_frame testcase </failure> </testcase> <testcase classname='BTS_Tests_LAPDm:hopping' name='TC_segm_concat_dcch' time='13.501713'> <failure type='fail-verdict'>"BTS_Tests_LAPDm.ttcn:1023 : received unexpected LAPDm { sacch := false, sapi := 0, lapdm := { ab := { addr := { spare := '0'B, lpd := 0, sapi := 0, c_r := false, ea := true }, ctrl := { s := { n_r := 1, p_f := false, s := '10'B, spare := '01'B } }, len := 0, m := false, el := 1, payload := ''O, padding := '2B2B2B2B2B2B2B2B2B2B2B2B2B2B2B2B2B2B2B2B'O (\"++++++++++++++++++++\") } } }" BTS_Tests_LAPDm.ttcn:1489 BTS_Tests_LAPDm control part BTS_Tests_LAPDm.ttcn:1088 TC_segm_concat_dcch testcase </failure> </testcase> <testcase classname='BTS_Tests_LAPDm:hopping' name='TC_segm_concat_sacch' time='48.522926'> <failure type='fail-verdict'>"BTS_Tests_LAPDm.ttcn:1023 : received unexpected LAPDm { sacch := true, sapi := 0, lapdm := { ab := { addr := { spare := '0'B, lpd := 0, sapi := 0, c_r := false, ea := true }, ctrl := { u := { u := '011'B, p_f := true, u2 := '00'B, spare := '11'B } }, len := 0, m := false, el := 1, payload := ''O, padding := '2B2B2B2B2B2B2B2B2B2B2B2B2B2B2B2B2B2B'O (\"++++++++++++++++++\") } } }" BTS_Tests_LAPDm.ttcn:1490 BTS_Tests_LAPDm control part BTS_Tests_LAPDm.ttcn:1093 TC_segm_concat_sacch testcase </failure> </testcase> <testcase classname='BTS_Tests_LAPDm:hopping' name='TC_t200_n200' time='39.809289'> <failure type='fail-verdict'>Missing RSL RLL ERROR INDICATION BTS_Tests_LAPDm.ttcn:1491 BTS_Tests_LAPDm control part BTS_Tests_LAPDm.ttcn:1182 TC_t200_n200 testcase </failure> </testcase> <testcase classname='BTS_Tests_LAPDm:hopping' name='TC_rr_response_frame_loss' time='6.691343'> <failure type='fail-verdict'>Timeout waiting for RR or REJ BTS_Tests_LAPDm.ttcn:1492 BTS_Tests_LAPDm control part BTS_Tests_LAPDm.ttcn:1239 TC_rr_response_frame_loss testcase </failure> </testcase> <testcase classname='BTS_Tests_LAPDm:hopping' name='TC_incorrect_cr' time='15.775330'/> <testcase classname='BTS_Tests_LAPDm:hopping' name='TC_sabm_incorrect_c' time='23.294462'> <failure type='fail-verdict'>"BTS_Tests.ttcn:732 : Tguard timeout" BTS_Tests_LAPDm.ttcn:1494 BTS_Tests_LAPDm control part BTS_Tests_LAPDm.ttcn:1341 TC_sabm_incorrect_c testcase </failure> </testcase> <testcase classname='BTS_Tests_LAPDm:hopping' name='TC_normal_reestablishment' time='16.101856'> <failure type='fail-verdict'>"BTS_Tests_LAPDm.ttcn:1023 : received unexpected LAPDm { sacch := false, sapi := 0, lapdm := { ab := { addr := { spare := '0'B, lpd := 0, sapi := 0, c_r := false, ea := true }, ctrl := { u := { u := '011'B, p_f := true, u2 := '00'B, spare := '11'B } }, len := 5, m := false, el := 1, payload := 'BD1EC18D36'O, padding := '2B2B2B2B2B2B2B2B2B2B2B2B2B2B2B'O (\"+++++++++++++++\") } } }" BTS_Tests_LAPDm.ttcn:1495 BTS_Tests_LAPDm control part BTS_Tests_LAPDm.ttcn:1403 TC_normal_reestablishment testcase </failure> </testcase> <testcase classname='BTS_Tests_LAPDm:hopping' name='TC_normal_reestablishment_state_unacked' time='12.433281'> <failure type='fail-verdict'>"BTS_Tests_LAPDm.ttcn:1023 : received unexpected LAPDm { sacch := false, sapi := 0, lapdm := { ab := { addr := { spare := '0'B, lpd := 0, sapi := 0, c_r := false, ea := true }, ctrl := { s := { n_r := 1, p_f := false, s := '10'B, spare := '01'B } }, len := 0, m := false, el := 1, payload := ''O, padding := '2B2B2B2B2B2B2B2B2B2B2B2B2B2B2B2B2B2B2B2B'O (\"++++++++++++++++++++\") } } }" BTS_Tests_LAPDm.ttcn:1496 BTS_Tests_LAPDm control part BTS_Tests_LAPDm.ttcn:1470 TC_normal_reestablishment_state_unacked testcase </failure> </testcase> <testcase classname='BTS_Tests_VAMOS:hopping' name='TC_vamos_chan_act_vff' time='2.440428'/> <testcase classname='BTS_Tests_VAMOS:hopping' name='TC_vamos_chan_act_vhh' time='2.585495'/> <testcase classname='BTS_Tests_VAMOS:hopping' name='TC_vamos_chan_act_hvhh' time='2.558784'/> <testcase classname='BTS_Tests_VAMOS:hopping' name='TC_vamos_chan_act_dyn_ipa_vff' time='2.571396'/> <testcase classname='BTS_Tests_VAMOS:hopping' name='TC_vamos_chan_act_dyn_osmo_vff' time='2.570510'/> <testcase classname='BTS_Tests_VAMOS:hopping' name='TC_vamos_chan_act_dyn_osmo_vhh' time='2.590926'/> <testcase classname='BTS_Tests_VAMOS:hopping' name='TC_vamos_chan_act_dyn_osmo_hvhh' time='2.567045'/> <testcase classname='BTS_Tests_VAMOS:hopping' name='TC_vamos_chan_mode_modify_vff' time='1.324795'/> <testcase classname='BTS_Tests_VAMOS:hopping' name='TC_vamos_chan_mode_modify_vhh' time='1.355695'/> <testcase classname='BTS_Tests_VAMOS:hopping' name='TC_vamos_chan_mode_modify_hvhh' time='1.319894'/> <testcase classname='BTS_Tests_VAMOS:hopping' name='TC_vamos_chan_mode_modify_dyn_ipa_vff' time='1.315677'/> <testcase classname='BTS_Tests_VAMOS:hopping' name='TC_vamos_chan_mode_modify_dyn_osmo_vff' time='1.338894'/> <testcase classname='BTS_Tests_VAMOS:hopping' name='TC_vamos_chan_mode_modify_dyn_osmo_vhh' time='1.357709'/> <testcase classname='BTS_Tests_VAMOS:hopping' name='TC_vamos_chan_mode_modify_dyn_osmo_hvhh' time='1.334827'/> <testcase classname='BTS_Tests_ASCI:hopping' name='TC_vbs_notification' time='4.676953'/> <testcase classname='BTS_Tests_ASCI:hopping' name='TC_vgcs_uplink_free_and_busy' time='1.786153'/> <testcase classname='BTS_Tests_ASCI:hopping' name='TC_vgcs_talker_fail' time='17.017893'/> <testcase classname='BTS_Tests_ASCI:hopping' name='TC_vgcs_talker_est_rel' time='1.462751'/> <testcase classname='BTS_Tests_ASCI:hopping' name='TC_vgcs_listener_det' time='3.385617'/> </testsuite> <?xml version="1.0"?> <testsuite name='Titan' tests='17' failures='0' errors='0' skipped='0' inconc='0' time='96.00'> <testcase classname='BTS_Tests_OML' name='TC_wrong_mdisc' time='10.737063'/> <testcase classname='BTS_Tests_OML' name='TC_wrong_msgtype' time='0.654582'/> <testcase classname='BTS_Tests_OML' name='TC_short_length' time='0.651008'/> <testcase classname='BTS_Tests_OML' name='TC_long_length' time='0.668539'/> <testcase classname='BTS_Tests_OML' name='TC_wrong_placement' time='0.666447'/> <testcase classname='BTS_Tests_OML' name='TC_wrong_seq' time='0.672965'/> <testcase classname='BTS_Tests_OML' name='TC_wrong_obj_class' time='0.677262'/> <testcase classname='BTS_Tests_OML' name='TC_wrong_bts_nr' time='0.674906'/> <testcase classname='BTS_Tests_OML' name='TC_wrong_trx_nr' time='0.685142'/> <testcase classname='BTS_Tests_OML' name='TC_radio_carrier_opstart_noattr' time='0.683307'/> <testcase classname='BTS_Tests_OML' name='TC_bts_opstart' time='0.678375'/> <testcase classname='BTS_Tests_OML' name='TC_bts_opstart_noattr' time='0.675781'/> <testcase classname='BTS_Tests_OML' name='TC_ts_opstart' time='0.693440'/> <testcase classname='BTS_Tests_OML' name='TC_ts_opstart_noattr' time='0.673337'/> <testcase classname='BTS_Tests_OML' name='TC_initial_state_reports' time='0.692548'/> <testcase classname='BTS_Tests_OML' name='TC_ipa_osmo_pcu_anr_fwd' time='0.677779'/> <testcase classname='BTS_Tests_OML' name='TC_ipa_rsl_connect_nack' time='0.674816'/> </testsuite> + check_respawn_count + set +x [0;31m ================================================================ WARNING: osmo-bts was respawned 4 times (expected: 3)! (OS#6794) ================================================================ [0m+ RC=1 + uptime + grep --color=always -o load.* [01;31m[Kload average: 0.91, 0.94, 1.42[m[K + exit 1 Build step 'Execute shell' marked build as failure Recording test results [Checks API] No suitable checks publisher found.
1
0
0
0
Build failed in Jenkins: ttcn3-bts-test-io_uring #833
by jenkins@lists.osmocom.org
24 Aug '26
24 Aug '26
See <
https://jenkins.osmocom.org/jenkins/job/ttcn3-bts-test-io_uring/833/display…
> Changes: ------------------------------------------ [...truncated 12.56 MiB...] <testcase classname='BTS_Tests:hopping' name='TC_chan_act_a52' time='2.691235'/> <testcase classname='BTS_Tests:hopping' name='TC_chan_act_a53' time='2.706379'/> <testcase classname='BTS_Tests:hopping' name='TC_chan_act_a54' time='2.724307'/> <testcase classname='BTS_Tests:hopping' name='TC_encr_cmd_a51' time='5.256150'/> <testcase classname='BTS_Tests:hopping' name='TC_encr_cmd_a52' time='5.159337'/> <testcase classname='BTS_Tests:hopping' name='TC_encr_cmd_a53' time='5.174846'/> <testcase classname='BTS_Tests:hopping' name='TC_encr_cmd_a54' time='5.162322'/> <testcase classname='BTS_Tests:hopping' name='TC_err_rep_wrong_mdisc' time='1.176042'/> <testcase classname='BTS_Tests:hopping' name='TC_err_rep_wrong_msg_type' time='1.288253'/> <testcase classname='BTS_Tests:hopping' name='TC_err_rep_wrong_sequence' time='1.237324'/> <testcase classname='BTS_Tests:hopping' name='TC_lapdm_selftest' time='0.001141'/> <testcase classname='BTS_Tests:hopping' name='TC_tch_sign_l2_fill_frame' time='18.507552'/> <testcase classname='BTS_Tests:hopping' name='TC_tch_sign_l2_fill_frame_dtxd' time='1.813754'> <failure type='fail-verdict'>Received DTX TCH fill frame with bad frame number: 175 (mod 104: 71) (mod 26: 19) BTS_Tests.ttcn:9579 BTS_Tests control part BTS_Tests.ttcn:8110 TC_tch_sign_l2_fill_frame_dtxd testcase </failure> </testcase> <testcase classname='BTS_Tests:hopping' name='TC_chopped_ipa_ping' time='24.723697'/> <testcase classname='BTS_Tests:hopping' name='TC_chopped_ipa_payload' time='42.493311'/> <testcase classname='BTS_Tests:hopping' name='TC_ms_pwr_ctrl_constant' time='17.152446'/> <testcase classname='BTS_Tests:hopping' name='TC_ms_pwr_ctrl_pf_ewma' time='31.689188'/> <testcase classname='BTS_Tests:hopping' name='TC_speech_no_rtp_tchf' time='7.439738'/> <testcase classname='BTS_Tests:hopping' name='TC_speech_no_rtp_tchh' time='5.445411'/> <testcase classname='BTS_Tests:hopping' name='TC_speech_rtp_tchf' time='7.684442'/> <testcase classname='BTS_Tests:hopping' name='TC_speech_rtp_tchh' time='5.353116'/> <testcase classname='BTS_Tests:hopping' name='TC_speech_osmux_tchf' time='3.400026'/> <testcase classname='BTS_Tests:hopping' name='TC_speech_osmux_tchh' time='3.415827'/> <testcase classname='BTS_Tests:hopping' name='TC_data_rtp_tchf144' time='2.048651'/> <testcase classname='BTS_Tests:hopping' name='TC_data_rtp_tchf96' time='2.054814'/> <testcase classname='BTS_Tests:hopping' name='TC_data_rtp_tchf48' time='2.124961'/> <testcase classname='BTS_Tests:hopping' name='TC_data_rtp_tchh48' time='5.321084'> <failure type='fail-verdict'>Timeout waiting for matching Downlink data frame BTS_Tests.ttcn:9597 BTS_Tests control part BTS_Tests.ttcn:8880 TC_data_rtp_tchh48 testcase </failure> </testcase> <testcase classname='BTS_Tests:hopping' name='TC_data_rtp_tchf24' time='1.727201'/> <testcase classname='BTS_Tests:hopping' name='TC_data_rtp_tchh24' time='5.207990'> <failure type='fail-verdict'>Timeout waiting for matching Downlink data frame BTS_Tests.ttcn:9599 BTS_Tests control part BTS_Tests.ttcn:8949 TC_data_rtp_tchh24 testcase </failure> </testcase> <testcase classname='BTS_Tests:hopping' name='TC_data_facch_tchf144' time='1.949410'/> <testcase classname='BTS_Tests:hopping' name='TC_data_facch_tchf96' time='1.993108'/> <testcase classname='BTS_Tests:hopping' name='TC_data_facch_tchf48' time='1.987815'/> <testcase classname='BTS_Tests:hopping' name='TC_data_facch_tchh48' time='2.120905'/> <testcase classname='BTS_Tests:hopping' name='TC_data_facch_tchf24' time='1.983155'/> <testcase classname='BTS_Tests:hopping' name='TC_data_facch_tchh24' time='2.830810'/> <testcase classname='BTS_Tests:hopping' name='TC_early_immediate_assignment' time='7.163486'/> <testcase classname='BTS_Tests:hopping' name='TC_acch_overpower_rxqual_thresh' time='12.298860'> <failure type='fail-verdict'>Timeout waiting for L1CTL DATA.ind BTS_Tests.ttcn:9610 BTS_Tests control part BTS_Tests.ttcn:9244 TC_acch_overpower_rxqual_thresh testcase </failure> </testcase> <testcase classname='BTS_Tests:hopping' name='TC_acch_overpower_rxqual_thresh_dtx' time='9.221116'> <failure type='fail-verdict'>Timeout waiting for L1CTL DATA.ind BTS_Tests.ttcn:9611 BTS_Tests control part BTS_Tests.ttcn:9285 TC_acch_overpower_rxqual_thresh_dtx testcase </failure> </testcase> <testcase classname='BTS_Tests:hopping' name='TC_acch_overpower_always_on_facch' time='9.141215'> <failure type='fail-verdict'>Timeout waiting for L1CTL DATA.ind BTS_Tests.ttcn:9612 BTS_Tests control part BTS_Tests.ttcn:9317 TC_acch_overpower_always_on_facch testcase </failure> </testcase> <testcase classname='BTS_Tests:hopping' name='TC_acch_overpower_always_on_sacch' time='9.231950'> <failure type='fail-verdict'>Timeout waiting for L1CTL DATA.ind BTS_Tests.ttcn:9613 BTS_Tests control part BTS_Tests.ttcn:9349 TC_acch_overpower_always_on_sacch testcase </failure> </testcase> <testcase classname='BTS_Tests:hopping' name='TC_acch_overpower_limit' time='9.116219'> <failure type='fail-verdict'>Timeout waiting for L1CTL DATA.ind BTS_Tests.ttcn:9614 BTS_Tests control part BTS_Tests.ttcn:9380 TC_acch_overpower_limit testcase </failure> </testcase> <testcase classname='BTS_Tests_SMSCB:hopping' name='TC_cbch_load_idle_no_cbch' time='11.232167'/> <testcase classname='BTS_Tests_SMSCB:hopping' name='TC_sms_cb_cmd_sdcch4_1block' time='18.117457'/> <testcase classname='BTS_Tests_SMSCB:hopping' name='TC_sms_cb_cmd_sdcch4_2block' time='14.206720'/> <testcase classname='BTS_Tests_SMSCB:hopping' name='TC_sms_cb_cmd_sdcch4_3block' time='14.171469'/> <testcase classname='BTS_Tests_SMSCB:hopping' name='TC_sms_cb_cmd_sdcch4_4block' time='14.221328'/> <testcase classname='BTS_Tests_SMSCB:hopping' name='TC_sms_cb_cmd_sdcch4_multi' time='20.185157'/> <testcase classname='BTS_Tests_SMSCB:hopping' name='TC_sms_cb_cmd_sdcch4_schedule' time='14.206872'/> <testcase classname='BTS_Tests_SMSCB:hopping' name='TC_sms_cb_cmd_sdcch4_default_only' time='16.299624'/> <testcase classname='BTS_Tests_SMSCB:hopping' name='TC_sms_cb_cmd_sdcch4_default_and_normal' time='17.238222'/> <testcase classname='BTS_Tests_SMSCB:hopping' name='TC_sms_cb_cmd_sdcch4_default_then_null' time='26.385959'/> <testcase classname='BTS_Tests_SMSCB:hopping' name='TC_cbc_sdcch4_load_idle' time='15.763780'/> <testcase classname='BTS_Tests_SMSCB:hopping' name='TC_cbc_sdcch4_load_overload' time='18.204654'/> <testcase classname='BTS_Tests_SMSCB:hopping' name='TC_sms_cb_cmd_sdcch8_1block' time='14.178537'/> <testcase classname='BTS_Tests_SMSCB:hopping' name='TC_sms_cb_cmd_sdcch8_2block' time='14.206329'/> <testcase classname='BTS_Tests_SMSCB:hopping' name='TC_sms_cb_cmd_sdcch8_3block' time='14.216342'/> <testcase classname='BTS_Tests_SMSCB:hopping' name='TC_sms_cb_cmd_sdcch8_4block' time='14.242202'/> <testcase classname='BTS_Tests_SMSCB:hopping' name='TC_sms_cb_cmd_sdcch8_multi' time='20.229275'/> <testcase classname='BTS_Tests_SMSCB:hopping' name='TC_sms_cb_cmd_sdcch8_schedule' time='14.139776'/> <testcase classname='BTS_Tests_SMSCB:hopping' name='TC_sms_cb_cmd_sdcch8_default_only' time='16.229939'/> <testcase classname='BTS_Tests_SMSCB:hopping' name='TC_sms_cb_cmd_sdcch8_default_and_normal' time='17.214203'/> <testcase classname='BTS_Tests_SMSCB:hopping' name='TC_cbc_sdcch8_load_idle' time='16.170231'/> <testcase classname='BTS_Tests_SMSCB:hopping' name='TC_cbc_sdcch8_load_overload' time='18.098298'/> <testcase classname='BTS_Tests_SMSCB:hopping' name='TC_etws_p1ro' time='12.173495'/> <testcase classname='BTS_Tests_SMSCB:hopping' name='TC_etws_p1ro_end' time='16.022971'/> <testcase classname='BTS_Tests_SMSCB:hopping' name='TC_etws_pcu' time='15.025727'> <failure type='fail-verdict'>"BTS_Tests.ttcn:294 : Timeout waiting for RSL bring up" BTS_Tests_SMSCB.ttcn:1117 BTS_Tests_SMSCB control part BTS_Tests_SMSCB.ttcn:1058 TC_etws_pcu testcase </failure> </testcase> <testcase classname='BTS_Tests_LAPDm:hopping' name='TC_sabm_ua_dcch_sapi0' time='2.916532'/> <testcase classname='BTS_Tests_LAPDm:hopping' name='TC_sabm_ua_dcch_sapi0_nopayload' time='21.824604'/> <testcase classname='BTS_Tests_LAPDm:hopping' name='TC_sabm_ua_dcch_sapi3' time='21.294839'/> <testcase classname='BTS_Tests_LAPDm:hopping' name='TC_sabm_ua_dcch_sapi4' time='21.253678'/> <testcase classname='BTS_Tests_LAPDm:hopping' name='TC_sabm_contention' time='21.227538'/> <testcase classname='BTS_Tests_LAPDm:hopping' name='TC_sabm_retransmit' time='3.181031'/> <testcase classname='BTS_Tests_LAPDm:hopping' name='TC_sabm_retransmit_bts' time='81.702041'/> <testcase classname='BTS_Tests_LAPDm:hopping' name='TC_sabm_invalid_resp' time='25.458221'> <failure type='fail-verdict'>"BTS_Tests.ttcn:732 : Tguard timeout" BTS_Tests_LAPDm.ttcn:1481 BTS_Tests_LAPDm control part BTS_Tests_LAPDm.ttcn:379 TC_sabm_invalid_resp testcase </failure> </testcase> <testcase classname='BTS_Tests_LAPDm:hopping' name='TC_sabm_dm' time='14.022489'/> <testcase classname='BTS_Tests_LAPDm:hopping' name='TC_establish_ign_first_sabm' time='7.981278'/> <testcase classname='BTS_Tests_LAPDm:hopping' name='TC_iframe_seq_and_ack' time='21.111949'> <failure type='fail-verdict'>Received RSL ERROR IND { msg_disc := { msg_group := RSL_MDISC_RLL (1), transparent := false }, msg_type := RSL_MT_ERROR_IND (3), ies := { { iei := RSL_IE_CHAN_NR (1), body := { chan_nr := { u := { ch0 := RSL_CHAN_NR_Bm_ACCH (1) }, tn := 1 } } }, { iei := RSL_IE_LINK_IDENT (2), body := { link_id := { c := FACCH_SDCCH (0), na := false, prio := SAPI0_PRIO_NORMAL (0), sapi := 0 } } }, { iei := RSL_IE_RLM_CAUSE (22), body := { rlm_cause := { len := 1, payload := '01'O } } } } } BTS_Tests_LAPDm.ttcn:1484 BTS_Tests_LAPDm control part BTS_Tests_LAPDm.ttcn:579 TC_iframe_seq_and_ack testcase </failure> </testcase> <testcase classname='BTS_Tests_LAPDm:hopping' name='TC_iframe_timer_recovery' time='24.623370'> <failure type='fail-verdict'>Received RSL ERROR IND { msg_disc := { msg_group := RSL_MDISC_RLL (1), transparent := false }, msg_type := RSL_MT_ERROR_IND (3), ies := { { iei := RSL_IE_CHAN_NR (1), body := { chan_nr := { u := { sdcch8 := { tag := '01'B, sub_chan := 4 } }, tn := 6 } } }, { iei := RSL_IE_LINK_IDENT (2), body := { link_id := { c := FACCH_SDCCH (0), na := false, prio := SAPI0_PRIO_NORMAL (0), sapi := 0 } } }, { iei := RSL_IE_RLM_CAUSE (22), body := { rlm_cause := { len := 1, payload := '01'O } } } } } BTS_Tests_LAPDm.ttcn:1485 BTS_Tests_LAPDm control part BTS_Tests_LAPDm.ttcn:685 TC_iframe_timer_recovery testcase </failure> </testcase> <testcase classname='BTS_Tests_LAPDm:hopping' name='TC_ns_seq_error' time='29.880332'> <failure type='fail-verdict'>"BTS_Tests.ttcn:732 : Tguard timeout" BTS_Tests_LAPDm.ttcn:1486 BTS_Tests_LAPDm control part BTS_Tests_LAPDm.ttcn:768 TC_ns_seq_error testcase </failure> </testcase> <testcase classname='BTS_Tests_LAPDm:hopping' name='TC_nr_seq_error' time='2.890825'/> <testcase classname='BTS_Tests_LAPDm:hopping' name='TC_rec_invalid_frame' time='107.526248'> <failure type='fail-verdict'>"BTS_Tests_LAPDm.ttcn:883 : Missing LAPDm_RR RSP" BTS_Tests_LAPDm.ttcn:1488 BTS_Tests_LAPDm control part BTS_Tests_LAPDm.ttcn:961 TC_rec_invalid_frame testcase </failure> </testcase> <testcase classname='BTS_Tests_LAPDm:hopping' name='TC_segm_concat_dcch' time='13.621551'> <failure type='fail-verdict'>"BTS_Tests_LAPDm.ttcn:1023 : received unexpected LAPDm { sacch := false, sapi := 0, lapdm := { ab := { addr := { spare := '0'B, lpd := 0, sapi := 0, c_r := false, ea := true }, ctrl := { s := { n_r := 1, p_f := false, s := '10'B, spare := '01'B } }, len := 0, m := false, el := 1, payload := ''O, padding := '2B2B2B2B2B2B2B2B2B2B2B2B2B2B2B2B2B2B2B2B'O (\"++++++++++++++++++++\") } } }" BTS_Tests_LAPDm.ttcn:1489 BTS_Tests_LAPDm control part BTS_Tests_LAPDm.ttcn:1088 TC_segm_concat_dcch testcase </failure> </testcase> <testcase classname='BTS_Tests_LAPDm:hopping' name='TC_segm_concat_sacch' time='48.570177'> <failure type='fail-verdict'>"BTS_Tests_LAPDm.ttcn:1023 : received unexpected LAPDm { sacch := true, sapi := 0, lapdm := { ab := { addr := { spare := '0'B, lpd := 0, sapi := 0, c_r := false, ea := true }, ctrl := { u := { u := '011'B, p_f := true, u2 := '00'B, spare := '11'B } }, len := 0, m := false, el := 1, payload := ''O, padding := '2B2B2B2B2B2B2B2B2B2B2B2B2B2B2B2B2B2B'O (\"++++++++++++++++++\") } } }" BTS_Tests_LAPDm.ttcn:1490 BTS_Tests_LAPDm control part BTS_Tests_LAPDm.ttcn:1093 TC_segm_concat_sacch testcase </failure> </testcase> <testcase classname='BTS_Tests_LAPDm:hopping' name='TC_t200_n200' time='39.860582'> <failure type='fail-verdict'>Missing RSL RLL ERROR INDICATION BTS_Tests_LAPDm.ttcn:1491 BTS_Tests_LAPDm control part BTS_Tests_LAPDm.ttcn:1182 TC_t200_n200 testcase </failure> </testcase> <testcase classname='BTS_Tests_LAPDm:hopping' name='TC_rr_response_frame_loss' time='6.668250'> <failure type='fail-verdict'>Timeout waiting for RR or REJ BTS_Tests_LAPDm.ttcn:1492 BTS_Tests_LAPDm control part BTS_Tests_LAPDm.ttcn:1239 TC_rr_response_frame_loss testcase </failure> </testcase> <testcase classname='BTS_Tests_LAPDm:hopping' name='TC_incorrect_cr' time='15.798797'/> <testcase classname='BTS_Tests_LAPDm:hopping' name='TC_sabm_incorrect_c' time='23.303881'> <failure type='fail-verdict'>"BTS_Tests.ttcn:732 : Tguard timeout" BTS_Tests_LAPDm.ttcn:1494 BTS_Tests_LAPDm control part BTS_Tests_LAPDm.ttcn:1341 TC_sabm_incorrect_c testcase </failure> </testcase> <testcase classname='BTS_Tests_LAPDm:hopping' name='TC_normal_reestablishment' time='16.110086'> <failure type='fail-verdict'>"BTS_Tests_LAPDm.ttcn:1023 : received unexpected LAPDm { sacch := false, sapi := 0, lapdm := { ab := { addr := { spare := '0'B, lpd := 0, sapi := 0, c_r := false, ea := true }, ctrl := { u := { u := '011'B, p_f := true, u2 := '00'B, spare := '11'B } }, len := 5, m := false, el := 1, payload := '73E255C204'O, padding := '2B2B2B2B2B2B2B2B2B2B2B2B2B2B2B'O (\"+++++++++++++++\") } } }" BTS_Tests_LAPDm.ttcn:1495 BTS_Tests_LAPDm control part BTS_Tests_LAPDm.ttcn:1403 TC_normal_reestablishment testcase </failure> </testcase> <testcase classname='BTS_Tests_LAPDm:hopping' name='TC_normal_reestablishment_state_unacked' time='12.382471'> <failure type='fail-verdict'>"BTS_Tests_LAPDm.ttcn:1023 : received unexpected LAPDm { sacch := false, sapi := 0, lapdm := { ab := { addr := { spare := '0'B, lpd := 0, sapi := 0, c_r := false, ea := true }, ctrl := { s := { n_r := 1, p_f := false, s := '10'B, spare := '01'B } }, len := 0, m := false, el := 1, payload := ''O, padding := '2B2B2B2B2B2B2B2B2B2B2B2B2B2B2B2B2B2B2B2B'O (\"++++++++++++++++++++\") } } }" BTS_Tests_LAPDm.ttcn:1496 BTS_Tests_LAPDm control part BTS_Tests_LAPDm.ttcn:1470 TC_normal_reestablishment_state_unacked testcase </failure> </testcase> <testcase classname='BTS_Tests_VAMOS:hopping' name='TC_vamos_chan_act_vff' time='2.435028'/> <testcase classname='BTS_Tests_VAMOS:hopping' name='TC_vamos_chan_act_vhh' time='2.579544'/> <testcase classname='BTS_Tests_VAMOS:hopping' name='TC_vamos_chan_act_hvhh' time='2.533977'/> <testcase classname='BTS_Tests_VAMOS:hopping' name='TC_vamos_chan_act_dyn_ipa_vff' time='2.563372'/> <testcase classname='BTS_Tests_VAMOS:hopping' name='TC_vamos_chan_act_dyn_osmo_vff' time='2.545183'/> <testcase classname='BTS_Tests_VAMOS:hopping' name='TC_vamos_chan_act_dyn_osmo_vhh' time='2.552969'/> <testcase classname='BTS_Tests_VAMOS:hopping' name='TC_vamos_chan_act_dyn_osmo_hvhh' time='2.572451'/> <testcase classname='BTS_Tests_VAMOS:hopping' name='TC_vamos_chan_mode_modify_vff' time='1.336684'/> <testcase classname='BTS_Tests_VAMOS:hopping' name='TC_vamos_chan_mode_modify_vhh' time='1.403668'/> <testcase classname='BTS_Tests_VAMOS:hopping' name='TC_vamos_chan_mode_modify_hvhh' time='1.358506'/> <testcase classname='BTS_Tests_VAMOS:hopping' name='TC_vamos_chan_mode_modify_dyn_ipa_vff' time='1.353793'/> <testcase classname='BTS_Tests_VAMOS:hopping' name='TC_vamos_chan_mode_modify_dyn_osmo_vff' time='1.348956'/> <testcase classname='BTS_Tests_VAMOS:hopping' name='TC_vamos_chan_mode_modify_dyn_osmo_vhh' time='1.368960'/> <testcase classname='BTS_Tests_VAMOS:hopping' name='TC_vamos_chan_mode_modify_dyn_osmo_hvhh' time='1.378043'/> <testcase classname='BTS_Tests_ASCI:hopping' name='TC_vbs_notification' time='4.658332'/> <testcase classname='BTS_Tests_ASCI:hopping' name='TC_vgcs_uplink_free_and_busy' time='1.837819'/> <testcase classname='BTS_Tests_ASCI:hopping' name='TC_vgcs_talker_fail' time='17.034940'/> <testcase classname='BTS_Tests_ASCI:hopping' name='TC_vgcs_talker_est_rel' time='1.430491'/> <testcase classname='BTS_Tests_ASCI:hopping' name='TC_vgcs_listener_det' time='3.359052'/> </testsuite> <?xml version="1.0"?> <testsuite name='Titan' tests='17' failures='0' errors='0' skipped='0' inconc='0' time='96.00'> <testcase classname='BTS_Tests_OML' name='TC_wrong_mdisc' time='10.655443'/> <testcase classname='BTS_Tests_OML' name='TC_wrong_msgtype' time='0.667465'/> <testcase classname='BTS_Tests_OML' name='TC_short_length' time='0.670291'/> <testcase classname='BTS_Tests_OML' name='TC_long_length' time='0.676086'/> <testcase classname='BTS_Tests_OML' name='TC_wrong_placement' time='0.695188'/> <testcase classname='BTS_Tests_OML' name='TC_wrong_seq' time='0.703594'/> <testcase classname='BTS_Tests_OML' name='TC_wrong_obj_class' time='0.703478'/> <testcase classname='BTS_Tests_OML' name='TC_wrong_bts_nr' time='0.708870'/> <testcase classname='BTS_Tests_OML' name='TC_wrong_trx_nr' time='0.703473'/> <testcase classname='BTS_Tests_OML' name='TC_radio_carrier_opstart_noattr' time='0.702142'/> <testcase classname='BTS_Tests_OML' name='TC_bts_opstart' time='0.687800'/> <testcase classname='BTS_Tests_OML' name='TC_bts_opstart_noattr' time='0.658343'/> <testcase classname='BTS_Tests_OML' name='TC_ts_opstart' time='0.689087'/> <testcase classname='BTS_Tests_OML' name='TC_ts_opstart_noattr' time='0.673643'/> <testcase classname='BTS_Tests_OML' name='TC_initial_state_reports' time='0.681951'/> <testcase classname='BTS_Tests_OML' name='TC_ipa_osmo_pcu_anr_fwd' time='0.673484'/> <testcase classname='BTS_Tests_OML' name='TC_ipa_rsl_connect_nack' time='0.704930'/> </testsuite> + check_respawn_count + set +x [0;31m ================================================================ WARNING: osmo-bts was respawned 4 times (expected: 3)! (OS#6794) ================================================================ [0m+ RC=1 + uptime + grep --color=always -o load.* [01;31m[Kload average: 1.11, 3.77, 7.00[m[K + exit 1 Build step 'Execute shell' marked build as failure Recording test results [Checks API] No suitable checks publisher found.
1
1
0
0
Build failed in Jenkins: ttcn3-bts-test #3241
by jenkins@lists.osmocom.org
24 Aug '26
24 Aug '26
See <
https://jenkins.osmocom.org/jenkins/job/ttcn3-bts-test/3241/display/redirect
> Changes: ------------------------------------------ [...truncated 12.56 MiB...] <testcase classname='BTS_Tests:hopping' name='TC_speech_rtp_tchh' time='5.444143'/> <testcase classname='BTS_Tests:hopping' name='TC_speech_osmux_tchf' time='3.428938'/> <testcase classname='BTS_Tests:hopping' name='TC_speech_osmux_tchh' time='3.548537'/> <testcase classname='BTS_Tests:hopping' name='TC_data_rtp_tchf144' time='2.048737'/> <testcase classname='BTS_Tests:hopping' name='TC_data_rtp_tchf96' time='2.267391'/> <testcase classname='BTS_Tests:hopping' name='TC_data_rtp_tchf48' time='2.231172'/> <testcase classname='BTS_Tests:hopping' name='TC_data_rtp_tchh48' time='5.206911'> <failure type='fail-verdict'>Timeout waiting for matching Downlink data frame BTS_Tests.ttcn:9597 BTS_Tests control part BTS_Tests.ttcn:8880 TC_data_rtp_tchh48 testcase </failure> </testcase> <testcase classname='BTS_Tests:hopping' name='TC_data_rtp_tchf24' time='1.542858'/> <testcase classname='BTS_Tests:hopping' name='TC_data_rtp_tchh24' time='6.053925'> <failure type='fail-verdict'>Timeout waiting for matching Downlink data frame BTS_Tests.ttcn:9599 BTS_Tests control part BTS_Tests.ttcn:8954 TC_data_rtp_tchh24 testcase </failure> </testcase> <testcase classname='BTS_Tests:hopping' name='TC_data_facch_tchf144' time='2.201704'/> <testcase classname='BTS_Tests:hopping' name='TC_data_facch_tchf96' time='2.058621'/> <testcase classname='BTS_Tests:hopping' name='TC_data_facch_tchf48' time='2.045976'/> <testcase classname='BTS_Tests:hopping' name='TC_data_facch_tchh48' time='1.900437'/> <testcase classname='BTS_Tests:hopping' name='TC_data_facch_tchf24' time='2.192967'/> <testcase classname='BTS_Tests:hopping' name='TC_data_facch_tchh24' time='2.137967'/> <testcase classname='BTS_Tests:hopping' name='TC_early_immediate_assignment' time='3.732754'/> <testcase classname='BTS_Tests:hopping' name='TC_acch_overpower_rxqual_thresh' time='11.421904'> <failure type='fail-verdict'>Didn't reach full power -80 dBm BTS_Tests.ttcn:9610 BTS_Tests control part BTS_Tests.ttcn:9244 TC_acch_overpower_rxqual_thresh testcase </failure> </testcase> <testcase classname='BTS_Tests:hopping' name='TC_acch_overpower_rxqual_thresh_dtx' time='8.050331'> <failure type='fail-verdict'>Timeout waiting for L1CTL DATA.ind BTS_Tests.ttcn:9611 BTS_Tests control part BTS_Tests.ttcn:9285 TC_acch_overpower_rxqual_thresh_dtx testcase </failure> </testcase> <testcase classname='BTS_Tests:hopping' name='TC_acch_overpower_always_on_facch' time='9.055572'> <failure type='fail-verdict'>Timeout waiting for L1CTL DATA.ind BTS_Tests.ttcn:9612 BTS_Tests control part BTS_Tests.ttcn:9317 TC_acch_overpower_always_on_facch testcase </failure> </testcase> <testcase classname='BTS_Tests:hopping' name='TC_acch_overpower_always_on_sacch' time='8.877406'> <failure type='fail-verdict'>Timeout waiting for L1CTL DATA.ind BTS_Tests.ttcn:9613 BTS_Tests control part BTS_Tests.ttcn:9349 TC_acch_overpower_always_on_sacch testcase </failure> </testcase> <testcase classname='BTS_Tests:hopping' name='TC_acch_overpower_limit' time='9.099569'> <failure type='fail-verdict'>Timeout waiting for L1CTL DATA.ind BTS_Tests.ttcn:9614 BTS_Tests control part BTS_Tests.ttcn:9380 TC_acch_overpower_limit testcase </failure> </testcase> <testcase classname='BTS_Tests_SMSCB:hopping' name='TC_cbch_load_idle_no_cbch' time='10.980741'/> <testcase classname='BTS_Tests_SMSCB:hopping' name='TC_sms_cb_cmd_sdcch4_1block' time='14.844366'/> <testcase classname='BTS_Tests_SMSCB:hopping' name='TC_sms_cb_cmd_sdcch4_2block' time='11.731445'/> <testcase classname='BTS_Tests_SMSCB:hopping' name='TC_sms_cb_cmd_sdcch4_3block' time='14.160214'/> <testcase classname='BTS_Tests_SMSCB:hopping' name='TC_sms_cb_cmd_sdcch4_4block' time='14.321598'/> <testcase classname='BTS_Tests_SMSCB:hopping' name='TC_sms_cb_cmd_sdcch4_multi' time='20.781994'/> <testcase classname='BTS_Tests_SMSCB:hopping' name='TC_sms_cb_cmd_sdcch4_schedule' time='14.121824'/> <testcase classname='BTS_Tests_SMSCB:hopping' name='TC_sms_cb_cmd_sdcch4_default_only' time='16.138420'/> <testcase classname='BTS_Tests_SMSCB:hopping' name='TC_sms_cb_cmd_sdcch4_default_and_normal' time='17.195419'/> <testcase classname='BTS_Tests_SMSCB:hopping' name='TC_sms_cb_cmd_sdcch4_default_then_null' time='26.177932'/> <testcase classname='BTS_Tests_SMSCB:hopping' name='TC_cbc_sdcch4_load_idle' time='16.052242'/> <testcase classname='BTS_Tests_SMSCB:hopping' name='TC_cbc_sdcch4_load_overload' time='18.210809'/> <testcase classname='BTS_Tests_SMSCB:hopping' name='TC_sms_cb_cmd_sdcch8_1block' time='14.199023'/> <testcase classname='BTS_Tests_SMSCB:hopping' name='TC_sms_cb_cmd_sdcch8_2block' time='14.239813'/> <testcase classname='BTS_Tests_SMSCB:hopping' name='TC_sms_cb_cmd_sdcch8_3block' time='18.029864'> <failure type='fail-verdict'>Timeout waiting for "Basic" CBCH block 1 of msg 0 BTS_Tests_SMSCB.ttcn:1106 BTS_Tests_SMSCB control part BTS_Tests_SMSCB.ttcn:581 TC_sms_cb_cmd_sdcch8_3block testcase </failure> </testcase> <testcase classname='BTS_Tests_SMSCB:hopping' name='TC_sms_cb_cmd_sdcch8_4block' time='14.128193'/> <testcase classname='BTS_Tests_SMSCB:hopping' name='TC_sms_cb_cmd_sdcch8_multi' time='19.948439'/> <testcase classname='BTS_Tests_SMSCB:hopping' name='TC_sms_cb_cmd_sdcch8_schedule' time='13.811896'/> <testcase classname='BTS_Tests_SMSCB:hopping' name='TC_sms_cb_cmd_sdcch8_default_only' time='16.267337'/> <testcase classname='BTS_Tests_SMSCB:hopping' name='TC_sms_cb_cmd_sdcch8_default_and_normal' time='17.216935'/> <testcase classname='BTS_Tests_SMSCB:hopping' name='TC_cbc_sdcch8_load_idle' time='16.523170'/> <testcase classname='BTS_Tests_SMSCB:hopping' name='TC_cbc_sdcch8_load_overload' time='18.192236'/> <testcase classname='BTS_Tests_SMSCB:hopping' name='TC_etws_p1ro' time='12.174126'/> <testcase classname='BTS_Tests_SMSCB:hopping' name='TC_etws_p1ro_end' time='16.172400'/> <testcase classname='BTS_Tests_SMSCB:hopping' name='TC_etws_pcu' time='0.887900'/> <testcase classname='BTS_Tests_LAPDm:hopping' name='TC_sabm_ua_dcch_sapi0' time='2.927106'/> <testcase classname='BTS_Tests_LAPDm:hopping' name='TC_sabm_ua_dcch_sapi0_nopayload' time='21.632981'/> <testcase classname='BTS_Tests_LAPDm:hopping' name='TC_sabm_ua_dcch_sapi3' time='21.546828'/> <testcase classname='BTS_Tests_LAPDm:hopping' name='TC_sabm_ua_dcch_sapi4' time='24.643471'> <failure type='fail-verdict'>"BTS_Tests.ttcn:792 : Timeout expecting RF CHAN REL" BTS_Tests_LAPDm.ttcn:1477 BTS_Tests_LAPDm control part BTS_Tests_LAPDm.ttcn:167 TC_sabm_ua_dcch_sapi4 testcase </failure> </testcase> <testcase classname='BTS_Tests_LAPDm:hopping' name='TC_sabm_contention' time='9.572756'> <failure type='fail-verdict'>"BTS_Tests.ttcn:792 : Timeout expecting RF CHAN REL" BTS_Tests_LAPDm.ttcn:1478 BTS_Tests_LAPDm control part BTS_Tests_LAPDm.ttcn:201 TC_sabm_contention testcase </failure> </testcase> <testcase classname='BTS_Tests_LAPDm:hopping' name='TC_sabm_retransmit' time='5.273059'/> <testcase classname='BTS_Tests_LAPDm:hopping' name='TC_sabm_retransmit_bts' time='85.070119'> <failure type='fail-verdict'>Incorrect number of SABM re-transmissions of observed: 1 BTS_Tests_LAPDm.ttcn:1480 BTS_Tests_LAPDm control part BTS_Tests_LAPDm.ttcn:315 TC_sabm_retransmit_bts testcase </failure> </testcase> <testcase classname='BTS_Tests_LAPDm:hopping' name='TC_sabm_invalid_resp' time='25.412232'> <failure type='fail-verdict'>"BTS_Tests.ttcn:732 : Tguard timeout" BTS_Tests_LAPDm.ttcn:1481 BTS_Tests_LAPDm control part BTS_Tests_LAPDm.ttcn:379 TC_sabm_invalid_resp testcase </failure> </testcase> <testcase classname='BTS_Tests_LAPDm:hopping' name='TC_sabm_dm' time='13.489446'> <failure type='fail-verdict'>"BTS_Tests.ttcn:792 : Timeout expecting RSL CHAN ACT" BTS_Tests_LAPDm.ttcn:1482 BTS_Tests_LAPDm control part BTS_Tests_LAPDm.ttcn:425 TC_sabm_dm testcase </failure> </testcase> <testcase classname='BTS_Tests_LAPDm:hopping' name='TC_establish_ign_first_sabm' time='27.991596'> <failure type='fail-verdict'>"BTS_Tests.ttcn:732 : Tguard timeout" BTS_Tests_LAPDm.ttcn:1483 BTS_Tests_LAPDm control part BTS_Tests_LAPDm.ttcn:488 TC_establish_ign_first_sabm testcase </failure> </testcase> <testcase classname='BTS_Tests_LAPDm:hopping' name='TC_iframe_seq_and_ack' time='22.714727'> <failure type='fail-verdict'>Received RSL ERROR IND { msg_disc := { msg_group := RSL_MDISC_RLL (1), transparent := false }, msg_type := RSL_MT_ERROR_IND (3), ies := { { iei := RSL_IE_CHAN_NR (1), body := { chan_nr := { u := { lm := { tag := '0001'B, sub_chan := 1 } }, tn := 5 } } }, { iei := RSL_IE_LINK_IDENT (2), body := { link_id := { c := FACCH_SDCCH (0), na := false, prio := SAPI0_PRIO_NORMAL (0), sapi := 0 } } }, { iei := RSL_IE_RLM_CAUSE (22), body := { rlm_cause := { len := 1, payload := '01'O } } } } } BTS_Tests_LAPDm.ttcn:1484 BTS_Tests_LAPDm control part BTS_Tests_LAPDm.ttcn:579 TC_iframe_seq_and_ack testcase </failure> </testcase> <testcase classname='BTS_Tests_LAPDm:hopping' name='TC_iframe_timer_recovery' time='24.712186'> <failure type='fail-verdict'>Received RSL ERROR IND { msg_disc := { msg_group := RSL_MDISC_RLL (1), transparent := false }, msg_type := RSL_MT_ERROR_IND (3), ies := { { iei := RSL_IE_CHAN_NR (1), body := { chan_nr := { u := { sdcch8 := { tag := '01'B, sub_chan := 4 } }, tn := 6 } } }, { iei := RSL_IE_LINK_IDENT (2), body := { link_id := { c := FACCH_SDCCH (0), na := false, prio := SAPI0_PRIO_NORMAL (0), sapi := 0 } } }, { iei := RSL_IE_RLM_CAUSE (22), body := { rlm_cause := { len := 1, payload := '01'O } } } } } BTS_Tests_LAPDm.ttcn:1485 BTS_Tests_LAPDm control part BTS_Tests_LAPDm.ttcn:685 TC_iframe_timer_recovery testcase </failure> </testcase> <testcase classname='BTS_Tests_LAPDm:hopping' name='TC_ns_seq_error' time='29.710158'> <failure type='fail-verdict'>"BTS_Tests.ttcn:732 : Tguard timeout" BTS_Tests_LAPDm.ttcn:1486 BTS_Tests_LAPDm control part BTS_Tests_LAPDm.ttcn:768 TC_ns_seq_error testcase </failure> </testcase> <testcase classname='BTS_Tests_LAPDm:hopping' name='TC_nr_seq_error' time='2.910884'/> <testcase classname='BTS_Tests_LAPDm:hopping' name='TC_rec_invalid_frame' time='119.220855'> <failure type='fail-verdict'>"BTS_Tests_LAPDm.ttcn:909 : Missing LAPDm_RR RSP" BTS_Tests_LAPDm.ttcn:1488 BTS_Tests_LAPDm control part BTS_Tests_LAPDm.ttcn:961 TC_rec_invalid_frame testcase </failure> </testcase> <testcase classname='BTS_Tests_LAPDm:hopping' name='TC_segm_concat_dcch' time='14.355796'> <failure type='fail-verdict'>"BTS_Tests_LAPDm.ttcn:1023 : received unexpected LAPDm { sacch := false, sapi := 0, lapdm := { ab := { addr := { spare := '0'B, lpd := 0, sapi := 0, c_r := false, ea := true }, ctrl := { s := { n_r := 2, p_f := false, s := '10'B, spare := '01'B } }, len := 0, m := false, el := 1, payload := ''O, padding := '2B2B2B2B2B2B2B2B2B2B2B2B2B2B2B2B2B2B2B2B'O (\"++++++++++++++++++++\") } } }" BTS_Tests_LAPDm.ttcn:1489 BTS_Tests_LAPDm control part BTS_Tests_LAPDm.ttcn:1088 TC_segm_concat_dcch testcase </failure> </testcase> <testcase classname='BTS_Tests_LAPDm:hopping' name='TC_segm_concat_sacch' time='49.970073'> <failure type='fail-verdict'>"BTS_Tests_LAPDm.ttcn:1023 : received unexpected LAPDm { sacch := true, sapi := 0, lapdm := { ab := { addr := { spare := '0'B, lpd := 0, sapi := 0, c_r := false, ea := true }, ctrl := { u := { u := '011'B, p_f := true, u2 := '00'B, spare := '11'B } }, len := 0, m := false, el := 1, payload := ''O, padding := '2B2B2B2B2B2B2B2B2B2B2B2B2B2B2B2B2B2B'O (\"++++++++++++++++++\") } } }" BTS_Tests_LAPDm.ttcn:1490 BTS_Tests_LAPDm control part BTS_Tests_LAPDm.ttcn:1093 TC_segm_concat_sacch testcase </failure> </testcase> <testcase classname='BTS_Tests_LAPDm:hopping' name='TC_t200_n200' time='39.923421'> <failure type='fail-verdict'>Missing RSL RLL ERROR INDICATION BTS_Tests_LAPDm.ttcn:1491 BTS_Tests_LAPDm control part BTS_Tests_LAPDm.ttcn:1182 TC_t200_n200 testcase </failure> </testcase> <testcase classname='BTS_Tests_LAPDm:hopping' name='TC_rr_response_frame_loss' time='6.729354'> <failure type='fail-verdict'>Timeout waiting for RR or REJ BTS_Tests_LAPDm.ttcn:1492 BTS_Tests_LAPDm control part BTS_Tests_LAPDm.ttcn:1239 TC_rr_response_frame_loss testcase </failure> </testcase> <testcase classname='BTS_Tests_LAPDm:hopping' name='TC_incorrect_cr' time='15.809971'/> <testcase classname='BTS_Tests_LAPDm:hopping' name='TC_sabm_incorrect_c' time='23.338728'> <failure type='fail-verdict'>"BTS_Tests.ttcn:732 : Tguard timeout" BTS_Tests_LAPDm.ttcn:1494 BTS_Tests_LAPDm control part BTS_Tests_LAPDm.ttcn:1341 TC_sabm_incorrect_c testcase </failure> </testcase> <testcase classname='BTS_Tests_LAPDm:hopping' name='TC_normal_reestablishment' time='25.778975'> <failure type='fail-verdict'>"BTS_Tests_LAPDm.ttcn:1023 : received unexpected LAPDm { sacch := false, sapi := 0, lapdm := { ab := { addr := { spare := '0'B, lpd := 0, sapi := 0, c_r := false, ea := true }, ctrl := { s := { n_r := 4, p_f := false, s := '10'B, spare := '01'B } }, len := 0, m := false, el := 1, payload := ''O, padding := '2B2B2B2B2B2B2B2B2B2B2B2B2B2B2B2B2B2B2B2B'O (\"++++++++++++++++++++\") } } }" BTS_Tests_LAPDm.ttcn:1495 BTS_Tests_LAPDm control part BTS_Tests_LAPDm.ttcn:1403 TC_normal_reestablishment testcase </failure> </testcase> <testcase classname='BTS_Tests_LAPDm:hopping' name='TC_normal_reestablishment_state_unacked' time='29.813708'> <failure type='fail-verdict'>Received RSL ERROR IND { msg_disc := { msg_group := RSL_MDISC_RLL (1), transparent := false }, msg_type := RSL_MT_ERROR_IND (3), ies := { { iei := RSL_IE_CHAN_NR (1), body := { chan_nr := { u := { sdcch8 := { tag := '01'B, sub_chan := 4 } }, tn := 6 } } }, { iei := RSL_IE_LINK_IDENT (2), body := { link_id := { c := FACCH_SDCCH (0), na := false, prio := SAPI0_PRIO_NORMAL (0), sapi := 0 } } }, { iei := RSL_IE_RLM_CAUSE (22), body := { rlm_cause := { len := 1, payload := '01'O } } } } } BTS_Tests_LAPDm.ttcn:1496 BTS_Tests_LAPDm control part BTS_Tests_LAPDm.ttcn:1470 TC_normal_reestablishment_state_unacked testcase </failure> </testcase> <testcase classname='BTS_Tests_VAMOS:hopping' name='TC_vamos_chan_act_vff' time='2.304500'/> <testcase classname='BTS_Tests_VAMOS:hopping' name='TC_vamos_chan_act_vhh' time='2.589496'/> <testcase classname='BTS_Tests_VAMOS:hopping' name='TC_vamos_chan_act_hvhh' time='2.593482'/> <testcase classname='BTS_Tests_VAMOS:hopping' name='TC_vamos_chan_act_dyn_ipa_vff' time='2.563866'/> <testcase classname='BTS_Tests_VAMOS:hopping' name='TC_vamos_chan_act_dyn_osmo_vff' time='2.575520'/> <testcase classname='BTS_Tests_VAMOS:hopping' name='TC_vamos_chan_act_dyn_osmo_vhh' time='2.578138'/> <testcase classname='BTS_Tests_VAMOS:hopping' name='TC_vamos_chan_act_dyn_osmo_hvhh' time='2.535839'/> <testcase classname='BTS_Tests_VAMOS:hopping' name='TC_vamos_chan_mode_modify_vff' time='1.308924'/> <testcase classname='BTS_Tests_VAMOS:hopping' name='TC_vamos_chan_mode_modify_vhh' time='1.395922'/> <testcase classname='BTS_Tests_VAMOS:hopping' name='TC_vamos_chan_mode_modify_hvhh' time='1.350055'/> <testcase classname='BTS_Tests_VAMOS:hopping' name='TC_vamos_chan_mode_modify_dyn_ipa_vff' time='1.347684'/> <testcase classname='BTS_Tests_VAMOS:hopping' name='TC_vamos_chan_mode_modify_dyn_osmo_vff' time='1.356989'/> <testcase classname='BTS_Tests_VAMOS:hopping' name='TC_vamos_chan_mode_modify_dyn_osmo_vhh' time='1.362428'/> <testcase classname='BTS_Tests_VAMOS:hopping' name='TC_vamos_chan_mode_modify_dyn_osmo_hvhh' time='1.360249'/> <testcase classname='BTS_Tests_ASCI:hopping' name='TC_vbs_notification' time='4.665728'/> <testcase classname='BTS_Tests_ASCI:hopping' name='TC_vgcs_uplink_free_and_busy' time='1.761933'/> <testcase classname='BTS_Tests_ASCI:hopping' name='TC_vgcs_talker_fail' time='16.552381'/> <testcase classname='BTS_Tests_ASCI:hopping' name='TC_vgcs_talker_est_rel' time='1.460505'/> <testcase classname='BTS_Tests_ASCI:hopping' name='TC_vgcs_listener_det' time='3.405041'/> </testsuite> <?xml version="1.0"?> <testsuite name='Titan' tests='17' failures='0' errors='0' skipped='0' inconc='0' time='96.00'> <testcase classname='BTS_Tests_OML' name='TC_wrong_mdisc' time='10.669184'/> <testcase classname='BTS_Tests_OML' name='TC_wrong_msgtype' time='0.705569'/> <testcase classname='BTS_Tests_OML' name='TC_short_length' time='0.707874'/> <testcase classname='BTS_Tests_OML' name='TC_long_length' time='0.709004'/> <testcase classname='BTS_Tests_OML' name='TC_wrong_placement' time='0.746059'/> <testcase classname='BTS_Tests_OML' name='TC_wrong_seq' time='0.698884'/> <testcase classname='BTS_Tests_OML' name='TC_wrong_obj_class' time='0.716831'/> <testcase classname='BTS_Tests_OML' name='TC_wrong_bts_nr' time='0.681360'/> <testcase classname='BTS_Tests_OML' name='TC_wrong_trx_nr' time='0.701586'/> <testcase classname='BTS_Tests_OML' name='TC_radio_carrier_opstart_noattr' time='0.728659'/> <testcase classname='BTS_Tests_OML' name='TC_bts_opstart' time='0.756659'/> <testcase classname='BTS_Tests_OML' name='TC_bts_opstart_noattr' time='0.716097'/> <testcase classname='BTS_Tests_OML' name='TC_ts_opstart' time='0.705034'/> <testcase classname='BTS_Tests_OML' name='TC_ts_opstart_noattr' time='0.702613'/> <testcase classname='BTS_Tests_OML' name='TC_initial_state_reports' time='0.703678'/> <testcase classname='BTS_Tests_OML' name='TC_ipa_osmo_pcu_anr_fwd' time='0.711035'/> <testcase classname='BTS_Tests_OML' name='TC_ipa_rsl_connect_nack' time='0.740131'/> </testsuite> + check_respawn_count + set +x [0;31m ================================================================ WARNING: osmo-bts was respawned 16 times (expected: 3)! (OS#6794) ================================================================ [0m+ RC=1 + uptime + grep --color=always -o load.* [01;31m[Kload average: 1.22, 5.03, 7.61[m[K + exit 1 Build step 'Execute shell' marked build as failure Recording test results [Checks API] No suitable checks publisher found.
1
1
0
0
Build failed in Jenkins: ttcn3-bts-test-latest #2889
by jenkins@lists.osmocom.org
23 Aug '26
23 Aug '26
See <
https://jenkins.osmocom.org/jenkins/job/ttcn3-bts-test-latest/2889/display/…
> Changes: ------------------------------------------ [...truncated 12.37 MiB...] <failure type='fail-verdict'>"BTS_Tests.ttcn:732 : Tguard timeout" BTS_Tests.ttcn:9557 BTS_Tests control part BTS_Tests.ttcn:7525 TC_rll_rel_req testcase </failure> </testcase> <testcase classname='BTS_Tests:hopping' name='TC_rll_unit_data_req_DCCH' time='2.375037'/> <testcase classname='BTS_Tests:hopping' name='TC_rll_unit_data_req_ACCH' time='5.311345'/> <testcase classname='BTS_Tests:hopping' name='TC_rll_unit_data_ind_DCCH' time='2.901093'/> <testcase classname='BTS_Tests:hopping' name='TC_rll_unit_data_ind_ACCH' time='10.565762'/> <testcase classname='BTS_Tests:hopping' name='TC_chan_act_a51' time='2.651671'/> <testcase classname='BTS_Tests:hopping' name='TC_chan_act_a52' time='2.732017'/> <testcase classname='BTS_Tests:hopping' name='TC_chan_act_a53' time='2.715281'/> <testcase classname='BTS_Tests:hopping' name='TC_chan_act_a54' time='2.709843'/> <testcase classname='BTS_Tests:hopping' name='TC_encr_cmd_a51' time='5.237219'/> <testcase classname='BTS_Tests:hopping' name='TC_encr_cmd_a52' time='5.230291'/> <testcase classname='BTS_Tests:hopping' name='TC_encr_cmd_a53' time='5.201813'/> <testcase classname='BTS_Tests:hopping' name='TC_encr_cmd_a54' time='5.212540'/> <testcase classname='BTS_Tests:hopping' name='TC_err_rep_wrong_mdisc' time='1.225398'/> <testcase classname='BTS_Tests:hopping' name='TC_err_rep_wrong_msg_type' time='1.295445'/> <testcase classname='BTS_Tests:hopping' name='TC_err_rep_wrong_sequence' time='1.270438'/> <testcase classname='BTS_Tests:hopping' name='TC_lapdm_selftest' time='0.006997'/> <testcase classname='BTS_Tests:hopping' name='TC_tch_sign_l2_fill_frame' time='18.447785'/> <testcase classname='BTS_Tests:hopping' name='TC_tch_sign_l2_fill_frame_dtxd' time='2.146288'> <failure type='fail-verdict'>Received DTX TCH fill frame with bad frame number: 175 (mod 104: 71) (mod 26: 19) BTS_Tests.ttcn:9579 BTS_Tests control part BTS_Tests.ttcn:8110 TC_tch_sign_l2_fill_frame_dtxd testcase </failure> </testcase> <testcase classname='BTS_Tests:hopping' name='TC_chopped_ipa_ping' time='24.715346'/> <testcase classname='BTS_Tests:hopping' name='TC_chopped_ipa_payload' time='42.635113'/> <testcase classname='BTS_Tests:hopping' name='TC_ms_pwr_ctrl_constant' time='16.893427'/> <testcase classname='BTS_Tests:hopping' name='TC_ms_pwr_ctrl_pf_ewma' time='32.017116'/> <testcase classname='BTS_Tests:hopping' name='TC_speech_no_rtp_tchf' time='7.451141'/> <testcase classname='BTS_Tests:hopping' name='TC_speech_no_rtp_tchh' time='5.435543'/> <testcase classname='BTS_Tests:hopping' name='TC_speech_rtp_tchf' time='7.634205'/> <testcase classname='BTS_Tests:hopping' name='TC_speech_rtp_tchh' time='5.432804'/> <testcase classname='BTS_Tests:hopping' name='TC_speech_osmux_tchf' time='3.378195'/> <testcase classname='BTS_Tests:hopping' name='TC_speech_osmux_tchh' time='3.416844'/> <testcase classname='BTS_Tests:hopping' name='TC_data_rtp_tchf144' time='2.095062'/> <testcase classname='BTS_Tests:hopping' name='TC_data_rtp_tchf96' time='2.152656'/> <testcase classname='BTS_Tests:hopping' name='TC_data_rtp_tchf48' time='2.194825'/> <testcase classname='BTS_Tests:hopping' name='TC_data_rtp_tchh48' time='5.368433'> <failure type='fail-verdict'>Timeout waiting for matching Downlink data frame BTS_Tests.ttcn:9597 BTS_Tests control part BTS_Tests.ttcn:8880 TC_data_rtp_tchh48 testcase </failure> </testcase> <testcase classname='BTS_Tests:hopping' name='TC_data_rtp_tchf24' time='1.763565'/> <testcase classname='BTS_Tests:hopping' name='TC_data_rtp_tchh24' time='5.323853'> <failure type='fail-verdict'>Timeout waiting for matching Downlink data frame BTS_Tests.ttcn:9599 BTS_Tests control part BTS_Tests.ttcn:8949 TC_data_rtp_tchh24 testcase </failure> </testcase> <testcase classname='BTS_Tests:hopping' name='TC_data_facch_tchf144' time='1.999532'/> <testcase classname='BTS_Tests:hopping' name='TC_data_facch_tchf96' time='2.042164'/> <testcase classname='BTS_Tests:hopping' name='TC_data_facch_tchf48' time='2.004475'/> <testcase classname='BTS_Tests:hopping' name='TC_data_facch_tchh48' time='2.199648'/> <testcase classname='BTS_Tests:hopping' name='TC_data_facch_tchf24' time='2.039926'/> <testcase classname='BTS_Tests:hopping' name='TC_data_facch_tchh24' time='2.154858'/> <testcase classname='BTS_Tests:hopping' name='TC_early_immediate_assignment' time='3.563690'/> <testcase classname='BTS_Tests:hopping' name='TC_acch_overpower_rxqual_thresh' time='9.087820'> <failure type='fail-verdict'>Timeout waiting for L1CTL DATA.ind BTS_Tests.ttcn:9610 BTS_Tests control part BTS_Tests.ttcn:9244 TC_acch_overpower_rxqual_thresh testcase </failure> </testcase> <testcase classname='BTS_Tests:hopping' name='TC_acch_overpower_rxqual_thresh_dtx' time='9.032867'> <failure type='fail-verdict'>Timeout waiting for L1CTL DATA.ind BTS_Tests.ttcn:9611 BTS_Tests control part BTS_Tests.ttcn:9285 TC_acch_overpower_rxqual_thresh_dtx testcase </failure> </testcase> <testcase classname='BTS_Tests:hopping' name='TC_acch_overpower_always_on_facch' time='9.023875'> <failure type='fail-verdict'>Timeout waiting for L1CTL DATA.ind BTS_Tests.ttcn:9612 BTS_Tests control part BTS_Tests.ttcn:9317 TC_acch_overpower_always_on_facch testcase </failure> </testcase> <testcase classname='BTS_Tests:hopping' name='TC_acch_overpower_always_on_sacch' time='9.017528'> <failure type='fail-verdict'>Timeout waiting for L1CTL DATA.ind BTS_Tests.ttcn:9613 BTS_Tests control part BTS_Tests.ttcn:9349 TC_acch_overpower_always_on_sacch testcase </failure> </testcase> <testcase classname='BTS_Tests:hopping' name='TC_acch_overpower_limit' time='9.007153'> <failure type='fail-verdict'>Timeout waiting for L1CTL DATA.ind BTS_Tests.ttcn:9614 BTS_Tests control part BTS_Tests.ttcn:9380 TC_acch_overpower_limit testcase </failure> </testcase> <testcase classname='BTS_Tests_SMSCB:hopping' name='TC_cbch_load_idle_no_cbch' time='11.159849'/> <testcase classname='BTS_Tests_SMSCB:hopping' name='TC_sms_cb_cmd_sdcch4_1block' time='14.265971'/> <testcase classname='BTS_Tests_SMSCB:hopping' name='TC_sms_cb_cmd_sdcch4_2block' time='14.216865'/> <testcase classname='BTS_Tests_SMSCB:hopping' name='TC_sms_cb_cmd_sdcch4_3block' time='14.180041'/> <testcase classname='BTS_Tests_SMSCB:hopping' name='TC_sms_cb_cmd_sdcch4_4block' time='14.198817'/> <testcase classname='BTS_Tests_SMSCB:hopping' name='TC_sms_cb_cmd_sdcch4_multi' time='20.187813'/> <testcase classname='BTS_Tests_SMSCB:hopping' name='TC_sms_cb_cmd_sdcch4_schedule' time='14.192187'/> <testcase classname='BTS_Tests_SMSCB:hopping' name='TC_sms_cb_cmd_sdcch4_default_only' time='16.169927'/> <testcase classname='BTS_Tests_SMSCB:hopping' name='TC_sms_cb_cmd_sdcch4_default_and_normal' time='17.234273'/> <testcase classname='BTS_Tests_SMSCB:hopping' name='TC_sms_cb_cmd_sdcch4_default_then_null' time='26.158965'/> <testcase classname='BTS_Tests_SMSCB:hopping' name='TC_cbc_sdcch4_load_idle' time='16.064096'/> <testcase classname='BTS_Tests_SMSCB:hopping' name='TC_cbc_sdcch4_load_overload' time='18.204043'/> <testcase classname='BTS_Tests_SMSCB:hopping' name='TC_sms_cb_cmd_sdcch8_1block' time='14.231195'/> <testcase classname='BTS_Tests_SMSCB:hopping' name='TC_sms_cb_cmd_sdcch8_2block' time='14.204077'/> <testcase classname='BTS_Tests_SMSCB:hopping' name='TC_sms_cb_cmd_sdcch8_3block' time='14.214308'/> <testcase classname='BTS_Tests_SMSCB:hopping' name='TC_sms_cb_cmd_sdcch8_4block' time='14.226704'/> <testcase classname='BTS_Tests_SMSCB:hopping' name='TC_sms_cb_cmd_sdcch8_multi' time='20.204113'/> <testcase classname='BTS_Tests_SMSCB:hopping' name='TC_sms_cb_cmd_sdcch8_schedule' time='14.179777'/> <testcase classname='BTS_Tests_SMSCB:hopping' name='TC_sms_cb_cmd_sdcch8_default_only' time='16.195198'/> <testcase classname='BTS_Tests_SMSCB:hopping' name='TC_sms_cb_cmd_sdcch8_default_and_normal' time='17.202707'/> <testcase classname='BTS_Tests_SMSCB:hopping' name='TC_cbc_sdcch8_load_idle' time='16.132903'/> <testcase classname='BTS_Tests_SMSCB:hopping' name='TC_cbc_sdcch8_load_overload' time='18.200697'/> <testcase classname='BTS_Tests_SMSCB:hopping' name='TC_etws_p1ro' time='12.183205'/> <testcase classname='BTS_Tests_SMSCB:hopping' name='TC_etws_p1ro_end' time='16.153912'/> <testcase classname='BTS_Tests_SMSCB:hopping' name='TC_etws_pcu' time='1.139217'/> <testcase classname='BTS_Tests_LAPDm:hopping' name='TC_sabm_ua_dcch_sapi0' time='2.909735'/> <testcase classname='BTS_Tests_LAPDm:hopping' name='TC_sabm_ua_dcch_sapi0_nopayload' time='21.556779'/> <testcase classname='BTS_Tests_LAPDm:hopping' name='TC_sabm_ua_dcch_sapi3' time='21.369460'/> <testcase classname='BTS_Tests_LAPDm:hopping' name='TC_sabm_ua_dcch_sapi4' time='21.296300'/> <testcase classname='BTS_Tests_LAPDm:hopping' name='TC_sabm_contention' time='21.376193'/> <testcase classname='BTS_Tests_LAPDm:hopping' name='TC_sabm_retransmit' time='3.171230'/> <testcase classname='BTS_Tests_LAPDm:hopping' name='TC_sabm_retransmit_bts' time='81.497618'/> <testcase classname='BTS_Tests_LAPDm:hopping' name='TC_sabm_invalid_resp' time='23.364816'/> <testcase classname='BTS_Tests_LAPDm:hopping' name='TC_sabm_dm' time='14.034408'/> <testcase classname='BTS_Tests_LAPDm:hopping' name='TC_establish_ign_first_sabm' time='8.185633'/> <testcase classname='BTS_Tests_LAPDm:hopping' name='TC_iframe_seq_and_ack' time='29.590049'> <failure type='fail-verdict'>Received RSL ERROR IND { msg_disc := { msg_group := RSL_MDISC_RLL (1), transparent := false }, msg_type := RSL_MT_ERROR_IND (3), ies := { { iei := RSL_IE_CHAN_NR (1), body := { chan_nr := { u := { sdcch8 := { tag := '01'B, sub_chan := 4 } }, tn := 6 } } }, { iei := RSL_IE_LINK_IDENT (2), body := { link_id := { c := FACCH_SDCCH (0), na := false, prio := SAPI0_PRIO_NORMAL (0), sapi := 0 } } }, { iei := RSL_IE_RLM_CAUSE (22), body := { rlm_cause := { len := 1, payload := '01'O } } } } } BTS_Tests_LAPDm.ttcn:1484 BTS_Tests_LAPDm control part BTS_Tests_LAPDm.ttcn:579 TC_iframe_seq_and_ack testcase </failure> </testcase> <testcase classname='BTS_Tests_LAPDm:hopping' name='TC_iframe_timer_recovery' time='24.617586'> <failure type='fail-verdict'>Received RSL ERROR IND { msg_disc := { msg_group := RSL_MDISC_RLL (1), transparent := false }, msg_type := RSL_MT_ERROR_IND (3), ies := { { iei := RSL_IE_CHAN_NR (1), body := { chan_nr := { u := { sdcch8 := { tag := '01'B, sub_chan := 4 } }, tn := 6 } } }, { iei := RSL_IE_LINK_IDENT (2), body := { link_id := { c := FACCH_SDCCH (0), na := false, prio := SAPI0_PRIO_NORMAL (0), sapi := 0 } } }, { iei := RSL_IE_RLM_CAUSE (22), body := { rlm_cause := { len := 1, payload := '01'O } } } } } BTS_Tests_LAPDm.ttcn:1485 BTS_Tests_LAPDm control part BTS_Tests_LAPDm.ttcn:685 TC_iframe_timer_recovery testcase </failure> </testcase> <testcase classname='BTS_Tests_LAPDm:hopping' name='TC_ns_seq_error' time='29.614729'> <failure type='fail-verdict'>"BTS_Tests.ttcn:732 : Tguard timeout" BTS_Tests_LAPDm.ttcn:1486 BTS_Tests_LAPDm control part BTS_Tests_LAPDm.ttcn:768 TC_ns_seq_error testcase </failure> </testcase> <testcase classname='BTS_Tests_LAPDm:hopping' name='TC_nr_seq_error' time='2.914014'/> <testcase classname='BTS_Tests_LAPDm:hopping' name='TC_rec_invalid_frame' time='119.150902'> <failure type='fail-verdict'>"BTS_Tests_LAPDm.ttcn:909 : Missing LAPDm_RR RSP" BTS_Tests_LAPDm.ttcn:1488 BTS_Tests_LAPDm control part BTS_Tests_LAPDm.ttcn:961 TC_rec_invalid_frame testcase </failure> </testcase> <testcase classname='BTS_Tests_LAPDm:hopping' name='TC_segm_concat_dcch' time='13.534202'> <failure type='fail-verdict'>"BTS_Tests_LAPDm.ttcn:1023 : received unexpected LAPDm { sacch := false, sapi := 0, lapdm := { ab := { addr := { spare := '0'B, lpd := 0, sapi := 0, c_r := false, ea := true }, ctrl := { s := { n_r := 1, p_f := false, s := '10'B, spare := '01'B } }, len := 0, m := false, el := 1, payload := ''O, padding := '2B2B2B2B2B2B2B2B2B2B2B2B2B2B2B2B2B2B2B2B'O (\"++++++++++++++++++++\") } } }" BTS_Tests_LAPDm.ttcn:1489 BTS_Tests_LAPDm control part BTS_Tests_LAPDm.ttcn:1088 TC_segm_concat_dcch testcase </failure> </testcase> <testcase classname='BTS_Tests_LAPDm:hopping' name='TC_segm_concat_sacch' time='48.534440'> <failure type='fail-verdict'>"BTS_Tests_LAPDm.ttcn:1023 : received unexpected LAPDm { sacch := true, sapi := 0, lapdm := { ab := { addr := { spare := '0'B, lpd := 0, sapi := 0, c_r := false, ea := true }, ctrl := { u := { u := '011'B, p_f := true, u2 := '00'B, spare := '11'B } }, len := 0, m := false, el := 1, payload := ''O, padding := '2B2B2B2B2B2B2B2B2B2B2B2B2B2B2B2B2B2B'O (\"++++++++++++++++++\") } } }" BTS_Tests_LAPDm.ttcn:1490 BTS_Tests_LAPDm control part BTS_Tests_LAPDm.ttcn:1093 TC_segm_concat_sacch testcase </failure> </testcase> <testcase classname='BTS_Tests_LAPDm:hopping' name='TC_t200_n200' time='39.864603'> <failure type='fail-verdict'>Missing RSL RLL ERROR INDICATION BTS_Tests_LAPDm.ttcn:1491 BTS_Tests_LAPDm control part BTS_Tests_LAPDm.ttcn:1182 TC_t200_n200 testcase </failure> </testcase> <testcase classname='BTS_Tests_LAPDm:hopping' name='TC_rr_response_frame_loss' time='6.697028'> <failure type='fail-verdict'>Timeout waiting for RR or REJ BTS_Tests_LAPDm.ttcn:1492 BTS_Tests_LAPDm control part BTS_Tests_LAPDm.ttcn:1239 TC_rr_response_frame_loss testcase </failure> </testcase> <testcase classname='BTS_Tests_LAPDm:hopping' name='TC_incorrect_cr' time='15.805482'/> <testcase classname='BTS_Tests_LAPDm:hopping' name='TC_sabm_incorrect_c' time='23.335329'> <failure type='fail-verdict'>"BTS_Tests.ttcn:732 : Tguard timeout" BTS_Tests_LAPDm.ttcn:1494 BTS_Tests_LAPDm control part BTS_Tests_LAPDm.ttcn:1341 TC_sabm_incorrect_c testcase </failure> </testcase> <testcase classname='BTS_Tests_LAPDm:hopping' name='TC_normal_reestablishment' time='16.105225'> <failure type='fail-verdict'>"BTS_Tests_LAPDm.ttcn:1023 : received unexpected LAPDm { sacch := false, sapi := 0, lapdm := { ab := { addr := { spare := '0'B, lpd := 0, sapi := 0, c_r := false, ea := true }, ctrl := { u := { u := '011'B, p_f := true, u2 := '00'B, spare := '11'B } }, len := 5, m := false, el := 1, payload := '1713B45B17'O, padding := '2B2B2B2B2B2B2B2B2B2B2B2B2B2B2B'O (\"+++++++++++++++\") } } }" BTS_Tests_LAPDm.ttcn:1495 BTS_Tests_LAPDm control part BTS_Tests_LAPDm.ttcn:1403 TC_normal_reestablishment testcase </failure> </testcase> <testcase classname='BTS_Tests_LAPDm:hopping' name='TC_normal_reestablishment_state_unacked' time='12.367514'> <failure type='fail-verdict'>"BTS_Tests_LAPDm.ttcn:1023 : received unexpected LAPDm { sacch := false, sapi := 0, lapdm := { ab := { addr := { spare := '0'B, lpd := 0, sapi := 0, c_r := false, ea := true }, ctrl := { s := { n_r := 1, p_f := false, s := '10'B, spare := '01'B } }, len := 0, m := false, el := 1, payload := ''O, padding := '2B2B2B2B2B2B2B2B2B2B2B2B2B2B2B2B2B2B2B2B'O (\"++++++++++++++++++++\") } } }" BTS_Tests_LAPDm.ttcn:1496 BTS_Tests_LAPDm control part BTS_Tests_LAPDm.ttcn:1470 TC_normal_reestablishment_state_unacked testcase </failure> </testcase> <testcase classname='BTS_Tests_VAMOS:hopping' name='TC_vamos_chan_act_vff' time='2.437335'/> <testcase classname='BTS_Tests_VAMOS:hopping' name='TC_vamos_chan_act_vhh' time='2.567410'/> <testcase classname='BTS_Tests_VAMOS:hopping' name='TC_vamos_chan_act_hvhh' time='2.565616'/> <testcase classname='BTS_Tests_VAMOS:hopping' name='TC_vamos_chan_act_dyn_ipa_vff' time='2.573395'/> <testcase classname='BTS_Tests_VAMOS:hopping' name='TC_vamos_chan_act_dyn_osmo_vff' time='2.573073'/> <testcase classname='BTS_Tests_VAMOS:hopping' name='TC_vamos_chan_act_dyn_osmo_vhh' time='2.571781'/> <testcase classname='BTS_Tests_VAMOS:hopping' name='TC_vamos_chan_act_dyn_osmo_hvhh' time='2.551975'/> <testcase classname='BTS_Tests_VAMOS:hopping' name='TC_vamos_chan_mode_modify_vff' time='1.328386'/> <testcase classname='BTS_Tests_VAMOS:hopping' name='TC_vamos_chan_mode_modify_vhh' time='1.385296'/> <testcase classname='BTS_Tests_VAMOS:hopping' name='TC_vamos_chan_mode_modify_hvhh' time='1.349180'/> <testcase classname='BTS_Tests_VAMOS:hopping' name='TC_vamos_chan_mode_modify_dyn_ipa_vff' time='1.362340'/> <testcase classname='BTS_Tests_VAMOS:hopping' name='TC_vamos_chan_mode_modify_dyn_osmo_vff' time='1.346890'/> <testcase classname='BTS_Tests_VAMOS:hopping' name='TC_vamos_chan_mode_modify_dyn_osmo_vhh' time='1.355325'/> <testcase classname='BTS_Tests_VAMOS:hopping' name='TC_vamos_chan_mode_modify_dyn_osmo_hvhh' time='1.366004'/> <testcase classname='BTS_Tests_ASCI:hopping' name='TC_vbs_notification' time='4.678972'/> <testcase classname='BTS_Tests_ASCI:hopping' name='TC_vgcs_uplink_free_and_busy' time='1.769119'/> <testcase classname='BTS_Tests_ASCI:hopping' name='TC_vgcs_talker_fail' time='17.068088'/> <testcase classname='BTS_Tests_ASCI:hopping' name='TC_vgcs_talker_est_rel' time='1.445635'/> <testcase classname='BTS_Tests_ASCI:hopping' name='TC_vgcs_listener_det' time='3.384157'/> </testsuite> <?xml version="1.0"?> <testsuite name='Titan' tests='17' failures='0' errors='0' skipped='0' inconc='0' time='96.00'> <testcase classname='BTS_Tests_OML' name='TC_wrong_mdisc' time='10.740559'/> <testcase classname='BTS_Tests_OML' name='TC_wrong_msgtype' time='0.713504'/> <testcase classname='BTS_Tests_OML' name='TC_short_length' time='0.697541'/> <testcase classname='BTS_Tests_OML' name='TC_long_length' time='0.705911'/> <testcase classname='BTS_Tests_OML' name='TC_wrong_placement' time='0.704098'/> <testcase classname='BTS_Tests_OML' name='TC_wrong_seq' time='0.727698'/> <testcase classname='BTS_Tests_OML' name='TC_wrong_obj_class' time='0.705414'/> <testcase classname='BTS_Tests_OML' name='TC_wrong_bts_nr' time='0.737487'/> <testcase classname='BTS_Tests_OML' name='TC_wrong_trx_nr' time='0.710221'/> <testcase classname='BTS_Tests_OML' name='TC_radio_carrier_opstart_noattr' time='0.714764'/> <testcase classname='BTS_Tests_OML' name='TC_bts_opstart' time='0.701010'/> <testcase classname='BTS_Tests_OML' name='TC_bts_opstart_noattr' time='0.711892'/> <testcase classname='BTS_Tests_OML' name='TC_ts_opstart' time='0.721336'/> <testcase classname='BTS_Tests_OML' name='TC_ts_opstart_noattr' time='0.744173'/> <testcase classname='BTS_Tests_OML' name='TC_initial_state_reports' time='0.708354'/> <testcase classname='BTS_Tests_OML' name='TC_ipa_osmo_pcu_anr_fwd' time='0.725049'/> <testcase classname='BTS_Tests_OML' name='TC_ipa_rsl_connect_nack' time='0.705686'/> </testsuite> + check_respawn_count + set +x [0;31m ================================================================ WARNING: osmo-bts was respawned 4 times (expected: 3)! (OS#6794) ================================================================ [0m+ RC=1 + uptime + grep --color=always -o load.* [01;31m[Kload average: 0.46, 0.46, 0.49[m[K + exit 1 Build step 'Execute shell' marked build as failure Recording test results [Checks API] No suitable checks publisher found.
1
0
0
0
Build failed in Jenkins: ttcn3-bts-test-asan #803
by jenkins@lists.osmocom.org
23 Aug '26
23 Aug '26
See <
https://jenkins.osmocom.org/jenkins/job/ttcn3-bts-test-asan/803/display/red…
> Changes: ------------------------------------------ [...truncated 12.37 MiB...] <failure type='fail-verdict'>"BTS_Tests.ttcn:732 : Tguard timeout" BTS_Tests.ttcn:9557 BTS_Tests control part BTS_Tests.ttcn:7525 TC_rll_rel_req testcase </failure> </testcase> <testcase classname='BTS_Tests:hopping' name='TC_rll_unit_data_req_DCCH' time='2.356189'/> <testcase classname='BTS_Tests:hopping' name='TC_rll_unit_data_req_ACCH' time='5.323838'/> <testcase classname='BTS_Tests:hopping' name='TC_rll_unit_data_ind_DCCH' time='2.959950'/> <testcase classname='BTS_Tests:hopping' name='TC_rll_unit_data_ind_ACCH' time='11.508230'/> <testcase classname='BTS_Tests:hopping' name='TC_chan_act_a51' time='2.642159'/> <testcase classname='BTS_Tests:hopping' name='TC_chan_act_a52' time='2.722135'/> <testcase classname='BTS_Tests:hopping' name='TC_chan_act_a53' time='2.708994'/> <testcase classname='BTS_Tests:hopping' name='TC_chan_act_a54' time='2.729169'/> <testcase classname='BTS_Tests:hopping' name='TC_encr_cmd_a51' time='5.247470'/> <testcase classname='BTS_Tests:hopping' name='TC_encr_cmd_a52' time='5.222280'/> <testcase classname='BTS_Tests:hopping' name='TC_encr_cmd_a53' time='5.219032'/> <testcase classname='BTS_Tests:hopping' name='TC_encr_cmd_a54' time='5.258444'/> <testcase classname='BTS_Tests:hopping' name='TC_err_rep_wrong_mdisc' time='1.227465'/> <testcase classname='BTS_Tests:hopping' name='TC_err_rep_wrong_msg_type' time='1.356744'/> <testcase classname='BTS_Tests:hopping' name='TC_err_rep_wrong_sequence' time='1.285036'/> <testcase classname='BTS_Tests:hopping' name='TC_lapdm_selftest' time='0.005321'/> <testcase classname='BTS_Tests:hopping' name='TC_tch_sign_l2_fill_frame' time='18.468813'/> <testcase classname='BTS_Tests:hopping' name='TC_tch_sign_l2_fill_frame_dtxd' time='2.141743'> <failure type='fail-verdict'>Received DTX TCH fill frame with bad frame number: 175 (mod 104: 71) (mod 26: 19) BTS_Tests.ttcn:9579 BTS_Tests control part BTS_Tests.ttcn:8110 TC_tch_sign_l2_fill_frame_dtxd testcase </failure> </testcase> <testcase classname='BTS_Tests:hopping' name='TC_chopped_ipa_ping' time='24.707392'/> <testcase classname='BTS_Tests:hopping' name='TC_chopped_ipa_payload' time='42.593379'/> <testcase classname='BTS_Tests:hopping' name='TC_ms_pwr_ctrl_constant' time='16.914875'/> <testcase classname='BTS_Tests:hopping' name='TC_ms_pwr_ctrl_pf_ewma' time='31.995652'/> <testcase classname='BTS_Tests:hopping' name='TC_speech_no_rtp_tchf' time='7.310262'/> <testcase classname='BTS_Tests:hopping' name='TC_speech_no_rtp_tchh' time='5.421939'/> <testcase classname='BTS_Tests:hopping' name='TC_speech_rtp_tchf' time='7.706734'/> <testcase classname='BTS_Tests:hopping' name='TC_speech_rtp_tchh' time='5.526092'/> <testcase classname='BTS_Tests:hopping' name='TC_speech_osmux_tchf' time='3.392012'/> <testcase classname='BTS_Tests:hopping' name='TC_speech_osmux_tchh' time='3.499594'/> <testcase classname='BTS_Tests:hopping' name='TC_data_rtp_tchf144' time='2.104454'/> <testcase classname='BTS_Tests:hopping' name='TC_data_rtp_tchf96' time='2.097992'/> <testcase classname='BTS_Tests:hopping' name='TC_data_rtp_tchf48' time='2.136505'/> <testcase classname='BTS_Tests:hopping' name='TC_data_rtp_tchh48' time='5.301268'> <failure type='fail-verdict'>Timeout waiting for matching Downlink data frame BTS_Tests.ttcn:9597 BTS_Tests control part BTS_Tests.ttcn:8880 TC_data_rtp_tchh48 testcase </failure> </testcase> <testcase classname='BTS_Tests:hopping' name='TC_data_rtp_tchf24' time='1.784263'/> <testcase classname='BTS_Tests:hopping' name='TC_data_rtp_tchh24' time='5.311518'> <failure type='fail-verdict'>Timeout waiting for matching Downlink data frame BTS_Tests.ttcn:9599 BTS_Tests control part BTS_Tests.ttcn:8949 TC_data_rtp_tchh24 testcase </failure> </testcase> <testcase classname='BTS_Tests:hopping' name='TC_data_facch_tchf144' time='2.011916'/> <testcase classname='BTS_Tests:hopping' name='TC_data_facch_tchf96' time='2.044533'/> <testcase classname='BTS_Tests:hopping' name='TC_data_facch_tchf48' time='2.061110'/> <testcase classname='BTS_Tests:hopping' name='TC_data_facch_tchh48' time='2.172248'/> <testcase classname='BTS_Tests:hopping' name='TC_data_facch_tchf24' time='2.055986'/> <testcase classname='BTS_Tests:hopping' name='TC_data_facch_tchh24' time='2.149467'/> <testcase classname='BTS_Tests:hopping' name='TC_early_immediate_assignment' time='3.561877'/> <testcase classname='BTS_Tests:hopping' name='TC_acch_overpower_rxqual_thresh' time='9.077128'> <failure type='fail-verdict'>Timeout waiting for L1CTL DATA.ind BTS_Tests.ttcn:9610 BTS_Tests control part BTS_Tests.ttcn:9244 TC_acch_overpower_rxqual_thresh testcase </failure> </testcase> <testcase classname='BTS_Tests:hopping' name='TC_acch_overpower_rxqual_thresh_dtx' time='9.033758'> <failure type='fail-verdict'>Timeout waiting for L1CTL DATA.ind BTS_Tests.ttcn:9611 BTS_Tests control part BTS_Tests.ttcn:9285 TC_acch_overpower_rxqual_thresh_dtx testcase </failure> </testcase> <testcase classname='BTS_Tests:hopping' name='TC_acch_overpower_always_on_facch' time='9.016074'> <failure type='fail-verdict'>Timeout waiting for L1CTL DATA.ind BTS_Tests.ttcn:9612 BTS_Tests control part BTS_Tests.ttcn:9317 TC_acch_overpower_always_on_facch testcase </failure> </testcase> <testcase classname='BTS_Tests:hopping' name='TC_acch_overpower_always_on_sacch' time='9.042077'> <failure type='fail-verdict'>Timeout waiting for L1CTL DATA.ind BTS_Tests.ttcn:9613 BTS_Tests control part BTS_Tests.ttcn:9349 TC_acch_overpower_always_on_sacch testcase </failure> </testcase> <testcase classname='BTS_Tests:hopping' name='TC_acch_overpower_limit' time='9.042036'> <failure type='fail-verdict'>Timeout waiting for L1CTL DATA.ind BTS_Tests.ttcn:9614 BTS_Tests control part BTS_Tests.ttcn:9380 TC_acch_overpower_limit testcase </failure> </testcase> <testcase classname='BTS_Tests_SMSCB:hopping' name='TC_cbch_load_idle_no_cbch' time='11.199883'/> <testcase classname='BTS_Tests_SMSCB:hopping' name='TC_sms_cb_cmd_sdcch4_1block' time='14.293511'/> <testcase classname='BTS_Tests_SMSCB:hopping' name='TC_sms_cb_cmd_sdcch4_2block' time='14.210576'/> <testcase classname='BTS_Tests_SMSCB:hopping' name='TC_sms_cb_cmd_sdcch4_3block' time='14.211600'/> <testcase classname='BTS_Tests_SMSCB:hopping' name='TC_sms_cb_cmd_sdcch4_4block' time='14.206098'/> <testcase classname='BTS_Tests_SMSCB:hopping' name='TC_sms_cb_cmd_sdcch4_multi' time='20.219209'/> <testcase classname='BTS_Tests_SMSCB:hopping' name='TC_sms_cb_cmd_sdcch4_schedule' time='14.165158'/> <testcase classname='BTS_Tests_SMSCB:hopping' name='TC_sms_cb_cmd_sdcch4_default_only' time='16.221784'/> <testcase classname='BTS_Tests_SMSCB:hopping' name='TC_sms_cb_cmd_sdcch4_default_and_normal' time='17.165406'/> <testcase classname='BTS_Tests_SMSCB:hopping' name='TC_sms_cb_cmd_sdcch4_default_then_null' time='30.016247'/> <testcase classname='BTS_Tests_SMSCB:hopping' name='TC_cbc_sdcch4_load_idle' time='16.060184'/> <testcase classname='BTS_Tests_SMSCB:hopping' name='TC_cbc_sdcch4_load_overload' time='18.282818'/> <testcase classname='BTS_Tests_SMSCB:hopping' name='TC_sms_cb_cmd_sdcch8_1block' time='14.238701'/> <testcase classname='BTS_Tests_SMSCB:hopping' name='TC_sms_cb_cmd_sdcch8_2block' time='14.274891'/> <testcase classname='BTS_Tests_SMSCB:hopping' name='TC_sms_cb_cmd_sdcch8_3block' time='14.231474'/> <testcase classname='BTS_Tests_SMSCB:hopping' name='TC_sms_cb_cmd_sdcch8_4block' time='14.229474'/> <testcase classname='BTS_Tests_SMSCB:hopping' name='TC_sms_cb_cmd_sdcch8_multi' time='20.246181'/> <testcase classname='BTS_Tests_SMSCB:hopping' name='TC_sms_cb_cmd_sdcch8_schedule' time='14.183705'/> <testcase classname='BTS_Tests_SMSCB:hopping' name='TC_sms_cb_cmd_sdcch8_default_only' time='16.231344'/> <testcase classname='BTS_Tests_SMSCB:hopping' name='TC_sms_cb_cmd_sdcch8_default_and_normal' time='17.212649'/> <testcase classname='BTS_Tests_SMSCB:hopping' name='TC_cbc_sdcch8_load_idle' time='16.183295'/> <testcase classname='BTS_Tests_SMSCB:hopping' name='TC_cbc_sdcch8_load_overload' time='18.185929'/> <testcase classname='BTS_Tests_SMSCB:hopping' name='TC_etws_p1ro' time='12.159264'/> <testcase classname='BTS_Tests_SMSCB:hopping' name='TC_etws_p1ro_end' time='16.152318'/> <testcase classname='BTS_Tests_SMSCB:hopping' name='TC_etws_pcu' time='1.141073'/> <testcase classname='BTS_Tests_LAPDm:hopping' name='TC_sabm_ua_dcch_sapi0' time='2.895028'/> <testcase classname='BTS_Tests_LAPDm:hopping' name='TC_sabm_ua_dcch_sapi0_nopayload' time='21.517019'/> <testcase classname='BTS_Tests_LAPDm:hopping' name='TC_sabm_ua_dcch_sapi3' time='21.403306'/> <testcase classname='BTS_Tests_LAPDm:hopping' name='TC_sabm_ua_dcch_sapi4' time='21.357029'/> <testcase classname='BTS_Tests_LAPDm:hopping' name='TC_sabm_contention' time='21.302966'/> <testcase classname='BTS_Tests_LAPDm:hopping' name='TC_sabm_retransmit' time='3.186350'/> <testcase classname='BTS_Tests_LAPDm:hopping' name='TC_sabm_retransmit_bts' time='81.463060'/> <testcase classname='BTS_Tests_LAPDm:hopping' name='TC_sabm_invalid_resp' time='23.422096'/> <testcase classname='BTS_Tests_LAPDm:hopping' name='TC_sabm_dm' time='14.054651'/> <testcase classname='BTS_Tests_LAPDm:hopping' name='TC_establish_ign_first_sabm' time='7.987983'/> <testcase classname='BTS_Tests_LAPDm:hopping' name='TC_iframe_seq_and_ack' time='29.629659'> <failure type='fail-verdict'>Received RSL ERROR IND { msg_disc := { msg_group := RSL_MDISC_RLL (1), transparent := false }, msg_type := RSL_MT_ERROR_IND (3), ies := { { iei := RSL_IE_CHAN_NR (1), body := { chan_nr := { u := { sdcch8 := { tag := '01'B, sub_chan := 4 } }, tn := 6 } } }, { iei := RSL_IE_LINK_IDENT (2), body := { link_id := { c := FACCH_SDCCH (0), na := false, prio := SAPI0_PRIO_NORMAL (0), sapi := 0 } } }, { iei := RSL_IE_RLM_CAUSE (22), body := { rlm_cause := { len := 1, payload := '01'O } } } } } BTS_Tests_LAPDm.ttcn:1484 BTS_Tests_LAPDm control part BTS_Tests_LAPDm.ttcn:579 TC_iframe_seq_and_ack testcase </failure> </testcase> <testcase classname='BTS_Tests_LAPDm:hopping' name='TC_iframe_timer_recovery' time='24.632562'> <failure type='fail-verdict'>Received RSL ERROR IND { msg_disc := { msg_group := RSL_MDISC_RLL (1), transparent := false }, msg_type := RSL_MT_ERROR_IND (3), ies := { { iei := RSL_IE_CHAN_NR (1), body := { chan_nr := { u := { sdcch8 := { tag := '01'B, sub_chan := 4 } }, tn := 6 } } }, { iei := RSL_IE_LINK_IDENT (2), body := { link_id := { c := FACCH_SDCCH (0), na := false, prio := SAPI0_PRIO_NORMAL (0), sapi := 0 } } }, { iei := RSL_IE_RLM_CAUSE (22), body := { rlm_cause := { len := 1, payload := '01'O } } } } } BTS_Tests_LAPDm.ttcn:1485 BTS_Tests_LAPDm control part BTS_Tests_LAPDm.ttcn:685 TC_iframe_timer_recovery testcase </failure> </testcase> <testcase classname='BTS_Tests_LAPDm:hopping' name='TC_ns_seq_error' time='29.874228'> <failure type='fail-verdict'>"BTS_Tests.ttcn:732 : Tguard timeout" BTS_Tests_LAPDm.ttcn:1486 BTS_Tests_LAPDm control part BTS_Tests_LAPDm.ttcn:768 TC_ns_seq_error testcase </failure> </testcase> <testcase classname='BTS_Tests_LAPDm:hopping' name='TC_nr_seq_error' time='2.902706'/> <testcase classname='BTS_Tests_LAPDm:hopping' name='TC_rec_invalid_frame' time='119.184108'> <failure type='fail-verdict'>"BTS_Tests_LAPDm.ttcn:909 : Missing LAPDm_RR RSP" BTS_Tests_LAPDm.ttcn:1488 BTS_Tests_LAPDm control part BTS_Tests_LAPDm.ttcn:961 TC_rec_invalid_frame testcase </failure> </testcase> <testcase classname='BTS_Tests_LAPDm:hopping' name='TC_segm_concat_dcch' time='13.577667'> <failure type='fail-verdict'>"BTS_Tests_LAPDm.ttcn:1023 : received unexpected LAPDm { sacch := false, sapi := 0, lapdm := { ab := { addr := { spare := '0'B, lpd := 0, sapi := 0, c_r := false, ea := true }, ctrl := { s := { n_r := 1, p_f := false, s := '10'B, spare := '01'B } }, len := 0, m := false, el := 1, payload := ''O, padding := '2B2B2B2B2B2B2B2B2B2B2B2B2B2B2B2B2B2B2B2B'O (\"++++++++++++++++++++\") } } }" BTS_Tests_LAPDm.ttcn:1489 BTS_Tests_LAPDm control part BTS_Tests_LAPDm.ttcn:1088 TC_segm_concat_dcch testcase </failure> </testcase> <testcase classname='BTS_Tests_LAPDm:hopping' name='TC_segm_concat_sacch' time='48.568776'> <failure type='fail-verdict'>"BTS_Tests_LAPDm.ttcn:1023 : received unexpected LAPDm { sacch := true, sapi := 0, lapdm := { ab := { addr := { spare := '0'B, lpd := 0, sapi := 0, c_r := false, ea := true }, ctrl := { u := { u := '011'B, p_f := true, u2 := '00'B, spare := '11'B } }, len := 0, m := false, el := 1, payload := ''O, padding := '2B2B2B2B2B2B2B2B2B2B2B2B2B2B2B2B2B2B'O (\"++++++++++++++++++\") } } }" BTS_Tests_LAPDm.ttcn:1490 BTS_Tests_LAPDm control part BTS_Tests_LAPDm.ttcn:1093 TC_segm_concat_sacch testcase </failure> </testcase> <testcase classname='BTS_Tests_LAPDm:hopping' name='TC_t200_n200' time='39.850249'> <failure type='fail-verdict'>Missing RSL RLL ERROR INDICATION BTS_Tests_LAPDm.ttcn:1491 BTS_Tests_LAPDm control part BTS_Tests_LAPDm.ttcn:1182 TC_t200_n200 testcase </failure> </testcase> <testcase classname='BTS_Tests_LAPDm:hopping' name='TC_rr_response_frame_loss' time='6.709851'> <failure type='fail-verdict'>Timeout waiting for RR or REJ BTS_Tests_LAPDm.ttcn:1492 BTS_Tests_LAPDm control part BTS_Tests_LAPDm.ttcn:1239 TC_rr_response_frame_loss testcase </failure> </testcase> <testcase classname='BTS_Tests_LAPDm:hopping' name='TC_incorrect_cr' time='15.833670'/> <testcase classname='BTS_Tests_LAPDm:hopping' name='TC_sabm_incorrect_c' time='23.328222'> <failure type='fail-verdict'>"BTS_Tests.ttcn:732 : Tguard timeout" BTS_Tests_LAPDm.ttcn:1494 BTS_Tests_LAPDm control part BTS_Tests_LAPDm.ttcn:1341 TC_sabm_incorrect_c testcase </failure> </testcase> <testcase classname='BTS_Tests_LAPDm:hopping' name='TC_normal_reestablishment' time='16.153157'> <failure type='fail-verdict'>"BTS_Tests_LAPDm.ttcn:1023 : received unexpected LAPDm { sacch := false, sapi := 0, lapdm := { ab := { addr := { spare := '0'B, lpd := 0, sapi := 0, c_r := false, ea := true }, ctrl := { u := { u := '011'B, p_f := true, u2 := '00'B, spare := '11'B } }, len := 5, m := false, el := 1, payload := 'CAAB5635D5'O, padding := '2B2B2B2B2B2B2B2B2B2B2B2B2B2B2B'O (\"+++++++++++++++\") } } }" BTS_Tests_LAPDm.ttcn:1495 BTS_Tests_LAPDm control part BTS_Tests_LAPDm.ttcn:1403 TC_normal_reestablishment testcase </failure> </testcase> <testcase classname='BTS_Tests_LAPDm:hopping' name='TC_normal_reestablishment_state_unacked' time='12.405370'> <failure type='fail-verdict'>"BTS_Tests_LAPDm.ttcn:1023 : received unexpected LAPDm { sacch := false, sapi := 0, lapdm := { ab := { addr := { spare := '0'B, lpd := 0, sapi := 0, c_r := false, ea := true }, ctrl := { s := { n_r := 1, p_f := false, s := '10'B, spare := '01'B } }, len := 0, m := false, el := 1, payload := ''O, padding := '2B2B2B2B2B2B2B2B2B2B2B2B2B2B2B2B2B2B2B2B'O (\"++++++++++++++++++++\") } } }" BTS_Tests_LAPDm.ttcn:1496 BTS_Tests_LAPDm control part BTS_Tests_LAPDm.ttcn:1470 TC_normal_reestablishment_state_unacked testcase </failure> </testcase> <testcase classname='BTS_Tests_VAMOS:hopping' name='TC_vamos_chan_act_vff' time='2.454171'/> <testcase classname='BTS_Tests_VAMOS:hopping' name='TC_vamos_chan_act_vhh' time='2.565728'/> <testcase classname='BTS_Tests_VAMOS:hopping' name='TC_vamos_chan_act_hvhh' time='2.578494'/> <testcase classname='BTS_Tests_VAMOS:hopping' name='TC_vamos_chan_act_dyn_ipa_vff' time='2.549562'/> <testcase classname='BTS_Tests_VAMOS:hopping' name='TC_vamos_chan_act_dyn_osmo_vff' time='2.538953'/> <testcase classname='BTS_Tests_VAMOS:hopping' name='TC_vamos_chan_act_dyn_osmo_vhh' time='2.558471'/> <testcase classname='BTS_Tests_VAMOS:hopping' name='TC_vamos_chan_act_dyn_osmo_hvhh' time='2.551096'/> <testcase classname='BTS_Tests_VAMOS:hopping' name='TC_vamos_chan_mode_modify_vff' time='1.366614'/> <testcase classname='BTS_Tests_VAMOS:hopping' name='TC_vamos_chan_mode_modify_vhh' time='1.390281'/> <testcase classname='BTS_Tests_VAMOS:hopping' name='TC_vamos_chan_mode_modify_hvhh' time='1.378640'/> <testcase classname='BTS_Tests_VAMOS:hopping' name='TC_vamos_chan_mode_modify_dyn_ipa_vff' time='1.364907'/> <testcase classname='BTS_Tests_VAMOS:hopping' name='TC_vamos_chan_mode_modify_dyn_osmo_vff' time='1.321169'/> <testcase classname='BTS_Tests_VAMOS:hopping' name='TC_vamos_chan_mode_modify_dyn_osmo_vhh' time='1.374543'/> <testcase classname='BTS_Tests_VAMOS:hopping' name='TC_vamos_chan_mode_modify_dyn_osmo_hvhh' time='1.363298'/> <testcase classname='BTS_Tests_ASCI:hopping' name='TC_vbs_notification' time='4.687894'/> <testcase classname='BTS_Tests_ASCI:hopping' name='TC_vgcs_uplink_free_and_busy' time='1.847790'/> <testcase classname='BTS_Tests_ASCI:hopping' name='TC_vgcs_talker_fail' time='17.026562'/> <testcase classname='BTS_Tests_ASCI:hopping' name='TC_vgcs_talker_est_rel' time='1.433629'/> <testcase classname='BTS_Tests_ASCI:hopping' name='TC_vgcs_listener_det' time='3.338884'/> </testsuite> <?xml version="1.0"?> <testsuite name='Titan' tests='17' failures='0' errors='0' skipped='0' inconc='0' time='96.00'> <testcase classname='BTS_Tests_OML' name='TC_wrong_mdisc' time='10.608854'/> <testcase classname='BTS_Tests_OML' name='TC_wrong_msgtype' time='0.665045'/> <testcase classname='BTS_Tests_OML' name='TC_short_length' time='0.698615'/> <testcase classname='BTS_Tests_OML' name='TC_long_length' time='0.775516'/> <testcase classname='BTS_Tests_OML' name='TC_wrong_placement' time='0.743623'/> <testcase classname='BTS_Tests_OML' name='TC_wrong_seq' time='0.706709'/> <testcase classname='BTS_Tests_OML' name='TC_wrong_obj_class' time='0.691189'/> <testcase classname='BTS_Tests_OML' name='TC_wrong_bts_nr' time='0.717681'/> <testcase classname='BTS_Tests_OML' name='TC_wrong_trx_nr' time='0.743561'/> <testcase classname='BTS_Tests_OML' name='TC_radio_carrier_opstart_noattr' time='0.715123'/> <testcase classname='BTS_Tests_OML' name='TC_bts_opstart' time='0.700465'/> <testcase classname='BTS_Tests_OML' name='TC_bts_opstart_noattr' time='0.727523'/> <testcase classname='BTS_Tests_OML' name='TC_ts_opstart' time='0.734688'/> <testcase classname='BTS_Tests_OML' name='TC_ts_opstart_noattr' time='0.731316'/> <testcase classname='BTS_Tests_OML' name='TC_initial_state_reports' time='0.688829'/> <testcase classname='BTS_Tests_OML' name='TC_ipa_osmo_pcu_anr_fwd' time='0.692885'/> <testcase classname='BTS_Tests_OML' name='TC_ipa_rsl_connect_nack' time='0.710095'/> </testsuite> + check_respawn_count + set +x [0;31m ================================================================ WARNING: osmo-bts was respawned 7 times (expected: 3)! (OS#6794) ================================================================ [0m+ RC=1 + uptime + grep --color=always -o load.* [01;31m[Kload average: 0.78, 0.69, 0.63[m[K + exit 1 Build step 'Execute shell' marked build as failure Recording test results [Checks API] No suitable checks publisher found.
1
0
0
0
← Newer
1
2
3
4
5
...
12
Older →
Jump to page:
1
2
3
4
5
6
7
8
9
10
11
12
Results per page:
10
25
50
100
200