lists.osmocom.org
Sign In
Sign Up
Sign In
Sign Up
Manage this list
×
Keyboard Shortcuts
Thread View
j
: Next unread message
k
: Previous unread message
j a
: Jump to all threads
j l
: Jump to MailingList overview
2026
September
August
July
June
May
April
March
February
January
2025
December
November
October
September
August
July
June
May
April
March
February
January
2024
December
November
October
September
August
July
June
May
April
March
February
January
2023
December
November
October
September
August
July
June
May
April
March
February
January
2022
December
November
October
September
August
July
June
May
April
March
February
January
2021
December
November
October
September
August
July
June
May
April
March
February
January
2020
December
November
October
September
August
July
June
May
April
March
February
January
2019
December
November
October
September
August
July
June
May
April
March
List overview
Download
jenkins-notifications
----- 2026 -----
September 2026
August 2026
July 2026
June 2026
May 2026
April 2026
March 2026
February 2026
January 2026
----- 2025 -----
December 2025
November 2025
October 2025
September 2025
August 2025
July 2025
June 2025
May 2025
April 2025
March 2025
February 2025
January 2025
----- 2024 -----
December 2024
November 2024
October 2024
September 2024
August 2024
July 2024
June 2024
May 2024
April 2024
March 2024
February 2024
January 2024
----- 2023 -----
December 2023
November 2023
October 2023
September 2023
August 2023
July 2023
June 2023
May 2023
April 2023
March 2023
February 2023
January 2023
----- 2022 -----
December 2022
November 2022
October 2022
September 2022
August 2022
July 2022
June 2022
May 2022
April 2022
March 2022
February 2022
January 2022
----- 2021 -----
December 2021
November 2021
October 2021
September 2021
August 2021
July 2021
June 2021
May 2021
April 2021
March 2021
February 2021
January 2021
----- 2020 -----
December 2020
November 2020
October 2020
September 2020
August 2020
July 2020
June 2020
May 2020
April 2020
March 2020
February 2020
January 2020
----- 2019 -----
December 2019
November 2019
October 2019
September 2019
August 2019
July 2019
June 2019
May 2019
April 2019
March 2019
jenkins-notifications@lists.osmocom.org
1 participants
6691 discussions
Start a n
N
ew thread
Build failed in Jenkins: ttcn3-sccp-test-asan #805
by jenkins@lists.osmocom.org
21 Aug '26
21 Aug '26
See <
https://jenkins.osmocom.org/jenkins/job/ttcn3-sccp-test-asan/805/display/re…
> Changes: [Pau Espin Pedrol] sgsn: Fail in obvious way when unexpected ServiceAccept is received [Oliver Smith] testenv: subprocess.run with explicit check=False [Oliver Smith] smdpp/generate_all_test_certificates: use f-string [Oliver Smith] testenv: remove *args from various functions [Oliver Smith] testenv: various small syntax tweaks ------------------------------------------ [...truncated 62.84 KiB...] Get:13
https://downloads.osmocom.org/packages/osmocom:/nightly:/asan/Debian_13
./ libosmousb0 1.14.1.20.6ba7f.202608192029~asan [68.7 kB] Get:14
https://downloads.osmocom.org/packages/osmocom:/nightly:/asan/Debian_13
./ libosmocore 1.14.1.20.6ba7f.202608192029~asan [47.3 kB] Get:15
https://downloads.osmocom.org/packages/osmocom:/nightly:/asan/Debian_13
./ libosmocore-dev 1.14.1.20.6ba7f.202608192029~asan [2752 kB] Get:16
https://downloads.osmocom.org/packages/osmocom:/nightly:/asan/Debian_13
./ libosmonetif11 1.7.0.17.96f9.202608192029~asan [270 kB] Get:17
https://downloads.osmocom.org/packages/osmocom:/nightly:/asan/Debian_13
./ libosmo-netif-dev 1.7.0.17.96f9.202608192029~asan [288 kB] Get:18
https://downloads.osmocom.org/packages/osmocom:/nightly:/asan/Debian_13
./ libosmocore-dbg 1.14.1.20.6ba7f.202608192029~asan [3676 kB] Fetched 17.5 MB in 0s (49.2 MB/s) Selecting previously unselected package libc6-dbg:amd64. (Reading database ... (Reading database ... 5%(Reading database ... 10%(Reading database ... 15%(Reading database ... 20%(Reading database ... 25%(Reading database ... 30%(Reading database ... 35%(Reading database ... 40%(Reading database ... 45%(Reading database ... 50%(Reading database ... 55%(Reading database ... 60%(Reading database ... 65%(Reading database ... 70%(Reading database ... 75%(Reading database ... 80%(Reading database ... 85%(Reading database ... 90%(Reading database ... 95%(Reading database ... 100%(Reading database ... 44387 files and directories currently installed.) Preparing to unpack .../00-libc6-dbg_2.41-12+deb13u3_amd64.deb ... Unpacking libc6-dbg:amd64 (2.41-12+deb13u3) ... Selecting previously unselected package osmocom-keyring. Preparing to unpack .../01-osmocom-keyring_1.1.1.8.7873.202608192029~asan_amd64.deb ... Unpacking osmocom-keyring (1.1.1.8.7873.202608192029~asan) ... Selecting previously unselected package osmocom-nightly-asan. Preparing to unpack .../02-osmocom-nightly-asan_202608192029_amd64.deb ... Unpacking osmocom-nightly-asan (202608192029) ... Selecting previously unselected package libosmocore22:amd64. Preparing to unpack .../03-libosmocore22_1.14.1.20.6ba7f.202608192029~asan_amd64.deb ... Unpacking libosmocore22:amd64 (1.14.1.20.6ba7f.202608192029~asan) ... Selecting previously unselected package libosmocodec4:amd64. Preparing to unpack .../04-libosmocodec4_1.14.1.20.6ba7f.202608192029~asan_amd64.deb ... Unpacking libosmocodec4:amd64 (1.14.1.20.6ba7f.202608192029~asan) ... Selecting previously unselected package libosmoisdn0:amd64. Preparing to unpack .../05-libosmoisdn0_1.14.1.20.6ba7f.202608192029~asan_amd64.deb ... Unpacking libosmoisdn0:amd64 (1.14.1.20.6ba7f.202608192029~asan) ... Selecting previously unselected package libosmogsm20:amd64. Preparing to unpack .../06-libosmogsm20_1.14.1.20.6ba7f.202608192029~asan_amd64.deb ... Unpacking libosmogsm20:amd64 (1.14.1.20.6ba7f.202608192029~asan) ... Selecting previously unselected package libosmocoding0:amd64. Preparing to unpack .../07-libosmocoding0_1.14.1.20.6ba7f.202608192029~asan_amd64.deb ... Unpacking libosmocoding0:amd64 (1.14.1.20.6ba7f.202608192029~asan) ... Selecting previously unselected package libosmovty13:amd64. Preparing to unpack .../08-libosmovty13_1.14.1.20.6ba7f.202608192029~asan_amd64.deb ... Unpacking libosmovty13:amd64 (1.14.1.20.6ba7f.202608192029~asan) ... Selecting previously unselected package libosmogb14:amd64. Preparing to unpack .../09-libosmogb14_1.14.1.20.6ba7f.202608192029~asan_amd64.deb ... Unpacking libosmogb14:amd64 (1.14.1.20.6ba7f.202608192029~asan) ... Selecting previously unselected package libosmoctrl0:amd64. Preparing to unpack .../10-libosmoctrl0_1.14.1.20.6ba7f.202608192029~asan_amd64.deb ... Unpacking libosmoctrl0:amd64 (1.14.1.20.6ba7f.202608192029~asan) ... Selecting previously unselected package libosmosim2:amd64. Preparing to unpack .../11-libosmosim2_1.14.1.20.6ba7f.202608192029~asan_amd64.deb ... Unpacking libosmosim2:amd64 (1.14.1.20.6ba7f.202608192029~asan) ... Selecting previously unselected package libosmousb0:amd64. Preparing to unpack .../12-libosmousb0_1.14.1.20.6ba7f.202608192029~asan_amd64.deb ... Unpacking libosmousb0:amd64 (1.14.1.20.6ba7f.202608192029~asan) ... Selecting previously unselected package libosmocore. Preparing to unpack .../13-libosmocore_1.14.1.20.6ba7f.202608192029~asan_amd64.deb ... Unpacking libosmocore (1.14.1.20.6ba7f.202608192029~asan) ... Selecting previously unselected package libosmocore-dev:amd64. Preparing to unpack .../14-libosmocore-dev_1.14.1.20.6ba7f.202608192029~asan_amd64.deb ... Unpacking libosmocore-dev:amd64 (1.14.1.20.6ba7f.202608192029~asan) ... Selecting previously unselected package libosmonetif11:amd64. Preparing to unpack .../15-libosmonetif11_1.7.0.17.96f9.202608192029~asan_amd64.deb ... Unpacking libosmonetif11:amd64 (1.7.0.17.96f9.202608192029~asan) ... Selecting previously unselected package libosmo-netif-dev:amd64. Preparing to unpack .../16-libosmo-netif-dev_1.7.0.17.96f9.202608192029~asan_amd64.deb ... Unpacking libosmo-netif-dev:amd64 (1.7.0.17.96f9.202608192029~asan) ... Selecting previously unselected package libosmocore-dbg:amd64. Preparing to unpack .../17-libosmocore-dbg_1.14.1.20.6ba7f.202608192029~asan_amd64.deb ... Unpacking libosmocore-dbg:amd64 (1.14.1.20.6ba7f.202608192029~asan) ... Setting up libc6-dbg:amd64 (2.41-12+deb13u3) ... Setting up osmocom-keyring (1.1.1.8.7873.202608192029~asan) ... Setting up osmocom-nightly-asan (202608192029) ... Setting up libosmocore22:amd64 (1.14.1.20.6ba7f.202608192029~asan) ... Setting up libosmocodec4:amd64 (1.14.1.20.6ba7f.202608192029~asan) ... Setting up libosmovty13:amd64 (1.14.1.20.6ba7f.202608192029~asan) ... Setting up libosmoisdn0:amd64 (1.14.1.20.6ba7f.202608192029~asan) ... Setting up libosmousb0:amd64 (1.14.1.20.6ba7f.202608192029~asan) ... Setting up libosmogsm20:amd64 (1.14.1.20.6ba7f.202608192029~asan) ... Setting up libosmoctrl0:amd64 (1.14.1.20.6ba7f.202608192029~asan) ... Setting up libosmogb14:amd64 (1.14.1.20.6ba7f.202608192029~asan) ... Setting up libosmonetif11:amd64 (1.7.0.17.96f9.202608192029~asan) ... Setting up libosmocoding0:amd64 (1.14.1.20.6ba7f.202608192029~asan) ... Setting up libosmosim2:amd64 (1.14.1.20.6ba7f.202608192029~asan) ... Setting up libosmocore (1.14.1.20.6ba7f.202608192029~asan) ... Setting up libosmocore-dbg:amd64 (1.14.1.20.6ba7f.202608192029~asan) ... Setting up libosmocore-dev:amd64 (1.14.1.20.6ba7f.202608192029~asan) ... Setting up libosmo-netif-dev:amd64 (1.7.0.17.96f9.202608192029~asan) ... Processing triggers for libc-bin (2.41-12+deb13u3) ... [1;34m[testenv] libosmo-sigtran: cloning master[0m [0;94m[testenv] + ['git', '-c', 'advice.detachedHead=false', '-C', '<
https://jenkins.osmocom.org/jenkins/job/ttcn3-sccp-test-asan/ws/_cache/git/…
',> 'clone', '--depth', '1', '--branch', 'master', '
https://gerrit.osmocom.org/libosmo-sigtran
'][0m Cloning into 'libosmo-sigtran'... [1;34m[testenv] libosmo-sigtran: showing current commit[0m [0;94m[testenv] + ['git', '-P', '-C', '<
https://jenkins.osmocom.org/jenkins/job/ttcn3-sccp-test-asan/ws/_cache/git/…
',> '-c', 'color.ui=always', 'log', '-1', '--oneline'][0m [33m121209d[m Bump version: 2.2.1.133-20bc-dirty → 2.3.0 [1;34m[testenv] Building sccp_demo_user[0m [0;94m[testenv] + ['podman', 'exec', '-e', 'CCACHE_DIR=/home/osmocom-build/ccache/testenv', '-e', 'TESTENV_CACHE_DIR=<
https://jenkins.osmocom.org/jenkins/job/ttcn3-sccp-test-asan/ws/_cache
',> '-e', 'TESTENV_SRC_DIR=/home/osmocom-build/jenkins/workspace', '-e', 'TESTENV_INSTALL_DIR=/', '-e', 'TERM=dumb', '-e', 'PATH=<
https://jenkins.osmocom.org/jenkins/job/ttcn3-sccp-test-asan/ws/_testenv/da…
>:<
https://jenkins.osmocom.org/jenkins/job/ttcn3-sccp-test-asan/ws/_testenv/da…
>:<
https://jenkins.osmocom.org/jenkins/job/ttcn3-sccp-test-asan/ws/sccp
>:/usr/local/bin:/usr/sbin:/usr/bin:/sbin:/bin', '-e', 'HOME=/home/osmocom-build', '-e', 'PYTHONUNBUFFERED=1', '-t', '-w', '<
https://jenkins.osmocom.org/jenkins/job/ttcn3-sccp-test-asan/ws/_cache/git/…
',> 'testenv-sccp-osmocom-nightly-asan-20260820-1741-8b2146fc-1', 'autoreconf', '-fi'][0m libtoolize: putting auxiliary files in AC_CONFIG_AUX_DIR, '.'. libtoolize: copying file './ltmain.sh' libtoolize: Consider adding 'AC_CONFIG_MACRO_DIRS([m4])' to configure.ac, libtoolize: and rerunning libtoolize and aclocal. libtoolize: Consider adding '-I m4' to ACLOCAL_AMFLAGS in Makefile.am. configure.ac:45: warning: The macro 'AC_CONFIG_HEADER' is obsolete. configure.ac:45: You should run autoupdate. ./lib/autoconf/status.m4:719: AC_CONFIG_HEADER is expanded from... configure.ac:45: the top level configure.ac:182: warning: The macro 'AC_HELP_STRING' is obsolete. configure.ac:182: You should run autoupdate. ./lib/autoconf/general.m4:204: AC_HELP_STRING is expanded from... configure.ac:182: the top level configure.ac:199: warning: AC_OUTPUT should be used without arguments. configure.ac:199: You should run autoupdate. configure.ac:23: installing './compile' configure.ac:25: installing './config.guess' configure.ac:25: installing './config.sub' configure.ac:9: installing './install-sh' configure.ac:9: installing './missing' examples/Makefile.am: installing './depcomp' include/osmocom/sigtran/Makefile.am:2: warning: dir $@: non-POSIX variable name include/osmocom/sigtran/Makefile.am:2: (probably a GNU make extension) [0;94m[testenv] + ['podman', 'exec', '-e', 'CCACHE_DIR=/home/osmocom-build/ccache/testenv', '-e', 'TESTENV_CACHE_DIR=<
https://jenkins.osmocom.org/jenkins/job/ttcn3-sccp-test-asan/ws/_cache
',> '-e', 'TESTENV_SRC_DIR=/home/osmocom-build/jenkins/workspace', '-e', 'TESTENV_INSTALL_DIR=/', '-e', 'TERM=dumb', '-e', 'PATH=<
https://jenkins.osmocom.org/jenkins/job/ttcn3-sccp-test-asan/ws/_testenv/da…
>:<
https://jenkins.osmocom.org/jenkins/job/ttcn3-sccp-test-asan/ws/_testenv/da…
>:<
https://jenkins.osmocom.org/jenkins/job/ttcn3-sccp-test-asan/ws/sccp
>:/usr/local/bin:/usr/sbin:/usr/bin:/sbin:/bin', '-e', 'HOME=/home/osmocom-build', '-e', 'PYTHONUNBUFFERED=1', '-t', '-w', '<
https://jenkins.osmocom.org/jenkins/job/ttcn3-sccp-test-asan/ws/_cache/git/…
',> 'testenv-sccp-osmocom-nightly-asan-20260820-1741-8b2146fc-1', './configure', '--enable-sanitize'][0m checking for a BSD-compatible install... /usr/bin/install -c checking whether sleep supports fractional seconds... yes checking filesystem timestamp resolution... 0.01 checking whether build environment is sane... yes checking for a race-free mkdir -p... /usr/bin/mkdir -p checking for gawk... no checking for mawk... mawk checking whether make sets $(MAKE)... yes checking whether make supports nested variables... yes checking xargs -n works... yes checking whether make sets $(MAKE)... (cached) yes checking for gcc... gcc checking whether the C compiler works... yes checking for C compiler default output file name... a.out checking for suffix of executables... checking whether we are cross compiling... no checking for suffix of object files... o checking whether the compiler supports GNU C... yes checking whether gcc accepts -g... yes checking for gcc option to enable C11 features... none needed checking whether gcc understands -c and -o together... yes checking whether make supports the include directive... yes (GNU style) checking dependency style of gcc... gcc3 checking build system type... x86_64-pc-linux-gnu checking host system type... x86_64-pc-linux-gnu checking how to print strings... printf checking for a sed that does not truncate output... /usr/bin/sed checking for grep that handles long lines and -e... /usr/bin/grep checking for egrep... /usr/bin/grep -E checking for fgrep... /usr/bin/grep -F checking for ld used by gcc... /usr/bin/ld checking if the linker (/usr/bin/ld) is GNU ld... yes checking for BSD- or MS-compatible name lister (nm)... /usr/bin/nm -B checking the name lister (/usr/bin/nm -B) interface... BSD nm checking whether ln -s works... yes checking the maximum length of command line arguments... 1572864 checking how to convert x86_64-pc-linux-gnu file names to x86_64-pc-linux-gnu format... func_convert_file_noop checking how to convert x86_64-pc-linux-gnu file names to toolchain format... func_convert_file_noop checking for /usr/bin/ld option to reload object files... -r checking for file... file checking for objdump... objdump checking how to recognize dependent libraries... pass_all checking for dlltool... no checking how to associate runtime and link libraries... printf %s\n checking for ranlib... ranlib checking for ar... ar checking for archiver @FILE support... @ checking for strip... strip checking command to parse /usr/bin/nm -B output from gcc object... ok checking for sysroot... no checking for a working dd... /usr/bin/dd checking how to truncate binary pipes... /usr/bin/dd bs=4096 count=1 checking for mt... mt checking if mt is a manifest tool... no checking for stdio.h... yes checking for stdlib.h... yes checking for string.h... yes checking for inttypes.h... yes checking for stdint.h... yes checking for strings.h... yes checking for sys/stat.h... yes checking for sys/types.h... yes checking for unistd.h... yes checking for dlfcn.h... yes checking for objdir... .libs checking if gcc supports -fno-rtti -fno-exceptions... no checking for gcc option to produce PIC... -fPIC -DPIC checking if gcc PIC flag -fPIC -DPIC works... yes checking if gcc static flag -static works... yes checking if gcc supports -c -o file.o... yes checking if gcc supports -c -o file.o... (cached) yes checking whether the gcc linker (/usr/bin/ld -m elf_x86_64) supports shared libraries... yes checking whether -lc should be explicitly linked in... no checking dynamic linker characteristics... GNU/Linux ld.so checking how to hardcode library paths into programs... immediate checking whether stripping libraries is possible... yes checking if libtool supports shared libraries... yes checking whether to build shared libraries... yes checking whether to build static libraries... yes checking for pkg-config... /usr/bin/pkg-config checking for pkg-config... /usr/bin/pkg-config checking pkg-config is at least version 0.20... yes checking for libosmocore >= 1.14.2... no configure: error: Package requirements (libosmocore >= 1.14.2) were not met: Package dependency requirement 'libosmocore >= 1.14.2' could not be satisfied. Package 'libosmocore' has version '1.14.1.20-6ba7f.202608192029~asan', required version is '>= 1.14.2' Consider adjusting the PKG_CONFIG_PATH environment variable if you installed software in a non-standard prefix. Alternatively, you may set the environment variables LIBOSMOCORE_CFLAGS and LIBOSMOCORE_LIBS to avoid the need to call pkg-config. See the pkg-config man page for more details. [1;91m[testenv] Command failed unexpectedly[0m [0;94m[testenv] Command: ['podman', 'exec', '-e', 'CCACHE_DIR=/home/osmocom-build/ccache/testenv', '-e', 'TESTENV_CACHE_DIR=<
https://jenkins.osmocom.org/jenkins/job/ttcn3-sccp-test-asan/ws/_cache
',> '-e', 'TESTENV_SRC_DIR=/home/osmocom-build/jenkins/workspace', '-e', 'TESTENV_INSTALL_DIR=/', '-e', 'TERM=dumb', '-e', 'PATH=<
https://jenkins.osmocom.org/jenkins/job/ttcn3-sccp-test-asan/ws/_testenv/da…
>:<
https://jenkins.osmocom.org/jenkins/job/ttcn3-sccp-test-asan/ws/_testenv/da…
>:<
https://jenkins.osmocom.org/jenkins/job/ttcn3-sccp-test-asan/ws/sccp
>:/usr/local/bin:/usr/sbin:/usr/bin:/sbin:/bin', '-e', 'HOME=/home/osmocom-build', '-e', 'PYTHONUNBUFFERED=1', '-t', '-w', '<
https://jenkins.osmocom.org/jenkins/job/ttcn3-sccp-test-asan/ws/_cache/git/…
',> 'testenv-sccp-osmocom-nightly-asan-20260820-1741-8b2146fc-1', './configure', '--enable-sanitize'][0m [0;94m[testenv] Returncode: 1[0m [1;34m[testenv] Stopping podman container[0m [0;94m[testenv] + ['podman', 'kill', 'testenv-sccp-osmocom-nightly-asan-20260820-1741-8b2146fc-1'][0m testenv-sccp-osmocom-nightly-asan-20260820-1741-8b2146fc-1 Traceback (most recent call last): File "<
https://jenkins.osmocom.org/jenkins/job/ttcn3-sccp-test-asan/ws/./testenv.py
",> line 135, in <module> main() File "<
https://jenkins.osmocom.org/jenkins/job/ttcn3-sccp-test-asan/ws/./testenv.py
",> line 124, in main run() File "<
https://jenkins.osmocom.org/jenkins/job/ttcn3-sccp-test-asan/ws/./testenv.py
",> line 73, in run testenv.podman_install.packages(cfg, cfg_name) File "<
https://jenkins.osmocom.org/jenkins/job/ttcn3-sccp-test-asan/ws/_testenv/te…
",> line 231, in packages from_source(cfg, cfg_name, section) File "<
https://jenkins.osmocom.org/jenkins/job/ttcn3-sccp-test-asan/ws/_testenv/te…
",> line 208, in from_source return from_source_sccp_demo_user() ^^^^^^^^^^^^^^^^^^^^^^^^^^^^ File "<
https://jenkins.osmocom.org/jenkins/job/ttcn3-sccp-test-asan/ws/_testenv/te…
",> line 170, in from_source_sccp_demo_user testenv.cmd.run(configure_cmd, cwd=sccp_dir) File "<
https://jenkins.osmocom.org/jenkins/job/ttcn3-sccp-test-asan/ws/_testenv/te…
",> line 127, in run return testenv.podman.exec_cmd(cmd, check=check, env=env, **kwargs) ^^^^^^^^^^^^^^^^^^^^^^^^^^^^^^^^^^^^^^^^^^^^^^^^^^^^^^^^^^^^ File "<
https://jenkins.osmocom.org/jenkins/job/ttcn3-sccp-test-asan/ws/_testenv/te…
",> line 156, in exec_cmd return testenv.cmd.run( ^^^^^^^^^^^^^^^^ File "<
https://jenkins.osmocom.org/jenkins/job/ttcn3-sccp-test-asan/ws/_testenv/te…
",> line 144, in run exit_error_cmd(p, "Command failed unexpectedly") File "<
https://jenkins.osmocom.org/jenkins/job/ttcn3-sccp-test-asan/ws/_testenv/te…
",> line 88, in exit_error_cmd raise RuntimeError("shell command related error, find details right above this python trace") RuntimeError: shell command related error, find details right above this python trace [0;94m[testenv] feed_watchdog_loop: podman container has stopped[0m [1;34m[testenv] Logs saved to:
https://jenkins.osmocom.org/jenkins/job/ttcn3-sccp-test-asan/805/artifact/l…
[0m + RC=1 + [ 1 = 0 ] + + uptime grep --color=always -o load.* [01;31m[Kload average: 0.61, 0.60, 1.01[m[K + exit 1 Build step 'Execute shell' marked build as failure Recording test results ERROR: Step ‘Publish JUnit test result report’ failed: No test report files were found. Configuration error?
1
1
0
0
Build failed in Jenkins: ttcn3-msc-test-asan #807
by jenkins@lists.osmocom.org
21 Aug '26
21 Aug '26
See <
https://jenkins.osmocom.org/jenkins/job/ttcn3-msc-test-asan/807/display/red…
> Changes: [Pau Espin Pedrol] pgw: Move generic helper find_teid to library/ [Pau Espin Pedrol] hnbgw: Send correct recovery timestamp in PFCP Assoc Setup Resp [Pau Espin Pedrol] hnbgw: Move generic PFCP ConnHdlr helpers to library/PFCP_Emulation.ttcn ------------------------------------------ [...truncated 210.92 KiB...] CCLD MAP_SS_Code_part_7.so CCLD MAP_SS_DataTypes_part_1.so CCLD MAP_SS_DataTypes_part_2.so CCLD MAP_SS_DataTypes_part_3.so CCLD MAP_SS_DataTypes_part_4.so CCLD MAP_SS_DataTypes_part_5.so CCLD MAP_SS_DataTypes_part_6.so CCLD MAP_SS_DataTypes_part_7.so CCLD MAP_ShortMessageServiceOperations_part_1.so CCLD MAP_ShortMessageServiceOperations_part_2.so CCLD MAP_ShortMessageServiceOperations_part_3.so CCLD MAP_ShortMessageServiceOperations_part_4.so CCLD MAP_ShortMessageServiceOperations_part_5.so CCLD MAP_ShortMessageServiceOperations_part_6.so CCLD MAP_ShortMessageServiceOperations_part_7.so CCLD MAP_SupplementaryServiceOperations_part_1.so CCLD MAP_SupplementaryServiceOperations_part_2.so CCLD MAP_SupplementaryServiceOperations_part_3.so CCLD MAP_SupplementaryServiceOperations_part_4.so CCLD MAP_SupplementaryServiceOperations_part_5.so CCLD MAP_SupplementaryServiceOperations_part_6.so CCLD MAP_SupplementaryServiceOperations_part_7.so CCLD MAP_TS_Code_part_1.so CCLD MAP_TS_Code_part_2.so CCLD MAP_TS_Code_part_3.so CCLD MAP_TS_Code_part_4.so CCLD MAP_TS_Code_part_5.so CCLD MAP_TS_Code_part_6.so CCLD MAP_TS_Code_part_7.so CCLD MobileDomainDefinitions_part_1.so CCLD MobileDomainDefinitions_part_2.so CCLD MobileDomainDefinitions_part_3.so CCLD MobileDomainDefinitions_part_4.so CCLD MobileDomainDefinitions_part_5.so CCLD MobileDomainDefinitions_part_6.so CCLD MobileDomainDefinitions_part_7.so CCLD RANAP_CommonDataTypes_part_1.so CCLD RANAP_CommonDataTypes_part_2.so CCLD RANAP_CommonDataTypes_part_3.so CCLD RANAP_CommonDataTypes_part_4.so CCLD RANAP_CommonDataTypes_part_5.so CCLD RANAP_CommonDataTypes_part_6.so CCLD RANAP_CommonDataTypes_part_7.so CCLD RANAP_Constants_part_1.so CCLD RANAP_Constants_part_2.so CCLD RANAP_Constants_part_3.so CCLD RANAP_Constants_part_4.so CCLD RANAP_Constants_part_5.so CCLD RANAP_Constants_part_6.so CCLD RANAP_Constants_part_7.so CCLD RANAP_Containers_part_1.so CCLD RANAP_Containers_part_2.so CCLD RANAP_Containers_part_3.so CCLD RANAP_Containers_part_4.so CCLD RANAP_Containers_part_5.so CCLD RANAP_Containers_part_6.so CCLD RANAP_Containers_part_7.so CCLD RANAP_IEs_part_1.so CCLD RANAP_IEs_part_2.so CCLD RANAP_IEs_part_3.so CCLD RANAP_IEs_part_4.so CCLD RANAP_IEs_part_5.so CCLD RANAP_IEs_part_6.so CCLD RANAP_IEs_part_7.so CCLD RANAP_PDU_Contents_part_1.so CCLD RANAP_PDU_Contents_part_2.so CCLD RANAP_PDU_Contents_part_3.so CCLD RANAP_PDU_Contents_part_4.so CCLD RANAP_PDU_Contents_part_5.so CCLD RANAP_PDU_Contents_part_6.so CCLD RANAP_PDU_Contents_part_7.so CCLD RANAP_PDU_Descriptions_part_1.so CCLD RANAP_PDU_Descriptions_part_2.so CCLD RANAP_PDU_Descriptions_part_3.so CCLD RANAP_PDU_Descriptions_part_4.so CCLD RANAP_PDU_Descriptions_part_5.so CCLD RANAP_PDU_Descriptions_part_6.so CCLD RANAP_PDU_Descriptions_part_7.so CCLD Remote_Operations_Generic_ROS_PDUs_part_1.so CCLD Remote_Operations_Generic_ROS_PDUs_part_2.so CCLD Remote_Operations_Generic_ROS_PDUs_part_3.so CCLD Remote_Operations_Generic_ROS_PDUs_part_4.so CCLD Remote_Operations_Generic_ROS_PDUs_part_5.so CCLD Remote_Operations_Generic_ROS_PDUs_part_6.so CCLD Remote_Operations_Generic_ROS_PDUs_part_7.so CCLD Remote_Operations_Information_Objects_part_1.so CCLD Remote_Operations_Information_Objects_part_2.so CCLD Remote_Operations_Information_Objects_part_3.so CCLD Remote_Operations_Information_Objects_part_4.so CCLD Remote_Operations_Information_Objects_part_5.so CCLD Remote_Operations_Information_Objects_part_6.so CCLD Remote_Operations_Information_Objects_part_7.so CCLD SS_DataTypes_part_1.so CCLD SS_DataTypes_part_2.so CCLD SS_DataTypes_part_3.so CCLD SS_DataTypes_part_4.so CCLD SS_DataTypes_part_5.so CCLD SS_DataTypes_part_6.so CCLD SS_DataTypes_part_7.so CCLD SS_Errors_part_1.so CCLD SS_Errors_part_2.so CCLD SS_Errors_part_3.so CCLD SS_Errors_part_4.so CCLD SS_Errors_part_5.so CCLD SS_Errors_part_6.so CCLD SS_Errors_part_7.so CCLD SS_Operations_part_1.so CCLD SS_Operations_part_2.so CCLD SS_Operations_part_3.so CCLD SS_Operations_part_4.so CCLD SS_Operations_part_5.so CCLD SS_Operations_part_6.so CCLD SS_Operations_part_7.so CCLD SS_PDU_Defs_part_1.so CCLD SS_PDU_Defs_part_2.so CCLD SS_PDU_Defs_part_3.so CCLD SS_PDU_Defs_part_4.so CCLD SS_PDU_Defs_part_5.so CCLD SS_PDU_Defs_part_6.so CCLD SS_PDU_Defs_part_7.so CCLD SS_Protocol_part_1.so CCLD SS_Protocol_part_2.so CCLD SS_Protocol_part_3.so CCLD SS_Protocol_part_4.so CCLD SS_Protocol_part_5.so CCLD SS_Protocol_part_6.so CCLD SS_Protocol_part_7.so CCLD SDP_parse_.tab.so CCLD lex.SDP_parse_.so CCLD IPA_CodecPort_CtrlFunctDef.so CCLD IPL4asp_PT.so CCLD IPL4asp_discovery.so CCLD MAP_EncDec.so CCLD MGCP_CodecPort_CtrlFunctDef.so CCLD MNCC_EncDec.so CCLD Native_FunctionDefs.so CCLD RANAP_EncDec.so CCLD RTP_CodecPort_CtrlFunctDef.so CCLD RTP_EncDec.so CCLD SCCP_EncDec.so CCLD SCTPasp_PT.so CCLD SDP_EncDec.so CCLD SGsAP_CodecPort_CtrlFunctDef.so CCLD SMPP_CodecPort_CtrlFunctDef.so CCLD SMPP_EncDec.so CCLD StatsD_CodecPort_CtrlFunctdef.so CCLD SS_EncDec.so CCLD TCCConversion.so CCLD TCCEncoding.so CCLD TCCInterface.so CCLD TCCOpenSecurity.so CCLD TELNETasp_PT.so CCLD UD_PT.so CCLD MSC_Tests make[1]: Leaving directory '<
https://jenkins.osmocom.org/jenkins/job/ttcn3-msc-test-asan/ws/_cache/podma…
'> [1;34m[testenv] Stopping podman container (restart)[0m [0;94m[testenv] + ['podman', 'kill', 'testenv-msc-osmocom-nightly-asan-20260821-1704-3930392b-0'][0m testenv-msc-osmocom-nightly-asan-20260821-1704-3930392b-0 [0;94m[testenv] + ['podman', 'run', '--rm', '--name', 'testenv-msc-osmocom-nightly-asan-20260821-1704-3930392b-1', '--log-driver', 'json-file', '--log-opt', 'path=<
https://jenkins.osmocom.org/jenkins/job/ttcn3-msc-test-asan/807/artifact/lo…
',> '--security-opt=seccomp=<
https://jenkins.osmocom.org/jenkins/job/ttcn3-msc-test-asan/ws/_testenv/dat…
',> '--cap-add=NET_ADMIN', '--cap-add=NET_RAW', '--cap-add=SYS_ADMIN', '--device=/dev/net/tun', '--volume', '<
https://jenkins.osmocom.org/jenkins/job/ttcn3-msc-test-asan/ws/_cache/podma…
>:/var/cache/apt', '--volume', '<
https://jenkins.osmocom.org/jenkins/job/ttcn3-msc-test-asan/ws/_cache/podma…
>:/var/lib/apt', '--sysctl', 'net.ipv4.conf.all.send_redirects=0', '--sysctl', 'net.ipv4.conf.default.send_redirects=0', '-e', 'PODMAN=1', '-e', 'HOST_USER=osmocom-build', '-e', 'TESTENV_BINARY_REPO=1', '--volume', '<
https://jenkins.osmocom.org/jenkins/job/ttcn3-msc-test-asan/ws/logs
>:<
https://jenkins.osmocom.org/jenkins/job/ttcn3-msc-test-asan/ws/logs
',> '--volume', '<
https://jenkins.osmocom.org/jenkins/job/ttcn3-msc-test-asan/ws/_cache
>:<
https://jenkins.osmocom.org/jenkins/job/ttcn3-msc-test-asan/ws/_cache
',> '--volume', '/home/osmocom-build/ccache/testenv:/home/osmocom-build/ccache/testenv', '--volume', '/home/osmocom-build/jenkins/workspace:/home/osmocom-build/jenkins/workspace', 'debian-trixie-osmo-ttcn3-testenv', '<
https://jenkins.osmocom.org/jenkins/job/ttcn3-msc-test-asan/ws/_testenv/dat…
'][0m> [0;94m[testenv] + ['podman', 'exec', '-e', 'CCACHE_DIR=/home/osmocom-build/ccache/testenv', '-e', 'TESTENV_CACHE_DIR=<
https://jenkins.osmocom.org/jenkins/job/ttcn3-msc-test-asan/ws/_cache
',> '-e', 'TESTENV_SRC_DIR=/home/osmocom-build/jenkins/workspace', '-e', 'TESTENV_INSTALL_DIR=/', '-e', 'TERM=dumb', '-e', 'PATH=<
https://jenkins.osmocom.org/jenkins/job/ttcn3-msc-test-asan/ws/_testenv/dat…
>:<
https://jenkins.osmocom.org/jenkins/job/ttcn3-msc-test-asan/ws/_testenv/dat…
>:<
https://jenkins.osmocom.org/jenkins/job/ttcn3-msc-test-asan/ws/msc
>:/usr/local/bin:/usr/sbin:/usr/bin:/sbin:/bin', '-e', 'HOME=/home/osmocom-build', '-e', 'PYTHONUNBUFFERED=1', '-t', 'testenv-msc-osmocom-nightly-asan-20260821-1704-3930392b-1', 'rm', '/etc/apt/apt.conf.d/docker-clean'][0m Running testenv-podman-main.sh [0;94m[testenv] + ['podman', 'exec', '-e', 'CCACHE_DIR=/home/osmocom-build/ccache/testenv', '-e', 'TESTENV_CACHE_DIR=<
https://jenkins.osmocom.org/jenkins/job/ttcn3-msc-test-asan/ws/_cache
',> '-e', 'TESTENV_SRC_DIR=/home/osmocom-build/jenkins/workspace', '-e', 'TESTENV_INSTALL_DIR=/', '-e', 'TERM=dumb', '-e', 'PATH=<
https://jenkins.osmocom.org/jenkins/job/ttcn3-msc-test-asan/ws/_testenv/dat…
>:<
https://jenkins.osmocom.org/jenkins/job/ttcn3-msc-test-asan/ws/_testenv/dat…
>:<
https://jenkins.osmocom.org/jenkins/job/ttcn3-msc-test-asan/ws/msc
>:/usr/local/bin:/usr/sbin:/usr/bin:/sbin:/bin', '-e', 'HOME=/home/osmocom-build', '-e', 'PYTHONUNBUFFERED=1', '-t', 'testenv-msc-osmocom-nightly-asan-20260821-1704-3930392b-1', 'sh', '-c', "echo 'deb [signed-by=/obs.key]
https://downloads.osmocom.org/packages/osmocom:/nightly:/asan/Debian_13/
./' > /etc/apt/sources.list.d/osmocom.list"][0m [0;94m[testenv] + ['podman', 'exec', '-e', 'CCACHE_DIR=/home/osmocom-build/ccache/testenv', '-e', 'TESTENV_CACHE_DIR=<
https://jenkins.osmocom.org/jenkins/job/ttcn3-msc-test-asan/ws/_cache
',> '-e', 'TESTENV_SRC_DIR=/home/osmocom-build/jenkins/workspace', '-e', 'TESTENV_INSTALL_DIR=/', '-e', 'TERM=dumb', '-e', 'PATH=<
https://jenkins.osmocom.org/jenkins/job/ttcn3-msc-test-asan/ws/_testenv/dat…
>:<
https://jenkins.osmocom.org/jenkins/job/ttcn3-msc-test-asan/ws/_testenv/dat…
>:<
https://jenkins.osmocom.org/jenkins/job/ttcn3-msc-test-asan/ws/msc
>:/usr/local/bin:/usr/sbin:/usr/bin:/sbin:/bin', '-e', 'HOME=/home/osmocom-build', '-e', 'PYTHONUNBUFFERED=1', '-t', 'testenv-msc-osmocom-nightly-asan-20260821-1704-3930392b-1', 'sh', '-c', 'echo \'Package: *\nPin: origin "
downloads.osmocom.org
"\nPin-Priority: 1100\n\' > /etc/apt/preferences.d/osmocom-apt-pin'][0m [0;94m[testenv] + ['podman', 'exec', '-e', 'CCACHE_DIR=/home/osmocom-build/ccache/testenv', '-e', 'TESTENV_CACHE_DIR=<
https://jenkins.osmocom.org/jenkins/job/ttcn3-msc-test-asan/ws/_cache
',> '-e', 'TESTENV_SRC_DIR=/home/osmocom-build/jenkins/workspace', '-e', 'TESTENV_INSTALL_DIR=/', '-e', 'TERM=dumb', '-e', 'PATH=<
https://jenkins.osmocom.org/jenkins/job/ttcn3-msc-test-asan/ws/_testenv/dat…
>:<
https://jenkins.osmocom.org/jenkins/job/ttcn3-msc-test-asan/ws/_testenv/dat…
>:<
https://jenkins.osmocom.org/jenkins/job/ttcn3-msc-test-asan/ws/msc
>:/usr/local/bin:/usr/sbin:/usr/bin:/sbin:/bin', '-e', 'HOME=/home/osmocom-build', '-e', 'PYTHONUNBUFFERED=1', '-t', 'testenv-msc-osmocom-nightly-asan-20260821-1704-3930392b-1', 'apt-get', '-q', 'update'][0m Hit:1
http://deb.debian.org/debian
trixie InRelease Hit:2
http://deb.debian.org/debian
trixie-updates InRelease Hit:3
http://deb.debian.org/debian-security
trixie-security InRelease Get:4
https://downloads.osmocom.org/packages/osmocom:/nightly:/asan/Debian_13
./ InRelease [1611 B] Get:5
https://downloads.osmocom.org/packages/osmocom:/nightly:/asan/Debian_13
./ Packages [55.9 kB] Fetched 57.5 kB in 0s (252 kB/s) Reading package lists...[0;94m[testenv] feed_watchdog_loop: podman container has stopped[0m [0;94m[testenv] + ['podman', 'exec', '-e', 'CCACHE_DIR=/home/osmocom-build/ccache/testenv', '-e', 'TESTENV_CACHE_DIR=<
https://jenkins.osmocom.org/jenkins/job/ttcn3-msc-test-asan/ws/_cache
',> '-e', 'TESTENV_SRC_DIR=/home/osmocom-build/jenkins/workspace', '-e', 'TESTENV_INSTALL_DIR=/', '-e', 'TERM=dumb', '-e', 'PATH=<
https://jenkins.osmocom.org/jenkins/job/ttcn3-msc-test-asan/ws/_testenv/dat…
>:<
https://jenkins.osmocom.org/jenkins/job/ttcn3-msc-test-asan/ws/_testenv/dat…
>:<
https://jenkins.osmocom.org/jenkins/job/ttcn3-msc-test-asan/ws/msc
>:/usr/local/bin:/usr/sbin:/usr/bin:/sbin:/bin', '-e', 'HOME=/home/osmocom-build', '-e', 'PYTHONUNBUFFERED=1', '-t', 'testenv-msc-osmocom-nightly-asan-20260821-1704-3930392b-1', 'sh', '-c', 'apt-cache pkgnames | grep -- -dbg > <
https://jenkins.osmocom.org/jenkins/job/ttcn3-msc-test-asan/ws/_cache/podma…
'][0m> [0;94m[testenv] + ['podman', 'exec', '-e', 'CCACHE_DIR=/home/osmocom-build/ccache/testenv', '-e', 'TESTENV_CACHE_DIR=<
https://jenkins.osmocom.org/jenkins/job/ttcn3-msc-test-asan/ws/_cache
',> '-e', 'TESTENV_SRC_DIR=/home/osmocom-build/jenkins/workspace', '-e', 'TESTENV_INSTALL_DIR=/', '-e', 'TERM=dumb', '-e', 'PATH=<
https://jenkins.osmocom.org/jenkins/job/ttcn3-msc-test-asan/ws/_testenv/dat…
>:<
https://jenkins.osmocom.org/jenkins/job/ttcn3-msc-test-asan/ws/_testenv/dat…
>:<
https://jenkins.osmocom.org/jenkins/job/ttcn3-msc-test-asan/ws/msc
>:/usr/local/bin:/usr/sbin:/usr/bin:/sbin:/bin', '-e', 'HOME=/home/osmocom-build', '-e', 'PYTHONUNBUFFERED=1', '-t', 'testenv-msc-osmocom-nightly-asan-20260821-1704-3930392b-1', 'apt-rdepends', 'osmo-msc'][0m [0;94m[testenv] osmo-msc -> osmo-msc: installing osmo-msc-dbg[0m [0;94m[testenv] osmo-msc -> libc6: installing libc6-dbg[0m [0;94m[testenv] osmo-msc -> libasn1c1: installing libasn1c-dbg[0m [0;94m[testenv] osmo-msc -> libosmocore22: installing libosmocore-dbg[0m [0;94m[testenv] osmo-msc -> libosmo-mgcp-client14: installing libosmo-mgcp-client14-dbgsym[0m [0;94m[testenv] osmo-msc -> libosmo-ranap7: installing libosmo-ranap-dbg[0m [0;94m[testenv] osmo-msc -> libosmo-sigtran12: installing libosmo-sigtran-dbg[0m [0;94m[testenv] osmo-msc -> libosmo-asn1-tcap1: installing libosmo-asn1-tcap-dbg[0m [0;94m[testenv] + ['podman', 'exec', '-e', 'CCACHE_DIR=/home/osmocom-build/ccache/testenv', '-e', 'TESTENV_CACHE_DIR=<
https://jenkins.osmocom.org/jenkins/job/ttcn3-msc-test-asan/ws/_cache
',> '-e', 'TESTENV_SRC_DIR=/home/osmocom-build/jenkins/workspace', '-e', 'TESTENV_INSTALL_DIR=/', '-e', 'TERM=dumb', '-e', 'PATH=<
https://jenkins.osmocom.org/jenkins/job/ttcn3-msc-test-asan/ws/_testenv/dat…
>:<
https://jenkins.osmocom.org/jenkins/job/ttcn3-msc-test-asan/ws/_testenv/dat…
>:<
https://jenkins.osmocom.org/jenkins/job/ttcn3-msc-test-asan/ws/msc
>:/usr/local/bin:/usr/sbin:/usr/bin:/sbin:/bin', '-e', 'HOME=/home/osmocom-build', '-e', 'PYTHONUNBUFFERED=1', '-t', 'testenv-msc-osmocom-nightly-asan-20260821-1704-3930392b-1', 'apt-rdepends', 'osmo-stp'][0m [0;94m[testenv] osmo-stp -> osmo-stp: installing osmo-stp-dbg[0m [0;94m[testenv] osmo-stp -> libc6: installing libc6-dbg[0m [0;94m[testenv] osmo-stp -> libosmo-sigtran12: installing libosmo-sigtran-dbg[0m [0;94m[testenv] osmo-stp -> libosmo-asn1-tcap1: installing libosmo-asn1-tcap-dbg[0m [0;94m[testenv] osmo-stp -> libosmocore22: installing libosmocore-dbg[0m [1;34m[testenv] Installing packages: osmo-msc, osmo-stp, osmo-msc-dbg, libc6-dbg, libasn1c-dbg, libosmocore-dbg, libosmo-mgcp-client14-dbgsym, libosmo-ranap-dbg, libosmo-sigtran-dbg, libosmo-asn1-tcap-dbg, osmo-stp-dbg[0m [0;94m[testenv] + ['podman', 'exec', '-e', 'CCACHE_DIR=/home/osmocom-build/ccache/testenv', '-e', 'TESTENV_CACHE_DIR=<
https://jenkins.osmocom.org/jenkins/job/ttcn3-msc-test-asan/ws/_cache
',> '-e', 'TESTENV_SRC_DIR=/home/osmocom-build/jenkins/workspace', '-e', 'TESTENV_INSTALL_DIR=/', '-e', 'TERM=dumb', '-e', 'PATH=<
https://jenkins.osmocom.org/jenkins/job/ttcn3-msc-test-asan/ws/_testenv/dat…
>:<
https://jenkins.osmocom.org/jenkins/job/ttcn3-msc-test-asan/ws/_testenv/dat…
>:<
https://jenkins.osmocom.org/jenkins/job/ttcn3-msc-test-asan/ws/msc
>:/usr/local/bin:/usr/sbin:/usr/bin:/sbin:/bin', '-e', 'HOME=/home/osmocom-build', '-e', 'PYTHONUNBUFFERED=1', '-t', 'testenv-msc-osmocom-nightly-asan-20260821-1704-3930392b-1', 'apt-get', '-q', 'install', '-y', '--no-install-recommends', 'osmo-msc', 'osmo-stp', 'osmo-msc-dbg', 'libc6-dbg', 'libasn1c-dbg', 'libosmocore-dbg', 'libosmo-mgcp-client14-dbgsym', 'libosmo-ranap-dbg', 'libosmo-sigtran-dbg', 'libosmo-asn1-tcap-dbg', 'osmo-stp-dbg'][0m Reading package lists... Building dependency tree... Solving dependencies... Some packages could not be installed. This may mean that you have requested an impossible situation or if you are using the unstable distribution that some required packages have not yet been created or been moved out of Incoming. The following information may help to resolve the situation: The following packages have unmet dependencies: libosmo-mgcp-client14 : Depends: osmocom-nightly-asan (= 202608192029) but 202608202029 is to be installed osmo-msc : Depends: osmocom-nightly-asan (= 202608192029) but 202608202029 is to be installed osmo-msc-dbg : Depends: osmocom-nightly-asan (= 202608192029) but 202608202029 is to be installed E: Unable to correct problems, you have held broken packages. E: The following information from --solver 3.0 may provide additional context: Unable to satisfy dependencies. Reached two conflicting decisions: 1. osmo-msc:amd64=1.15.0.10.2326.202608192029~asan is selected for install 2. osmo-msc:amd64=1.15.0.10.2326.202608192029~asan Depends osmocom-nightly-asan (= 202608192029) but none of the choices are installable: [no choices] [1;91m[testenv] Command failed unexpectedly[0m [0;94m[testenv] Command: ['podman', 'exec', '-e', 'CCACHE_DIR=/home/osmocom-build/ccache/testenv', '-e', 'TESTENV_CACHE_DIR=<
https://jenkins.osmocom.org/jenkins/job/ttcn3-msc-test-asan/ws/_cache
',> '-e', 'TESTENV_SRC_DIR=/home/osmocom-build/jenkins/workspace', '-e', 'TESTENV_INSTALL_DIR=/', '-e', 'TERM=dumb', '-e', 'PATH=<
https://jenkins.osmocom.org/jenkins/job/ttcn3-msc-test-asan/ws/_testenv/dat…
>:<
https://jenkins.osmocom.org/jenkins/job/ttcn3-msc-test-asan/ws/_testenv/dat…
>:<
https://jenkins.osmocom.org/jenkins/job/ttcn3-msc-test-asan/ws/msc
>:/usr/local/bin:/usr/sbin:/usr/bin:/sbin:/bin', '-e', 'HOME=/home/osmocom-build', '-e', 'PYTHONUNBUFFERED=1', '-t', 'testenv-msc-osmocom-nightly-asan-20260821-1704-3930392b-1', 'apt-get', '-q', 'install', '-y', '--no-install-recommends', 'osmo-msc', 'osmo-stp', 'osmo-msc-dbg', 'libc6-dbg', 'libasn1c-dbg', 'libosmocore-dbg', 'libosmo-mgcp-client14-dbgsym', 'libosmo-ranap-dbg', 'libosmo-sigtran-dbg', 'libosmo-asn1-tcap-dbg', 'osmo-stp-dbg'][0m [0;94m[testenv] Returncode: 100[0m [1;34m[testenv] Stopping podman container[0m [0;94m[testenv] + ['podman', 'kill', 'testenv-msc-osmocom-nightly-asan-20260821-1704-3930392b-1'][0m testenv-msc-osmocom-nightly-asan-20260821-1704-3930392b-1 Traceback (most recent call last): File "<
https://jenkins.osmocom.org/jenkins/job/ttcn3-msc-test-asan/ws/./testenv.py
",> line 135, in <module> main() File "<
https://jenkins.osmocom.org/jenkins/job/ttcn3-msc-test-asan/ws/./testenv.py
",> line 124, in main run() File "<
https://jenkins.osmocom.org/jenkins/job/ttcn3-msc-test-asan/ws/./testenv.py
",> line 73, in run testenv.podman_install.packages(cfg, cfg_name) File "<
https://jenkins.osmocom.org/jenkins/job/ttcn3-msc-test-asan/ws/_testenv/tes…
",> line 233, in packages apt_install(packages) File "<
https://jenkins.osmocom.org/jenkins/job/ttcn3-msc-test-asan/ws/_testenv/tes…
",> line 99, in apt_install testenv.cmd.run(["apt-get", "-q", "install", "-y", "--no-install-recommends"] + pkgs) File "<
https://jenkins.osmocom.org/jenkins/job/ttcn3-msc-test-asan/ws/_testenv/tes…
",> line 127, in run return testenv.podman.exec_cmd(cmd, check=check, env=env, **kwargs) ^^^^^^^^^^^^^^^^^^^^^^^^^^^^^^^^^^^^^^^^^^^^^^^^^^^^^^^^^^^^ File "<
https://jenkins.osmocom.org/jenkins/job/ttcn3-msc-test-asan/ws/_testenv/tes…
",> line 156, in exec_cmd return testenv.cmd.run( ^^^^^^^^^^^^^^^^ File "<
https://jenkins.osmocom.org/jenkins/job/ttcn3-msc-test-asan/ws/_testenv/tes…
",> line 144, in run exit_error_cmd(p, "Command failed unexpectedly") File "<
https://jenkins.osmocom.org/jenkins/job/ttcn3-msc-test-asan/ws/_testenv/tes…
",> line 88, in exit_error_cmd raise RuntimeError("shell command related error, find details right above this python trace") RuntimeError: shell command related error, find details right above this python trace [0;94m[testenv] feed_watchdog_loop: podman container has stopped[0m [1;34m[testenv] Logs saved to:
https://jenkins.osmocom.org/jenkins/job/ttcn3-msc-test-asan/807/artifact/lo…
[0m + RC=1 + [ 1 = 0 ] + uptime + grep --color=always -o load.* [01;31m[Kload average: 1.09, 0.56, 0.43[m[K + exit 1 Build step 'Execute shell' marked build as failure Recording test results ERROR: Step ‘Publish JUnit test result report’ failed: No test report files were found. Configuration error?
1
0
0
0
Build failed in Jenkins: ttcn3-mgw-test-asan #807
by jenkins@lists.osmocom.org
21 Aug '26
21 Aug '26
See <
https://jenkins.osmocom.org/jenkins/job/ttcn3-mgw-test-asan/807/display/red…
> Changes: [Pau Espin Pedrol] pgw: Move generic helper find_teid to library/ [Pau Espin Pedrol] hnbgw: Send correct recovery timestamp in PFCP Assoc Setup Resp [Pau Espin Pedrol] hnbgw: Move generic PFCP ConnHdlr helpers to library/PFCP_Emulation.ttcn ------------------------------------------ [...truncated 49.56 KiB...] CCLD Osmocom_CTRL_Adapter_part_1.so CCLD Osmocom_CTRL_Adapter_part_2.so CCLD Osmocom_CTRL_Adapter_part_3.so CCLD Osmocom_CTRL_Adapter_part_4.so CCLD Osmocom_CTRL_Adapter_part_5.so CCLD Osmocom_CTRL_Adapter_part_6.so CCLD Osmocom_CTRL_Adapter_part_7.so CCLD Osmocom_CTRL_Functions_part_1.so CCLD Osmocom_CTRL_Functions_part_2.so CCLD Osmocom_CTRL_Functions_part_3.so CCLD Osmocom_CTRL_Functions_part_4.so CCLD Osmocom_CTRL_Functions_part_5.so CCLD Osmocom_CTRL_Functions_part_6.so CCLD Osmocom_CTRL_Functions_part_7.so CCLD Osmocom_CTRL_Types_part_1.so CCLD Osmocom_CTRL_Types_part_2.so CCLD Osmocom_CTRL_Types_part_3.so CCLD Osmocom_CTRL_Types_part_4.so CCLD Osmocom_CTRL_Types_part_5.so CCLD Osmocom_CTRL_Types_part_6.so CCLD Osmocom_CTRL_Types_part_7.so CCLD Osmocom_Types_part_1.so CCLD Osmocom_Types_part_2.so CCLD Osmocom_Types_part_3.so CCLD Osmocom_Types_part_4.so CCLD Osmocom_Types_part_5.so CCLD Osmocom_Types_part_6.so CCLD Osmocom_Types_part_7.so CCLD Osmocom_VTY_Functions_part_1.so CCLD Osmocom_VTY_Functions_part_2.so CCLD Osmocom_VTY_Functions_part_3.so CCLD Osmocom_VTY_Functions_part_4.so CCLD Osmocom_VTY_Functions_part_5.so CCLD Osmocom_VTY_Functions_part_6.so CCLD Osmocom_VTY_Functions_part_7.so CCLD RTP_CodecPort_part_1.so CCLD RTP_CodecPort_part_2.so CCLD RTP_CodecPort_part_3.so CCLD RTP_CodecPort_part_4.so CCLD RTP_CodecPort_part_5.so CCLD RTP_CodecPort_part_6.so CCLD RTP_CodecPort_part_7.so CCLD RTP_CodecPort_CtrlFunct_part_2.so CCLD RTP_CodecPort_CtrlFunct_part_1.so CCLD RTP_CodecPort_CtrlFunct_part_3.so CCLD RTP_CodecPort_CtrlFunct_part_4.so CCLD RTP_CodecPort_CtrlFunct_part_5.so CCLD RTP_CodecPort_CtrlFunct_part_6.so CCLD RTP_CodecPort_CtrlFunct_part_7.so CCLD RTP_Emulation_part_1.so CCLD RTP_Emulation_part_2.so CCLD RTP_Emulation_part_3.so CCLD RTP_Emulation_part_4.so CCLD RTP_Emulation_part_5.so CCLD RTP_Emulation_part_6.so CCLD RTP_Emulation_part_7.so CCLD RTP_Endpoint_part_1.so CCLD RTP_Endpoint_part_2.so CCLD RTP_Endpoint_part_3.so CCLD RTP_Endpoint_part_4.so CCLD RTP_Endpoint_part_5.so CCLD RTP_Endpoint_part_6.so CCLD RTP_Endpoint_part_7.so CCLD RTP_Types_part_1.so CCLD RTP_Types_part_2.so CCLD RTP_Types_part_3.so CCLD RTP_Types_part_4.so CCLD RTP_Types_part_5.so CCLD RTP_Types_part_6.so CCLD RTP_Types_part_7.so CCLD SDP_Templates_part_1.so CCLD SDP_Templates_part_2.so CCLD SDP_Templates_part_3.so CCLD SDP_Templates_part_4.so CCLD SDP_Templates_part_5.so CCLD SDP_Templates_part_6.so CCLD SDP_Templates_part_7.so CCLD SDP_Types_part_1.so CCLD SDP_Types_part_2.so CCLD SDP_Types_part_3.so CCLD SDP_Types_part_5.so CCLD SDP_Types_part_4.so CCLD SDP_Types_part_6.so CCLD SDP_Types_part_7.so CCLD Socket_API_Definitions_part_1.so CCLD Socket_API_Definitions_part_2.so CCLD Socket_API_Definitions_part_3.so CCLD Socket_API_Definitions_part_4.so CCLD Socket_API_Definitions_part_5.so CCLD Socket_API_Definitions_part_6.so CCLD Socket_API_Definitions_part_7.so CCLD StatsD_CodecPort_part_1.so CCLD StatsD_CodecPort_part_2.so CCLD StatsD_CodecPort_part_3.so CCLD StatsD_CodecPort_part_4.so CCLD StatsD_CodecPort_part_5.so CCLD StatsD_CodecPort_part_6.so CCLD StatsD_CodecPort_part_7.so CCLD StatsD_CodecPort_CtrlFunct_part_1.so CCLD StatsD_CodecPort_CtrlFunct_part_2.so CCLD StatsD_CodecPort_CtrlFunct_part_3.so CCLD StatsD_CodecPort_CtrlFunct_part_4.so CCLD StatsD_CodecPort_CtrlFunct_part_5.so CCLD StatsD_CodecPort_CtrlFunct_part_6.so CCLD StatsD_CodecPort_CtrlFunct_part_7.so CCLD StatsD_Types_part_1.so CCLD StatsD_Types_part_2.so CCLD StatsD_Types_part_3.so CCLD StatsD_Types_part_4.so CCLD StatsD_Types_part_5.so CCLD StatsD_Types_part_6.so CCLD StatsD_Types_part_7.so CCLD TCCConversion_Functions_part_1.so CCLD TCCConversion_Functions_part_2.so CCLD TCCConversion_Functions_part_3.so CCLD TCCConversion_Functions_part_4.so CCLD TCCConversion_Functions_part_5.so CCLD TCCConversion_Functions_part_6.so CCLD TCCConversion_Functions_part_7.so CCLD TCCInterface_Functions_part_1.so CCLD TCCInterface_Functions_part_2.so CCLD TCCInterface_Functions_part_3.so CCLD TCCInterface_Functions_part_4.so CCLD TCCInterface_Functions_part_5.so CCLD TCCInterface_Functions_part_6.so CCLD TCCInterface_Functions_part_7.so CCLD TELNETasp_PortType_part_1.so CCLD TELNETasp_PortType_part_2.so CCLD TELNETasp_PortType_part_3.so CCLD TELNETasp_PortType_part_4.so CCLD TELNETasp_PortType_part_5.so CCLD TELNETasp_PortType_part_6.so CCLD TELNETasp_PortType_part_7.so CCLD IPA_Emulation.so CCLD StatsD_Checker.so CCLD IPA_Emulation_part_1.so CCLD IPA_Emulation_part_2.so CCLD IPA_Emulation_part_3.so CCLD IPA_Emulation_part_4.so CCLD IPA_Emulation_part_5.so CCLD IPA_Emulation_part_6.so CCLD IPA_Emulation_part_7.so CCLD StatsD_Checker_part_1.so CCLD StatsD_Checker_part_2.so CCLD StatsD_Checker_part_3.so CCLD StatsD_Checker_part_4.so CCLD StatsD_Checker_part_5.so CCLD StatsD_Checker_part_6.so CCLD StatsD_Checker_part_7.so CCLD SDP_parse_.tab.so CCLD lex.SDP_parse_.so CCLD IPA_CodecPort_CtrlFunctDef.so CCLD IPL4asp_PT.so CCLD IPL4asp_discovery.so CCLD IP_EncDec.so CCLD IuUP_EncDec.so CCLD MGCP_CodecPort_CtrlFunctDef.so CCLD Native_FunctionDefs.so CCLD OSMUX_CodecPort_CtrlFunctDef.so CCLD RTP_CodecPort_CtrlFunctDef.so CCLD RTP_EncDec.so CCLD SDP_EncDec.so CCLD StatsD_CodecPort_CtrlFunctdef.so CCLD TCCConversion.so CCLD TCCInterface.so CCLD TELNETasp_PT.so CCLD MGCP_Test make[1]: Leaving directory '<
https://jenkins.osmocom.org/jenkins/job/ttcn3-mgw-test-asan/ws/_cache/podma…
'> [1;34m[testenv] Stopping podman container (restart)[0m [0;94m[testenv] + ['podman', 'kill', 'testenv-mgw-osmocom-nightly-asan-20260821-1636-7c63615e-0'][0m testenv-mgw-osmocom-nightly-asan-20260821-1636-7c63615e-0 [0;94m[testenv] + ['podman', 'run', '--rm', '--name', 'testenv-mgw-osmocom-nightly-asan-20260821-1636-7c63615e-1', '--log-driver', 'json-file', '--log-opt', 'path=<
https://jenkins.osmocom.org/jenkins/job/ttcn3-mgw-test-asan/807/artifact/lo…
',> '--security-opt=seccomp=<
https://jenkins.osmocom.org/jenkins/job/ttcn3-mgw-test-asan/ws/_testenv/dat…
',> '--cap-add=NET_ADMIN', '--cap-add=NET_RAW', '--cap-add=SYS_ADMIN', '--device=/dev/net/tun', '--volume', '<
https://jenkins.osmocom.org/jenkins/job/ttcn3-mgw-test-asan/ws/_cache/podma…
>:/var/cache/apt', '--volume', '<
https://jenkins.osmocom.org/jenkins/job/ttcn3-mgw-test-asan/ws/_cache/podma…
>:/var/lib/apt', '--sysctl', 'net.ipv4.conf.all.send_redirects=0', '--sysctl', 'net.ipv4.conf.default.send_redirects=0', '-e', 'PODMAN=1', '-e', 'HOST_USER=osmocom-build', '-e', 'TESTENV_BINARY_REPO=1', '--volume', '<
https://jenkins.osmocom.org/jenkins/job/ttcn3-mgw-test-asan/ws/logs
>:<
https://jenkins.osmocom.org/jenkins/job/ttcn3-mgw-test-asan/ws/logs
',> '--volume', '<
https://jenkins.osmocom.org/jenkins/job/ttcn3-mgw-test-asan/ws/_cache
>:<
https://jenkins.osmocom.org/jenkins/job/ttcn3-mgw-test-asan/ws/_cache
',> '--volume', '/home/osmocom-build/ccache/testenv:/home/osmocom-build/ccache/testenv', '--volume', '/home/osmocom-build/jenkins/workspace:/home/osmocom-build/jenkins/workspace', 'debian-trixie-osmo-ttcn3-testenv', '<
https://jenkins.osmocom.org/jenkins/job/ttcn3-mgw-test-asan/ws/_testenv/dat…
'][0m> [0;94m[testenv] + ['podman', 'exec', '-e', 'CCACHE_DIR=/home/osmocom-build/ccache/testenv', '-e', 'TESTENV_CACHE_DIR=<
https://jenkins.osmocom.org/jenkins/job/ttcn3-mgw-test-asan/ws/_cache
',> '-e', 'TESTENV_SRC_DIR=/home/osmocom-build/jenkins/workspace', '-e', 'TESTENV_INSTALL_DIR=/', '-e', 'TERM=dumb', '-e', 'PATH=<
https://jenkins.osmocom.org/jenkins/job/ttcn3-mgw-test-asan/ws/_testenv/dat…
>:<
https://jenkins.osmocom.org/jenkins/job/ttcn3-mgw-test-asan/ws/_testenv/dat…
>:<
https://jenkins.osmocom.org/jenkins/job/ttcn3-mgw-test-asan/ws/mgw
>:/usr/local/bin:/usr/sbin:/usr/bin:/sbin:/bin', '-e', 'HOME=/home/osmocom-build', '-e', 'PYTHONUNBUFFERED=1', '-t', 'testenv-mgw-osmocom-nightly-asan-20260821-1636-7c63615e-1', 'rm', '/etc/apt/apt.conf.d/docker-clean'][0m Running testenv-podman-main.sh [0;94m[testenv] feed_watchdog_loop: podman container has stopped[0m [0;94m[testenv] + ['podman', 'exec', '-e', 'CCACHE_DIR=/home/osmocom-build/ccache/testenv', '-e', 'TESTENV_CACHE_DIR=<
https://jenkins.osmocom.org/jenkins/job/ttcn3-mgw-test-asan/ws/_cache
',> '-e', 'TESTENV_SRC_DIR=/home/osmocom-build/jenkins/workspace', '-e', 'TESTENV_INSTALL_DIR=/', '-e', 'TERM=dumb', '-e', 'PATH=<
https://jenkins.osmocom.org/jenkins/job/ttcn3-mgw-test-asan/ws/_testenv/dat…
>:<
https://jenkins.osmocom.org/jenkins/job/ttcn3-mgw-test-asan/ws/_testenv/dat…
>:<
https://jenkins.osmocom.org/jenkins/job/ttcn3-mgw-test-asan/ws/mgw
>:/usr/local/bin:/usr/sbin:/usr/bin:/sbin:/bin', '-e', 'HOME=/home/osmocom-build', '-e', 'PYTHONUNBUFFERED=1', '-t', 'testenv-mgw-osmocom-nightly-asan-20260821-1636-7c63615e-1', 'sh', '-c', "echo 'deb [signed-by=/obs.key]
https://downloads.osmocom.org/packages/osmocom:/nightly:/asan/Debian_13/
./' > /etc/apt/sources.list.d/osmocom.list"][0m [0;94m[testenv] + ['podman', 'exec', '-e', 'CCACHE_DIR=/home/osmocom-build/ccache/testenv', '-e', 'TESTENV_CACHE_DIR=<
https://jenkins.osmocom.org/jenkins/job/ttcn3-mgw-test-asan/ws/_cache
',> '-e', 'TESTENV_SRC_DIR=/home/osmocom-build/jenkins/workspace', '-e', 'TESTENV_INSTALL_DIR=/', '-e', 'TERM=dumb', '-e', 'PATH=<
https://jenkins.osmocom.org/jenkins/job/ttcn3-mgw-test-asan/ws/_testenv/dat…
>:<
https://jenkins.osmocom.org/jenkins/job/ttcn3-mgw-test-asan/ws/_testenv/dat…
>:<
https://jenkins.osmocom.org/jenkins/job/ttcn3-mgw-test-asan/ws/mgw
>:/usr/local/bin:/usr/sbin:/usr/bin:/sbin:/bin', '-e', 'HOME=/home/osmocom-build', '-e', 'PYTHONUNBUFFERED=1', '-t', 'testenv-mgw-osmocom-nightly-asan-20260821-1636-7c63615e-1', 'sh', '-c', 'echo \'Package: *\nPin: origin "
downloads.osmocom.org
"\nPin-Priority: 1100\n\' > /etc/apt/preferences.d/osmocom-apt-pin'][0m [0;94m[testenv] + ['podman', 'exec', '-e', 'CCACHE_DIR=/home/osmocom-build/ccache/testenv', '-e', 'TESTENV_CACHE_DIR=<
https://jenkins.osmocom.org/jenkins/job/ttcn3-mgw-test-asan/ws/_cache
',> '-e', 'TESTENV_SRC_DIR=/home/osmocom-build/jenkins/workspace', '-e', 'TESTENV_INSTALL_DIR=/', '-e', 'TERM=dumb', '-e', 'PATH=<
https://jenkins.osmocom.org/jenkins/job/ttcn3-mgw-test-asan/ws/_testenv/dat…
>:<
https://jenkins.osmocom.org/jenkins/job/ttcn3-mgw-test-asan/ws/_testenv/dat…
>:<
https://jenkins.osmocom.org/jenkins/job/ttcn3-mgw-test-asan/ws/mgw
>:/usr/local/bin:/usr/sbin:/usr/bin:/sbin:/bin', '-e', 'HOME=/home/osmocom-build', '-e', 'PYTHONUNBUFFERED=1', '-t', 'testenv-mgw-osmocom-nightly-asan-20260821-1636-7c63615e-1', 'apt-get', '-q', 'update'][0m Hit:1
http://deb.debian.org/debian
trixie InRelease Hit:2
http://deb.debian.org/debian
trixie-updates InRelease Hit:3
http://deb.debian.org/debian-security
trixie-security InRelease Get:4
https://downloads.osmocom.org/packages/osmocom:/nightly:/asan/Debian_13
./ InRelease [1611 B] Get:5
https://downloads.osmocom.org/packages/osmocom:/nightly:/asan/Debian_13
./ Packages [55.9 kB] Fetched 57.5 kB in 0s (306 kB/s) Reading package lists... [0;94m[testenv] + ['podman', 'exec', '-e', 'CCACHE_DIR=/home/osmocom-build/ccache/testenv', '-e', 'TESTENV_CACHE_DIR=<
https://jenkins.osmocom.org/jenkins/job/ttcn3-mgw-test-asan/ws/_cache
',> '-e', 'TESTENV_SRC_DIR=/home/osmocom-build/jenkins/workspace', '-e', 'TESTENV_INSTALL_DIR=/', '-e', 'TERM=dumb', '-e', 'PATH=<
https://jenkins.osmocom.org/jenkins/job/ttcn3-mgw-test-asan/ws/_testenv/dat…
>:<
https://jenkins.osmocom.org/jenkins/job/ttcn3-mgw-test-asan/ws/_testenv/dat…
>:<
https://jenkins.osmocom.org/jenkins/job/ttcn3-mgw-test-asan/ws/mgw
>:/usr/local/bin:/usr/sbin:/usr/bin:/sbin:/bin', '-e', 'HOME=/home/osmocom-build', '-e', 'PYTHONUNBUFFERED=1', '-t', 'testenv-mgw-osmocom-nightly-asan-20260821-1636-7c63615e-1', 'sh', '-c', 'apt-cache pkgnames | grep -- -dbg > <
https://jenkins.osmocom.org/jenkins/job/ttcn3-mgw-test-asan/ws/_cache/podma…
'][0m> [0;94m[testenv] + ['podman', 'exec', '-e', 'CCACHE_DIR=/home/osmocom-build/ccache/testenv', '-e', 'TESTENV_CACHE_DIR=<
https://jenkins.osmocom.org/jenkins/job/ttcn3-mgw-test-asan/ws/_cache
',> '-e', 'TESTENV_SRC_DIR=/home/osmocom-build/jenkins/workspace', '-e', 'TESTENV_INSTALL_DIR=/', '-e', 'TERM=dumb', '-e', 'PATH=<
https://jenkins.osmocom.org/jenkins/job/ttcn3-mgw-test-asan/ws/_testenv/dat…
>:<
https://jenkins.osmocom.org/jenkins/job/ttcn3-mgw-test-asan/ws/_testenv/dat…
>:<
https://jenkins.osmocom.org/jenkins/job/ttcn3-mgw-test-asan/ws/mgw
>:/usr/local/bin:/usr/sbin:/usr/bin:/sbin:/bin', '-e', 'HOME=/home/osmocom-build', '-e', 'PYTHONUNBUFFERED=1', '-t', 'testenv-mgw-osmocom-nightly-asan-20260821-1636-7c63615e-1', 'apt-rdepends', 'osmo-mgw'][0m [0;94m[testenv] osmo-mgw -> osmo-mgw: installing osmo-mgw-dbgsym[0m [0;94m[testenv] osmo-mgw -> libc6: installing libc6-dbg[0m [0;94m[testenv] osmo-mgw -> libosmocore22: installing libosmocore-dbg[0m [1;34m[testenv] Installing packages: osmo-mgw, osmo-mgw-dbgsym, libc6-dbg, libosmocore-dbg[0m [0;94m[testenv] + ['podman', 'exec', '-e', 'CCACHE_DIR=/home/osmocom-build/ccache/testenv', '-e', 'TESTENV_CACHE_DIR=<
https://jenkins.osmocom.org/jenkins/job/ttcn3-mgw-test-asan/ws/_cache
',> '-e', 'TESTENV_SRC_DIR=/home/osmocom-build/jenkins/workspace', '-e', 'TESTENV_INSTALL_DIR=/', '-e', 'TERM=dumb', '-e', 'PATH=<
https://jenkins.osmocom.org/jenkins/job/ttcn3-mgw-test-asan/ws/_testenv/dat…
>:<
https://jenkins.osmocom.org/jenkins/job/ttcn3-mgw-test-asan/ws/_testenv/dat…
>:<
https://jenkins.osmocom.org/jenkins/job/ttcn3-mgw-test-asan/ws/mgw
>:/usr/local/bin:/usr/sbin:/usr/bin:/sbin:/bin', '-e', 'HOME=/home/osmocom-build', '-e', 'PYTHONUNBUFFERED=1', '-t', 'testenv-mgw-osmocom-nightly-asan-20260821-1636-7c63615e-1', 'apt-get', '-q', 'install', '-y', '--no-install-recommends', 'osmo-mgw', 'osmo-mgw-dbgsym', 'libc6-dbg', 'libosmocore-dbg'][0m Reading package lists... Building dependency tree... Solving dependencies... Some packages could not be installed. This may mean that you have requested an impossible situation or if you are using the unstable distribution that some required packages have not yet been created or been moved out of Incoming. The following information may help to resolve the situation: The following packages have unmet dependencies: osmo-mgw : Depends: osmocom-nightly-asan (= 202608192029) but 202608202029 is to be installed E: Unable to correct problems, you have held broken packages. E: The following information from --solver 3.0 may provide additional context: Unable to satisfy dependencies. Reached two conflicting decisions: 1. osmo-mgw:amd64=1.15.0.1.8afba.202608192029~asan is selected for install 2. osmo-mgw:amd64=1.15.0.1.8afba.202608192029~asan Depends osmocom-nightly-asan (= 202608192029) but none of the choices are installable: [no choices] [1;91m[testenv] Command failed unexpectedly[0m [0;94m[testenv] Command: ['podman', 'exec', '-e', 'CCACHE_DIR=/home/osmocom-build/ccache/testenv', '-e', 'TESTENV_CACHE_DIR=<
https://jenkins.osmocom.org/jenkins/job/ttcn3-mgw-test-asan/ws/_cache
',> '-e', 'TESTENV_SRC_DIR=/home/osmocom-build/jenkins/workspace', '-e', 'TESTENV_INSTALL_DIR=/', '-e', 'TERM=dumb', '-e', 'PATH=<
https://jenkins.osmocom.org/jenkins/job/ttcn3-mgw-test-asan/ws/_testenv/dat…
>:<
https://jenkins.osmocom.org/jenkins/job/ttcn3-mgw-test-asan/ws/_testenv/dat…
>:<
https://jenkins.osmocom.org/jenkins/job/ttcn3-mgw-test-asan/ws/mgw
>:/usr/local/bin:/usr/sbin:/usr/bin:/sbin:/bin', '-e', 'HOME=/home/osmocom-build', '-e', 'PYTHONUNBUFFERED=1', '-t', 'testenv-mgw-osmocom-nightly-asan-20260821-1636-7c63615e-1', 'apt-get', '-q', 'install', '-y', '--no-install-recommends', 'osmo-mgw', 'osmo-mgw-dbgsym', 'libc6-dbg', 'libosmocore-dbg'][0m [0;94m[testenv] Returncode: 100[0m [1;34m[testenv] Stopping podman container[0m [0;94m[testenv] + ['podman', 'kill', 'testenv-mgw-osmocom-nightly-asan-20260821-1636-7c63615e-1'][0m testenv-mgw-osmocom-nightly-asan-20260821-1636-7c63615e-1 Traceback (most recent call last): File "<
https://jenkins.osmocom.org/jenkins/job/ttcn3-mgw-test-asan/ws/./testenv.py
",> line 135, in <module> main() File "<
https://jenkins.osmocom.org/jenkins/job/ttcn3-mgw-test-asan/ws/./testenv.py
",> line 124, in main run() File "<
https://jenkins.osmocom.org/jenkins/job/ttcn3-mgw-test-asan/ws/./testenv.py
",> line 73, in run testenv.podman_install.packages(cfg, cfg_name) File "<
https://jenkins.osmocom.org/jenkins/job/ttcn3-mgw-test-asan/ws/_testenv/tes…
",> line 233, in packages apt_install(packages) File "<
https://jenkins.osmocom.org/jenkins/job/ttcn3-mgw-test-asan/ws/_testenv/tes…
",> line 99, in apt_install testenv.cmd.run(["apt-get", "-q", "install", "-y", "--no-install-recommends"] + pkgs) File "<
https://jenkins.osmocom.org/jenkins/job/ttcn3-mgw-test-asan/ws/_testenv/tes…
",> line 127, in run return testenv.podman.exec_cmd(cmd, check=check, env=env, **kwargs) ^^^^^^^^^^^^^^^^^^^^^^^^^^^^^^^^^^^^^^^^^^^^^^^^^^^^^^^^^^^^ File "<
https://jenkins.osmocom.org/jenkins/job/ttcn3-mgw-test-asan/ws/_testenv/tes…
",> line 156, in exec_cmd return testenv.cmd.run( ^^^^^^^^^^^^^^^^ File "<
https://jenkins.osmocom.org/jenkins/job/ttcn3-mgw-test-asan/ws/_testenv/tes…
",> line 144, in run exit_error_cmd(p, "Command failed unexpectedly") File "<
https://jenkins.osmocom.org/jenkins/job/ttcn3-mgw-test-asan/ws/_testenv/tes…
",> line 88, in exit_error_cmd raise RuntimeError("shell command related error, find details right above this python trace") RuntimeError: shell command related error, find details right above this python trace [0;94m[testenv] feed_watchdog_loop: podman container has stopped[0m [1;34m[testenv] Logs saved to:
https://jenkins.osmocom.org/jenkins/job/ttcn3-mgw-test-asan/807/artifact/lo…
[0m + RC=1 + [ 1 = 0 ] + uptime + grep --color=always -o load.* [01;31m[Kload average: 2.54, 1.08, 0.84[m[K + exit 1 Build step 'Execute shell' marked build as failure Recording test results ERROR: Step ‘Publish JUnit test result report’ failed: No test report files were found. Configuration error?
1
0
0
0
Jenkins build is back to stable : ttcn3-bsc-test-sccplite-latest #2779
by jenkins@lists.osmocom.org
21 Aug '26
21 Aug '26
See <
https://jenkins.osmocom.org/jenkins/job/ttcn3-bsc-test-sccplite-latest/2779…
>
1
0
0
0
Jenkins build is back to stable : ttcn3-bsc-test-latest #2889
by jenkins@lists.osmocom.org
21 Aug '26
21 Aug '26
See <
https://jenkins.osmocom.org/jenkins/job/ttcn3-bsc-test-latest/2889/display/…
>
1
0
0
0
Build failed in Jenkins: Osmocom-release-manuals #1327
by jenkins@lists.osmocom.org
21 Aug '26
21 Aug '26
See <
https://jenkins.osmocom.org/jenkins/job/Osmocom-release-manuals/1327/displa…
> Changes: [Oliver Smith] Revert "jobs: run ttcn3-remsim-test-asan with bookworm" ------------------------------------------ [...truncated 2.73 KiB...] :: (openbsc, 0.9.3): skipping, tag is ignored :: (openbsc, 0.9.4): skipping, tag is ignored :: (openbsc, 0.9.5): skipping, tag is ignored :: (openbsc, 0.9.6): skipping, tag is ignored :: (openbsc, 0.9.8): skipping, tag is ignored :: (openbsc, 0.9.9): skipping, tag is ignored :: (openbsc, 0.9.10): skipping, tag is ignored :: (openbsc, 0.9.11): skipping, tag is ignored :: (openbsc, 0.9.12): skipping, tag is ignored :: (openbsc, 0.9.13): skipping, tag is ignored :: (openbsc, 0.9.14): skipping, tag is ignored :: (openbsc, 0.9.15): skipping, tag is ignored :: (openbsc, 0.9.16): skipping, tag is ignored :: (openbsc, 0.10.0): skipping, tag is ignored :: (openbsc, 0.10.1): skipping, tag is ignored :: (openbsc, 0.11.0): skipping, tag is ignored :: (openbsc, 0.12.0): skipping, tag is ignored :: (openbsc, 0.13.0): skipping, tag is ignored :: (openbsc, 0.14.0): skipping, tag is ignored :: (openbsc, 0.15.0): skipping, tag is ignored :: (openbsc, 1.0.0): skipping, tag is ignored :: (openbsc, 1.1.0): skipping, tag is ignored :: (openbsc, 1.2.0): skipping, manuals exist :: (openbsc, 1.3.0): skipping, manuals exist :: (openbsc, 1.3.1): skipping, manuals exist :: (openbsc, 1.3.2): skipping, manuals exist :: (openbsc, 1.3.3): skipping, manuals exist :: (openbsc, 1.4.0): skipping, manuals exist :: (openbsc, 1.4.1): skipping, manuals exist :: (openbsc, 1.4.2): skipping, manuals exist :: (osmo-bsc) Listing files on server: /docs/osmo-bsc :: (osmo-bsc) Getting git tags :: (osmo-bsc) Building missing manuals :: (osmo-bsc, 1.0.1): skipping, tag is ignored :: (osmo-bsc, 1.1.0): skipping, tag is ignored :: (osmo-bsc, 1.1.1): skipping, tag is ignored :: (osmo-bsc, 1.1.2): skipping, tag is ignored :: (osmo-bsc, 1.2.0): skipping, tag is ignored :: (osmo-bsc, 1.2.1): skipping, tag is ignored :: (osmo-bsc, 1.2.2): skipping, tag is ignored :: (osmo-bsc, 1.3.0): skipping, tag is ignored :: (osmo-bsc, 1.4.0): skipping, tag is ignored :: (osmo-bsc, 1.4.1): skipping, tag is ignored :: (osmo-bsc, 1.5.0): skipping, tag is ignored :: (osmo-bsc, 1.6.0): skipping, tag is ignored :: (osmo-bsc, 1.6.1): skipping, manuals exist :: (osmo-bsc, 1.7.0): skipping, manuals exist :: (osmo-bsc, 1.7.1): skipping, manuals exist :: (osmo-bsc, 1.7.2): skipping, manuals exist :: (osmo-bsc, 1.8.0): skipping, manuals exist :: (osmo-bsc, 1.8.1): skipping, manuals exist :: (osmo-bsc, 1.9.0): skipping, manuals exist :: (osmo-bsc, 1.9.1): skipping, manuals exist :: (osmo-bsc, 1.9.2): skipping, manuals exist :: (osmo-bsc, 1.10.0): skipping, manuals exist :: (osmo-bsc, 1.11.0): skipping, manuals exist :: (osmo-bsc, 1.11.1): skipping, manuals exist :: (osmo-bsc, 1.12.0): skipping, manuals exist :: (osmo-bsc, 1.12.1): skipping, manuals exist :: (osmo-bsc, 1.12.2): skipping, manuals exist :: (osmo-bsc, 1.12.3): skipping, manuals exist :: (osmo-bsc, 1.12.4): skipping, manuals exist :: (osmo-bsc, 1.13.0): skipping, manuals exist :: (osmo-bsc, 1.13.1): skipping, manuals exist :: (osmo-bsc, 1.13.2): skipping, manuals exist :: (osmo-bsc, 1.13.3): skipping, manuals exist :: (osmo-bsc, 1.14.0): skipping, manuals exist :: (osmo-bsc, 1.14.1): skipping, manuals exist :: (osmo-bsc, 1.15.0) Cloning
https://gerrit.osmocom.org/osmo-bsc
Cloning into 'osmo-bsc'... :: (osmo-bsc, 1.15.0) Checkout 1.15.0 HEAD is now at 1a2627f61 Bump version: 1.14.0.40-779dd6-dirty → 1.15.0 Note: switching to '1.15.0'. You are in 'detached HEAD' state. You can look around, make experimental changes and commit them, and you can discard any commits you make in this state without impacting any branches by switching back to a branch. If you want to create a new branch to retain commits you create, you may do so (now or later) by using -c with the switch command. Example: git switch -c <new-branch-name> Or undo this operation with: git switch - Turn off this advice by setting config variable advice.detachedHead to false HEAD is now at 1a2627f61 Bump version: 1.14.0.40-779dd6-dirty → 1.15.0 :: (osmo-bsc, 1.15.0) Building manuals + apt-get update Hit:1
http://deb.debian.org/debian
trixie InRelease Hit:2
http://deb.debian.org/debian
trixie-updates InRelease Get:3
http://deb.debian.org/debian-security
trixie-security InRelease [43.4 kB] Hit:4
https://downloads.osmocom.org/packages/osmocom:/misc/Debian_13
./ InRelease Hit:5
https://downloads.osmocom.org/packages/osmocom:/nightly/Debian_13
./ InRelease Fetched 43.4 kB in 0s (303 kB/s) Reading package lists... + apt-get -y upgrade osmocom-nightly Reading package lists... Building dependency tree... Reading state information... Calculating upgrade... The following NEW packages will be installed: osmocom-keyring osmocom-nightly The following packages have been kept back: sdcc sdcc-libraries The following packages will be upgraded: bsdextrautils bsdutils libblkid-dev libblkid1 libde265-0 libexpat1 libexpat1-dev libheif-plugin-dav1d libheif-plugin-libde265 libheif1 liblastlog2-2 libmount-dev libmount1 libsmartcols1 libuuid1 linux-libc-dev login mount unzip util-linux uuid-dev 21 upgraded, 2 newly installed, 0 to remove and 2 not upgraded. Need to get 6725 kB of archives. After this operation, 79.9 kB of additional disk space will be used. Get:1
https://downloads.osmocom.org/packages/osmocom:/nightly/Debian_13
./ osmocom-keyring 1.1.1.8.7873.202608191800 [3196 B] Get:2
https://downloads.osmocom.org/packages/osmocom:/nightly/Debian_13
./ osmocom-nightly 202608191800 [1192 B] Get:3
http://deb.debian.org/debian-security
trixie-security/main amd64 bsdutils amd64 1:2.41.5-0+deb13u1 [110 kB] Get:4
http://deb.debian.org/debian-security
trixie-security/main amd64 uuid-dev amd64 2.41.5-0+deb13u1 [49.1 kB] Get:5
http://deb.debian.org/debian-security
trixie-security/main amd64 libblkid-dev amd64 2.41.5-0+deb13u1 [209 kB] Get:6
http://deb.debian.org/debian-security
trixie-security/main amd64 libmount-dev amd64 2.41.5-0+deb13u1 [30.7 kB] Get:7
http://deb.debian.org/debian-security
trixie-security/main amd64 libblkid1 amd64 2.41.5-0+deb13u1 [172 kB] Get:8
http://deb.debian.org/debian-security
trixie-security/main amd64 libmount1 amd64 2.41.5-0+deb13u1 [210 kB] Get:9
http://deb.debian.org/debian-security
trixie-security/main amd64 bsdextrautils amd64 2.41.5-0+deb13u1 [94.8 kB] Get:10
http://deb.debian.org/debian-security
trixie-security/main amd64 libsmartcols1 amd64 2.41.5-0+deb13u1 [143 kB] Get:11
http://deb.debian.org/debian-security
trixie-security/main amd64 mount amd64 2.41.5-0+deb13u1 [163 kB] Get:12
http://deb.debian.org/debian-security
trixie-security/main amd64 liblastlog2-2 amd64 2.41.5-0+deb13u1 [28.8 kB] Get:13
http://deb.debian.org/debian-security
trixie-security/main amd64 libuuid1 amd64 2.41.5-0+deb13u1 [37.8 kB] Get:14
http://deb.debian.org/debian-security
trixie-security/main amd64 util-linux amd64 2.41.5-0+deb13u1 [1242 kB] Get:15
http://deb.debian.org/debian-security
trixie-security/main amd64 login amd64 1:4.16.0-2+really2.41.5-0+deb13u1 [115 kB] Get:16
http://deb.debian.org/debian-security
trixie-security/main amd64 libexpat1-dev amd64 2.8.3-1~deb13u1 [179 kB] Get:17
http://deb.debian.org/debian-security
trixie-security/main amd64 libexpat1 amd64 2.8.3-1~deb13u1 [123 kB] Get:18
http://deb.debian.org/debian-security
trixie-security/main amd64 libde265-0 amd64 1.0.15-1+deb13u1 [190 kB] Get:19
http://deb.debian.org/debian-security
trixie-security/main amd64 libheif-plugin-dav1d amd64 1.19.8-1+deb13u1 [11.9 kB] Get:20
http://deb.debian.org/debian-security
trixie-security/main amd64 libheif1 amd64 1.19.8-1+deb13u1 [522 kB] Get:21
http://deb.debian.org/debian-security
trixie-security/main amd64 libheif-plugin-libde265 amd64 1.19.8-1+deb13u1 [15.5 kB] Get:22
http://deb.debian.org/debian-security
trixie-security/main amd64 linux-libc-dev all 6.12.101-1 [2901 kB] Get:23
http://deb.debian.org/debian-security
trixie-security/main amd64 unzip amd64 6.0-29+deb13u1 [173 kB] Fetched 6725 kB in 0s (39.3 MB/s) (Reading database ... (Reading database ... 5%(Reading database ... 10%(Reading database ... 15%(Reading database ... 20%(Reading database ... 25%(Reading database ... 30%(Reading database ... 35%(Reading database ... 40%(Reading database ... 45%(Reading database ... 50%(Reading database ... 55%(Reading database ... 60%(Reading database ... 65%(Reading database ... 70%(Reading database ... 75%(Reading database ... 80%(Reading database ... 85%(Reading database ... 90%(Reading database ... 95%(Reading database ... 100%(Reading database ... 132066 files and directories currently installed.) Preparing to unpack .../bsdutils_1%3a2.41.5-0+deb13u1_amd64.deb ... Unpacking bsdutils (1:2.41.5-0+deb13u1) over (1:2.41-5) ... Setting up bsdutils (1:2.41.5-0+deb13u1) ... (Reading database ... (Reading database ... 5%(Reading database ... 10%(Reading database ... 15%(Reading database ... 20%(Reading database ... 25%(Reading database ... 30%(Reading database ... 35%(Reading database ... 40%(Reading database ... 45%(Reading database ... 50%(Reading database ... 55%(Reading database ... 60%(Reading database ... 65%(Reading database ... 70%(Reading database ... 75%(Reading database ... 80%(Reading database ... 85%(Reading database ... 90%(Reading database ... 95%(Reading database ... 100%(Reading database ... 132066 files and directories currently installed.) Preparing to unpack .../uuid-dev_2.41.5-0+deb13u1_amd64.deb ... Unpacking uuid-dev:amd64 (2.41.5-0+deb13u1) over (2.41-5) ... Preparing to unpack .../libblkid-dev_2.41.5-0+deb13u1_amd64.deb ... Unpacking libblkid-dev:amd64 (2.41.5-0+deb13u1) over (2.41-5) ... Preparing to unpack .../libmount-dev_2.41.5-0+deb13u1_amd64.deb ... Unpacking libmount-dev:amd64 (2.41.5-0+deb13u1) over (2.41-5) ... Preparing to unpack .../libblkid1_2.41.5-0+deb13u1_amd64.deb ... Unpacking libblkid1:amd64 (2.41.5-0+deb13u1) over (2.41-5) ... Setting up libblkid1:amd64 (2.41.5-0+deb13u1) ... (Reading database ... (Reading database ... 5%(Reading database ... 10%(Reading database ... 15%(Reading database ... 20%(Reading database ... 25%(Reading database ... 30%(Reading database ... 35%(Reading database ... 40%(Reading database ... 45%(Reading database ... 50%(Reading database ... 55%(Reading database ... 60%(Reading database ... 65%(Reading database ... 70%(Reading database ... 75%(Reading database ... 80%(Reading database ... 85%(Reading database ... 90%(Reading database ... 95%(Reading database ... 100%(Reading database ... 132066 files and directories currently installed.) Preparing to unpack .../libmount1_2.41.5-0+deb13u1_amd64.deb ... Unpacking libmount1:amd64 (2.41.5-0+deb13u1) over (2.41-5) ... Setting up libmount1:amd64 (2.41.5-0+deb13u1) ... (Reading database ... (Reading database ... 5%(Reading database ... 10%(Reading database ... 15%(Reading database ... 20%(Reading database ... 25%(Reading database ... 30%(Reading database ... 35%(Reading database ... 40%(Reading database ... 45%(Reading database ... 50%(Reading database ... 55%(Reading database ... 60%(Reading database ... 65%(Reading database ... 70%(Reading database ... 75%(Reading database ... 80%(Reading database ... 85%(Reading database ... 90%(Reading database ... 95%(Reading database ... 100%(Reading database ... 132066 files and directories currently installed.) Preparing to unpack .../bsdextrautils_2.41.5-0+deb13u1_amd64.deb ... Unpacking bsdextrautils (2.41.5-0+deb13u1) over (2.41-5) ... Preparing to unpack .../libsmartcols1_2.41.5-0+deb13u1_amd64.deb ... Unpacking libsmartcols1:amd64 (2.41.5-0+deb13u1) over (2.41-5) ... Setting up libsmartcols1:amd64 (2.41.5-0+deb13u1) ... (Reading database ... (Reading database ... 5%(Reading database ... 10%(Reading database ... 15%(Reading database ... 20%(Reading database ... 25%(Reading database ... 30%(Reading database ... 35%(Reading database ... 40%(Reading database ... 45%(Reading database ... 50%(Reading database ... 55%(Reading database ... 60%(Reading database ... 65%(Reading database ... 70%(Reading database ... 75%(Reading database ... 80%(Reading database ... 85%(Reading database ... 90%(Reading database ... 95%(Reading database ... 100%(Reading database ... 132066 files and directories currently installed.) Preparing to unpack .../mount_2.41.5-0+deb13u1_amd64.deb ... Unpacking mount (2.41.5-0+deb13u1) over (2.41-5) ... Preparing to unpack .../liblastlog2-2_2.41.5-0+deb13u1_amd64.deb ... Unpacking liblastlog2-2:amd64 (2.41.5-0+deb13u1) over (2.41-5) ... Setting up liblastlog2-2:amd64 (2.41.5-0+deb13u1) ... (Reading database ... (Reading database ... 5%(Reading database ... 10%(Reading database ... 15%(Reading database ... 20%(Reading database ... 25%(Reading database ... 30%(Reading database ... 35%(Reading database ... 40%(Reading database ... 45%(Reading database ... 50%(Reading database ... 55%(Reading database ... 60%(Reading database ... 65%(Reading database ... 70%(Reading database ... 75%(Reading database ... 80%(Reading database ... 85%(Reading database ... 90%(Reading database ... 95%(Reading database ... 100%(Reading database ... 132066 files and directories currently installed.) Preparing to unpack .../libuuid1_2.41.5-0+deb13u1_amd64.deb ... Unpacking libuuid1:amd64 (2.41.5-0+deb13u1) over (2.41-5) ... Setting up libuuid1:amd64 (2.41.5-0+deb13u1) ... (Reading database ... (Reading database ... 5%(Reading database ... 10%(Reading database ... 15%(Reading database ... 20%(Reading database ... 25%(Reading database ... 30%(Reading database ... 35%(Reading database ... 40%(Reading database ... 45%(Reading database ... 50%(Reading database ... 55%(Reading database ... 60%(Reading database ... 65%(Reading database ... 70%(Reading database ... 75%(Reading database ... 80%(Reading database ... 85%(Reading database ... 90%(Reading database ... 95%(Reading database ... 100%(Reading database ... 132066 files and directories currently installed.) Preparing to unpack .../util-linux_2.41.5-0+deb13u1_amd64.deb ... Unpacking util-linux (2.41.5-0+deb13u1) over (2.41-5) ... Setting up util-linux (2.41.5-0+deb13u1) ... update-alternatives: warning: forcing reinstallation of alternative /bin/more because link group pager is broken update-alternatives: warning: skip creation of /usr/share/man/man1/pager.1.gz because associated file /usr/share/man/man1/more.1.gz (of link group pager) doesn't exist (Reading database ... (Reading database ... 5%(Reading database ... 10%(Reading database ... 15%(Reading database ... 20%(Reading database ... 25%(Reading database ... 30%(Reading database ... 35%(Reading database ... 40%(Reading database ... 45%(Reading database ... 50%(Reading database ... 55%(Reading database ... 60%(Reading database ... 65%(Reading database ... 70%(Reading database ... 75%(Reading database ... 80%(Reading database ... 85%(Reading database ... 90%(Reading database ... 95%(Reading database ... 100%(Reading database ... 132071 files and directories currently installed.) Preparing to unpack .../00-login_1%3a4.16.0-2+really2.41.5-0+deb13u1_amd64.deb ... Unpacking login (1:4.16.0-2+really2.41.5-0+deb13u1) over (1:4.16.0-2+really2.41-5) ... Preparing to unpack .../01-libexpat1-dev_2.8.3-1~deb13u1_amd64.deb ... Unpacking libexpat1-dev:amd64 (2.8.3-1~deb13u1) over (2.8.2-1~deb13u1) ... Preparing to unpack .../02-libexpat1_2.8.3-1~deb13u1_amd64.deb ... Unpacking libexpat1:amd64 (2.8.3-1~deb13u1) over (2.8.2-1~deb13u1) ... Preparing to unpack .../03-libde265-0_1.0.15-1+deb13u1_amd64.deb ... Unpacking libde265-0:amd64 (1.0.15-1+deb13u1) over (1.0.15-1+b3) ... Preparing to unpack .../04-libheif-plugin-dav1d_1.19.8-1+deb13u1_amd64.deb ... Unpacking libheif-plugin-dav1d:amd64 (1.19.8-1+deb13u1) over (1.19.8-1) ... Preparing to unpack .../05-libheif1_1.19.8-1+deb13u1_amd64.deb ... Unpacking libheif1:amd64 (1.19.8-1+deb13u1) over (1.19.8-1) ... Preparing to unpack .../06-libheif-plugin-libde265_1.19.8-1+deb13u1_amd64.deb ... Unpacking libheif-plugin-libde265:amd64 (1.19.8-1+deb13u1) over (1.19.8-1) ... Preparing to unpack .../07-linux-libc-dev_6.12.101-1_all.deb ... Unpacking linux-libc-dev (6.12.101-1) over (6.12.100-1) ... Selecting previously unselected package osmocom-keyring. Preparing to unpack .../08-osmocom-keyring_1.1.1.8.7873.202608191800_amd64.deb ... Unpacking osmocom-keyring (1.1.1.8.7873.202608191800) ... Selecting previously unselected package osmocom-nightly. Preparing to unpack .../09-osmocom-nightly_202608191800_amd64.deb ... Unpacking osmocom-nightly (202608191800) ... Preparing to unpack .../10-unzip_6.0-29+deb13u1_amd64.deb ... Unpacking unzip (6.0-29+deb13u1) over (6.0-29) ... Setting up libexpat1:amd64 (2.8.3-1~deb13u1) ... Setting up bsdextrautils (2.41.5-0+deb13u1) ... Setting up unzip (6.0-29+deb13u1) ... Setting up linux-libc-dev (6.12.101-1) ... Setting up libexpat1-dev:amd64 (2.8.3-1~deb13u1) ... Setting up uuid-dev:amd64 (2.41.5-0+deb13u1) ... Setting up osmocom-keyring (1.1.1.8.7873.202608191800) ... Setting up mount (2.41.5-0+deb13u1) ... Setting up libde265-0:amd64 (1.0.15-1+deb13u1) ... Setting up login (1:4.16.0-2+really2.41.5-0+deb13u1) ... Setting up libblkid-dev:amd64 (2.41.5-0+deb13u1) ... Setting up osmocom-nightly (202608191800) ... Setting up libmount-dev:amd64 (2.41.5-0+deb13u1) ... Setting up libheif-plugin-dav1d:amd64 (1.19.8-1+deb13u1) ... Setting up libheif1:amd64 (1.19.8-1+deb13u1) ... Setting up libheif-plugin-libde265:amd64 (1.19.8-1+deb13u1) ... Processing triggers for libc-bin (2.41-12+deb13u3) ... Processing triggers for man-db (2.13.1-1) ... + [ -e /build/debian/control ] + apt-get -y build-dep /build Note, using directory '/build' to get the build dependencies Reading package lists... Building dependency tree... Reading state information... Some packages could not be installed. This may mean that you have requested an impossible situation or if you are using the unstable distribution that some required packages have not yet been created or been moved out of Incoming. The following information may help to resolve the situation: The following packages have unmet dependencies: builddeps:/build : Depends: libosmocore-dev (>= 1.14.2) but it is not going to be installed Depends: libosmo-sigtran-dev (>= 2.3.0) but it is not going to be installed Depends: libosmo-abis-dev (>= 2.2.0) but it is not going to be installed Depends: libosmo-netif-dev (>= 1.8.0) but it is not going to be installed Depends: libosmo-mgcp-client-dev (>= 1.16.0) but it is not going to be installed E: Unable to correct problems, you have held broken packages. :: (osmo-bsc, 1.15.0) Building manuals failed! Build step 'Execute shell' marked build as failure $ ssh-agent -k unset SSH_AUTH_SOCK; unset SSH_AGENT_PID; echo Agent pid 2509863 killed; [ssh-agent] Stopped.
1
4
0
0
Build failed in Jenkins: Osmocom-release-tarballs #2712
by jenkins@lists.osmocom.org
21 Aug '26
21 Aug '26
See <
https://jenkins.osmocom.org/jenkins/job/Osmocom-release-tarballs/2712/displ…
> Changes: [Oliver Smith] Revert "jobs: run ttcn3-remsim-test-asan with bookworm" ------------------------------------------ [...truncated 5.92 KiB...] Or undo this operation with: git switch - Turn off this advice by setting config variable advice.detachedHead to false HEAD is now at 1f6508c Bump version: 2.1.0.13-898f6-dirty → 2.2.0 :: (libosmo-abis, 2.2.0) Building release tarball: libosmo-abis-2.2.0.tar.bz2 + cd /src/libosmo-abis + [ -e debian/control ] + apt-get update Hit:1
http://deb.debian.org/debian
bookworm InRelease Hit:2
http://deb.debian.org/debian
bookworm-updates InRelease Get:3
http://deb.debian.org/debian-security
bookworm-security InRelease [34.8 kB] Hit:4
https://downloads.osmocom.org/packages/osmocom:/nightly/Debian_12
./ InRelease Get:5
http://deb.debian.org/debian-security
bookworm-security/main amd64 Packages [339 kB] Fetched 374 kB in 0s (863 kB/s) Reading package lists... + apt-get -y build-dep . Note, using directory '.' to get the build dependencies Reading package lists... Building dependency tree... Reading state information... The following NEW packages will be installed: libosmo-netif-dev libosmocodec4 libosmocoding0 libosmocore libosmocore-dev libosmocore22 libosmoctrl0 libosmogb14 libosmogsm20 libosmoisdn0 libosmonetif11 libosmosim2 libosmousb0 libosmovty13 osmocom-keyring osmocom-nightly 0 upgraded, 16 newly installed, 0 to remove and 5 not upgraded. Need to get 2167 kB of archives. After this operation, 7603 kB of additional disk space will be used. Get:1
https://downloads.osmocom.org/packages/osmocom:/nightly/Debian_12
./ osmocom-keyring 1.1.1.8.7873.202608191800 [3196 B] Get:2
https://downloads.osmocom.org/packages/osmocom:/nightly/Debian_12
./ osmocom-nightly 202608191800 [1192 B] Get:3
https://downloads.osmocom.org/packages/osmocom:/nightly/Debian_12
./ libosmocore22 1.14.1.20.6ba7f.202608191800 [179 kB] Get:4
https://downloads.osmocom.org/packages/osmocom:/nightly/Debian_12
./ libosmocodec4 1.14.1.20.6ba7f.202608191800 [55.7 kB] Get:5
https://downloads.osmocom.org/packages/osmocom:/nightly/Debian_12
./ libosmoisdn0 1.14.1.20.6ba7f.202608191800 [74.2 kB] Get:6
https://downloads.osmocom.org/packages/osmocom:/nightly/Debian_12
./ libosmogsm20 1.14.1.20.6ba7f.202608191800 [232 kB] Get:7
https://downloads.osmocom.org/packages/osmocom:/nightly/Debian_12
./ libosmocoding0 1.14.1.20.6ba7f.202608191800 [74.8 kB] Get:8
https://downloads.osmocom.org/packages/osmocom:/nightly/Debian_12
./ libosmovty13 1.14.1.20.6ba7f.202608191800 [108 kB] Get:9
https://downloads.osmocom.org/packages/osmocom:/nightly/Debian_12
./ libosmogb14 1.14.1.20.6ba7f.202608191800 [181 kB] Get:10
https://downloads.osmocom.org/packages/osmocom:/nightly/Debian_12
./ libosmoctrl0 1.14.1.20.6ba7f.202608191800 [63.4 kB] Get:11
https://downloads.osmocom.org/packages/osmocom:/nightly/Debian_12
./ libosmosim2 1.14.1.20.6ba7f.202608191800 [67.3 kB] Get:12
https://downloads.osmocom.org/packages/osmocom:/nightly/Debian_12
./ libosmousb0 1.14.1.20.6ba7f.202608191800 [54.0 kB] Get:13
https://downloads.osmocom.org/packages/osmocom:/nightly/Debian_12
./ libosmocore 1.14.1.20.6ba7f.202608191800 [47.3 kB] Get:14
https://downloads.osmocom.org/packages/osmocom:/nightly/Debian_12
./ libosmocore-dev 1.14.1.20.6ba7f.202608191800 [861 kB] Get:15
https://downloads.osmocom.org/packages/osmocom:/nightly/Debian_12
./ libosmonetif11 1.7.0.17.96f9.202608191800 [72.3 kB] Get:16
https://downloads.osmocom.org/packages/osmocom:/nightly/Debian_12
./ libosmo-netif-dev 1.7.0.17.96f9.202608191800 [91.5 kB] debconf: delaying package configuration, since apt-utils is not installed Fetched 2167 kB in 0s (16.4 MB/s) Selecting previously unselected package osmocom-keyring. (Reading database ... (Reading database ... 5%(Reading database ... 10%(Reading database ... 15%(Reading database ... 20%(Reading database ... 25%(Reading database ... 30%(Reading database ... 35%(Reading database ... 40%(Reading database ... 45%(Reading database ... 50%(Reading database ... 55%(Reading database ... 60%(Reading database ... 65%(Reading database ... 70%(Reading database ... 75%(Reading database ... 80%(Reading database ... 85%(Reading database ... 90%(Reading database ... 95%(Reading database ... 100%(Reading database ... 118633 files and directories currently installed.) Preparing to unpack .../00-osmocom-keyring_1.1.1.8.7873.202608191800_amd64.deb ... Unpacking osmocom-keyring (1.1.1.8.7873.202608191800) ... Selecting previously unselected package osmocom-nightly. Preparing to unpack .../01-osmocom-nightly_202608191800_amd64.deb ... Unpacking osmocom-nightly (202608191800) ... Selecting previously unselected package libosmocore22:amd64. Preparing to unpack .../02-libosmocore22_1.14.1.20.6ba7f.202608191800_amd64.deb ... Unpacking libosmocore22:amd64 (1.14.1.20.6ba7f.202608191800) ... Selecting previously unselected package libosmocodec4:amd64. Preparing to unpack .../03-libosmocodec4_1.14.1.20.6ba7f.202608191800_amd64.deb ... Unpacking libosmocodec4:amd64 (1.14.1.20.6ba7f.202608191800) ... Selecting previously unselected package libosmoisdn0:amd64. Preparing to unpack .../04-libosmoisdn0_1.14.1.20.6ba7f.202608191800_amd64.deb ... Unpacking libosmoisdn0:amd64 (1.14.1.20.6ba7f.202608191800) ... Selecting previously unselected package libosmogsm20:amd64. Preparing to unpack .../05-libosmogsm20_1.14.1.20.6ba7f.202608191800_amd64.deb ... Unpacking libosmogsm20:amd64 (1.14.1.20.6ba7f.202608191800) ... Selecting previously unselected package libosmocoding0:amd64. Preparing to unpack .../06-libosmocoding0_1.14.1.20.6ba7f.202608191800_amd64.deb ... Unpacking libosmocoding0:amd64 (1.14.1.20.6ba7f.202608191800) ... Selecting previously unselected package libosmovty13:amd64. Preparing to unpack .../07-libosmovty13_1.14.1.20.6ba7f.202608191800_amd64.deb ... Unpacking libosmovty13:amd64 (1.14.1.20.6ba7f.202608191800) ... Selecting previously unselected package libosmogb14:amd64. Preparing to unpack .../08-libosmogb14_1.14.1.20.6ba7f.202608191800_amd64.deb ... Unpacking libosmogb14:amd64 (1.14.1.20.6ba7f.202608191800) ... Selecting previously unselected package libosmoctrl0:amd64. Preparing to unpack .../09-libosmoctrl0_1.14.1.20.6ba7f.202608191800_amd64.deb ... Unpacking libosmoctrl0:amd64 (1.14.1.20.6ba7f.202608191800) ... Selecting previously unselected package libosmosim2:amd64. Preparing to unpack .../10-libosmosim2_1.14.1.20.6ba7f.202608191800_amd64.deb ... Unpacking libosmosim2:amd64 (1.14.1.20.6ba7f.202608191800) ... Selecting previously unselected package libosmousb0:amd64. Preparing to unpack .../11-libosmousb0_1.14.1.20.6ba7f.202608191800_amd64.deb ... Unpacking libosmousb0:amd64 (1.14.1.20.6ba7f.202608191800) ... Selecting previously unselected package libosmocore. Preparing to unpack .../12-libosmocore_1.14.1.20.6ba7f.202608191800_amd64.deb ... Unpacking libosmocore (1.14.1.20.6ba7f.202608191800) ... Selecting previously unselected package libosmocore-dev:amd64. Preparing to unpack .../13-libosmocore-dev_1.14.1.20.6ba7f.202608191800_amd64.deb ... Unpacking libosmocore-dev:amd64 (1.14.1.20.6ba7f.202608191800) ... Selecting previously unselected package libosmonetif11:amd64. Preparing to unpack .../14-libosmonetif11_1.7.0.17.96f9.202608191800_amd64.deb ... Unpacking libosmonetif11:amd64 (1.7.0.17.96f9.202608191800) ... Selecting previously unselected package libosmo-netif-dev:amd64. Preparing to unpack .../15-libosmo-netif-dev_1.7.0.17.96f9.202608191800_amd64.deb ... Unpacking libosmo-netif-dev:amd64 (1.7.0.17.96f9.202608191800) ... Setting up osmocom-keyring (1.1.1.8.7873.202608191800) ... Setting up osmocom-nightly (202608191800) ... Setting up libosmocore22:amd64 (1.14.1.20.6ba7f.202608191800) ... Setting up libosmocodec4:amd64 (1.14.1.20.6ba7f.202608191800) ... Setting up libosmovty13:amd64 (1.14.1.20.6ba7f.202608191800) ... Setting up libosmoisdn0:amd64 (1.14.1.20.6ba7f.202608191800) ... Setting up libosmousb0:amd64 (1.14.1.20.6ba7f.202608191800) ... Setting up libosmogsm20:amd64 (1.14.1.20.6ba7f.202608191800) ... Setting up libosmoctrl0:amd64 (1.14.1.20.6ba7f.202608191800) ... Setting up libosmogb14:amd64 (1.14.1.20.6ba7f.202608191800) ... Setting up libosmonetif11:amd64 (1.7.0.17.96f9.202608191800) ... Setting up libosmocoding0:amd64 (1.14.1.20.6ba7f.202608191800) ... Setting up libosmosim2:amd64 (1.14.1.20.6ba7f.202608191800) ... Setting up libosmocore (1.14.1.20.6ba7f.202608191800) ... Setting up libosmocore-dev:amd64 (1.14.1.20.6ba7f.202608191800) ... Setting up libosmo-netif-dev:amd64 (1.7.0.17.96f9.202608191800) ... Processing triggers for libc-bin (2.36-9+deb12u14) ... + cd /src/libosmo-abis + [ -e contrib/generate_build_dep.sh ] + /tarballs/prefer-configure.sh libosmo-abis 2.2.0 + PROJECT=libosmo-abis + TAG=2.2.0 + [ -e configure.ac ] + exit 0 + su build -c autoreconf -fi libtoolize: putting auxiliary files in AC_CONFIG_AUX_DIR, '.'. libtoolize: copying file './ltmain.sh' libtoolize: putting macros in AC_CONFIG_MACRO_DIRS, 'm4'. libtoolize: copying file 'm4/libtool.m4' libtoolize: copying file 'm4/ltoptions.m4' libtoolize: copying file 'm4/ltsugar.m4' libtoolize: copying file 'm4/ltversion.m4' libtoolize: copying file 'm4/lt~obsolete.m4' configure.ac:67: warning: 'AM_CONFIG_HEADER': this macro is obsolete. configure.ac:67: You should use the 'AC_CONFIG_HEADERS' macro instead. ./lib/autoconf/general.m4:2434: AC_DIAGNOSE is expanded from... aclocal.m4:1089: AM_CONFIG_HEADER is expanded from... configure.ac:67: the top level configure.ac:91: warning: The macro `AC_HELP_STRING' is obsolete. configure.ac:91: You should run autoupdate. ./lib/autoconf/general.m4:204: AC_HELP_STRING is expanded from... configure.ac:91: the top level configure.ac:200: warning: AC_OUTPUT should be used without arguments. configure.ac:200: You should run autoupdate. configure.ac:22: installing './compile' configure.ac:24: installing './config.guess' configure.ac:24: installing './config.sub' configure.ac:8: installing './install-sh' configure.ac:8: installing './missing' doc/examples/Makefile.am: installing './depcomp' + su build -c ./configure checking for a BSD-compatible install... /usr/bin/install -c checking whether build environment is sane... yes checking for a race-free mkdir -p... /usr/bin/mkdir -p checking for gawk... gawk checking whether make sets $(MAKE)... yes checking whether make supports nested variables... yes checking whether make supports nested variables... (cached) yes checking whether make sets $(MAKE)... (cached) yes checking for gcc... gcc checking whether the C compiler works... yes checking for C compiler default output file name... a.out checking for suffix of executables... checking whether we are cross compiling... no checking for suffix of object files... o checking whether the compiler supports GNU C... yes checking whether gcc accepts -g... yes checking for gcc option to enable C11 features... none needed checking whether gcc understands -c and -o together... yes checking whether make supports the include directive... yes (GNU style) checking dependency style of gcc... gcc3 checking build system type... x86_64-pc-linux-gnu checking host system type... x86_64-pc-linux-gnu checking how to print strings... printf checking for a sed that does not truncate output... /usr/bin/sed checking for grep that handles long lines and -e... /usr/bin/grep checking for egrep... /usr/bin/grep -E checking for fgrep... /usr/bin/grep -F checking for ld used by gcc... /usr/bin/ld checking if the linker (/usr/bin/ld) is GNU ld... yes checking for BSD- or MS-compatible name lister (nm)... /usr/bin/nm -B checking the name lister (/usr/bin/nm -B) interface... BSD nm checking whether ln -s works... yes checking the maximum length of command line arguments... 1572864 checking how to convert x86_64-pc-linux-gnu file names to x86_64-pc-linux-gnu format... func_convert_file_noop checking how to convert x86_64-pc-linux-gnu file names to toolchain format... func_convert_file_noop checking for /usr/bin/ld option to reload object files... -r checking for file... file checking for objdump... objdump checking how to recognize dependent libraries... pass_all checking for dlltool... no checking how to associate runtime and link libraries... printf %s\n checking for ar... ar checking for archiver @FILE support... @ checking for strip... strip checking for ranlib... ranlib checking command to parse /usr/bin/nm -B output from gcc object... ok checking for sysroot... no checking for a working dd... /usr/bin/dd checking how to truncate binary pipes... /usr/bin/dd bs=4096 count=1 checking for mt... no checking if : is a manifest tool... no checking for stdio.h... yes checking for stdlib.h... yes checking for string.h... yes checking for inttypes.h... yes checking for stdint.h... yes checking for strings.h... yes checking for sys/stat.h... yes checking for sys/types.h... yes checking for unistd.h... yes checking for dlfcn.h... yes checking for objdir... .libs checking if gcc supports -fno-rtti -fno-exceptions... no checking for gcc option to produce PIC... -fPIC -DPIC checking if gcc PIC flag -fPIC -DPIC works... yes checking if gcc static flag -static works... yes checking if gcc supports -c -o file.o... yes checking if gcc supports -c -o file.o... (cached) yes checking whether the gcc linker (/usr/bin/ld -m elf_x86_64) supports shared libraries... yes checking whether -lc should be explicitly linked in... no checking dynamic linker characteristics... GNU/Linux ld.so checking how to hardcode library paths into programs... immediate checking whether stripping libraries is possible... yes checking if libtool supports shared libraries... yes checking whether to build shared libraries... yes checking whether to build static libraries... yes checking for pkg-config... /usr/bin/pkg-config checking for pkg-config... /usr/bin/pkg-config checking pkg-config is at least version 0.20... yes checking if gcc supports -fvisibility=hidden... yes checking for libosmocore >= 1.14.2... no configure: error: Package requirements (libosmocore >= 1.14.2) were not met: Package dependency requirement 'libosmocore >= 1.14.2' could not be satisfied. Package 'libosmocore' has version '1.14.1.20-6ba7f.202608191800', required version is '>= 1.14.2' Consider adjusting the PKG_CONFIG_PATH environment variable if you installed software in a non-standard prefix. Alternatively, you may set the environment variables LIBOSMOCORE_CFLAGS and LIBOSMOCORE_LIBS to avoid the need to call pkg-config. See the pkg-config man page for more details. :: (libosmo-abis, 2.2.0) Building tarball failed! Build step 'Execute shell' marked build as failure $ ssh-agent -k unset SSH_AUTH_SOCK; unset SSH_AGENT_PID; echo Agent pid 1960068 killed; [ssh-agent] Stopped.
1
4
0
0
Build failed in Jenkins: ttcn3-sccp-test-latest #1523
by jenkins@lists.osmocom.org
21 Aug '26
21 Aug '26
See <
https://jenkins.osmocom.org/jenkins/job/ttcn3-sccp-test-latest/1523/display…
> Changes: [Pau Espin Pedrol] sgsn: Fail in obvious way when unexpected ServiceAccept is received [Oliver Smith] testenv: subprocess.run with explicit check=False [Oliver Smith] smdpp/generate_all_test_certificates: use f-string [Oliver Smith] testenv: remove *args from various functions [Oliver Smith] testenv: various small syntax tweaks ------------------------------------------ [...truncated 64.01 KiB...] Get:14
https://downloads.osmocom.org/packages/osmocom:/latest/Debian_13
./ libosmocore 1.14.1 [47.2 kB] Get:15
https://downloads.osmocom.org/packages/osmocom:/latest/Debian_13
./ libosmocore-dev 1.14.1 [860 kB] Get:16
https://downloads.osmocom.org/packages/osmocom:/latest/Debian_13
./ libosmonetif11 1.7.0 [69.9 kB] Get:17
https://downloads.osmocom.org/packages/osmocom:/latest/Debian_13
./ libosmo-netif-dev 1.7.0 [88.1 kB] Get:18
https://downloads.osmocom.org/packages/osmocom:/latest/Debian_13
./ libosmocore-dbg 1.14.1 [2212 kB] Fetched 11.8 MB in 0s (72.7 MB/s) Selecting previously unselected package libc6-dbg:amd64. (Reading database ... (Reading database ... 5%(Reading database ... 10%(Reading database ... 15%(Reading database ... 20%(Reading database ... 25%(Reading database ... 30%(Reading database ... 35%(Reading database ... 40%(Reading database ... 45%(Reading database ... 50%(Reading database ... 55%(Reading database ... 60%(Reading database ... 65%(Reading database ... 70%(Reading database ... 75%(Reading database ... 80%(Reading database ... 85%(Reading database ... 90%(Reading database ... 95%(Reading database ... 100%(Reading database ... 44387 files and directories currently installed.) Preparing to unpack .../00-libc6-dbg_2.41-12+deb13u3_amd64.deb ... Unpacking libc6-dbg:amd64 (2.41-12+deb13u3) ... Selecting previously unselected package osmocom-keyring. Preparing to unpack .../01-osmocom-keyring_1.1.1_amd64.deb ... Unpacking osmocom-keyring (1.1.1) ... Selecting previously unselected package osmocom-latest. Preparing to unpack .../02-osmocom-latest_1.1.0_amd64.deb ... Unpacking osmocom-latest (1.1.0) ... Selecting previously unselected package libosmocore22:amd64. Preparing to unpack .../03-libosmocore22_1.14.1_amd64.deb ... Unpacking libosmocore22:amd64 (1.14.1) ... Selecting previously unselected package libosmocodec4:amd64. Preparing to unpack .../04-libosmocodec4_1.14.1_amd64.deb ... Unpacking libosmocodec4:amd64 (1.14.1) ... Selecting previously unselected package libosmoisdn0:amd64. Preparing to unpack .../05-libosmoisdn0_1.14.1_amd64.deb ... Unpacking libosmoisdn0:amd64 (1.14.1) ... Selecting previously unselected package libosmogsm20:amd64. Preparing to unpack .../06-libosmogsm20_1.14.1_amd64.deb ... Unpacking libosmogsm20:amd64 (1.14.1) ... Selecting previously unselected package libosmocoding0:amd64. Preparing to unpack .../07-libosmocoding0_1.14.1_amd64.deb ... Unpacking libosmocoding0:amd64 (1.14.1) ... Selecting previously unselected package libosmovty13:amd64. Preparing to unpack .../08-libosmovty13_1.14.1_amd64.deb ... Unpacking libosmovty13:amd64 (1.14.1) ... Selecting previously unselected package libosmogb14:amd64. Preparing to unpack .../09-libosmogb14_1.14.1_amd64.deb ... Unpacking libosmogb14:amd64 (1.14.1) ... Selecting previously unselected package libosmoctrl0:amd64. Preparing to unpack .../10-libosmoctrl0_1.14.1_amd64.deb ... Unpacking libosmoctrl0:amd64 (1.14.1) ... Selecting previously unselected package libosmosim2:amd64. Preparing to unpack .../11-libosmosim2_1.14.1_amd64.deb ... Unpacking libosmosim2:amd64 (1.14.1) ... Selecting previously unselected package libosmousb0:amd64. Preparing to unpack .../12-libosmousb0_1.14.1_amd64.deb ... Unpacking libosmousb0:amd64 (1.14.1) ... Selecting previously unselected package libosmocore. Preparing to unpack .../13-libosmocore_1.14.1_amd64.deb ... Unpacking libosmocore (1.14.1) ... Selecting previously unselected package libosmocore-dev:amd64. Preparing to unpack .../14-libosmocore-dev_1.14.1_amd64.deb ... Unpacking libosmocore-dev:amd64 (1.14.1) ... Selecting previously unselected package libosmonetif11:amd64. Preparing to unpack .../15-libosmonetif11_1.7.0_amd64.deb ... Unpacking libosmonetif11:amd64 (1.7.0) ... Selecting previously unselected package libosmo-netif-dev:amd64. Preparing to unpack .../16-libosmo-netif-dev_1.7.0_amd64.deb ... Unpacking libosmo-netif-dev:amd64 (1.7.0) ... Selecting previously unselected package libosmocore-dbg:amd64. Preparing to unpack .../17-libosmocore-dbg_1.14.1_amd64.deb ... Unpacking libosmocore-dbg:amd64 (1.14.1) ... Setting up libc6-dbg:amd64 (2.41-12+deb13u3) ... Setting up osmocom-keyring (1.1.1) ... Setting up osmocom-latest (1.1.0) ... Setting up libosmocore22:amd64 (1.14.1) ... Setting up libosmocodec4:amd64 (1.14.1) ... Setting up libosmovty13:amd64 (1.14.1) ... Setting up libosmoisdn0:amd64 (1.14.1) ... Setting up libosmousb0:amd64 (1.14.1) ... Setting up libosmogsm20:amd64 (1.14.1) ... Setting up libosmoctrl0:amd64 (1.14.1) ... Setting up libosmogb14:amd64 (1.14.1) ... Setting up libosmonetif11:amd64 (1.7.0) ... Setting up libosmocoding0:amd64 (1.14.1) ... Setting up libosmosim2:amd64 (1.14.1) ... Setting up libosmocore (1.14.1) ... Setting up libosmocore-dbg:amd64 (1.14.1) ... Setting up libosmocore-dev:amd64 (1.14.1) ... Setting up libosmo-netif-dev:amd64 (1.7.0) ... Processing triggers for libc-bin (2.41-12+deb13u3) ... [0;94m[testenv] + ['git', 'ls-remote', '--tags', '
https://gerrit.osmocom.org/libosmo-sigtran
'][0m [1;34m[testenv] libosmo-sigtran: cloning 2.3.0[0m [0;94m[testenv] + ['git', '-c', 'advice.detachedHead=false', '-C', '<
https://jenkins.osmocom.org/jenkins/job/ttcn3-sccp-test-latest/ws/_cache/gi…
',> 'clone', '--depth', '1', '--branch', '2.3.0', '
https://gerrit.osmocom.org/libosmo-sigtran
'][0m Cloning into 'libosmo-sigtran'... [1;34m[testenv] libosmo-sigtran: showing current commit[0m [0;94m[testenv] + ['git', '-P', '-C', '<
https://jenkins.osmocom.org/jenkins/job/ttcn3-sccp-test-latest/ws/_cache/gi…
',> '-c', 'color.ui=always', 'log', '-1', '--oneline'][0m [33m121209d[m Bump version: 2.2.1.133-20bc-dirty → 2.3.0 [1;34m[testenv] Building sccp_demo_user[0m [0;94m[testenv] + ['podman', 'exec', '-e', 'CCACHE_DIR=/home/osmocom-build/ccache/testenv', '-e', 'TESTENV_CACHE_DIR=<
https://jenkins.osmocom.org/jenkins/job/ttcn3-sccp-test-latest/ws/_cache
',> '-e', 'TESTENV_SRC_DIR=/home/osmocom-build/jenkins/workspace', '-e', 'TESTENV_INSTALL_DIR=/', '-e', 'TERM=dumb', '-e', 'PATH=<
https://jenkins.osmocom.org/jenkins/job/ttcn3-sccp-test-latest/ws/_testenv/…
>:<
https://jenkins.osmocom.org/jenkins/job/ttcn3-sccp-test-latest/ws/_testenv/…
>:<
https://jenkins.osmocom.org/jenkins/job/ttcn3-sccp-test-latest/ws/sccp
>:/usr/local/bin:/usr/sbin:/usr/bin:/sbin:/bin', '-e', 'HOME=/home/osmocom-build', '-e', 'PYTHONUNBUFFERED=1', '-t', '-w', '<
https://jenkins.osmocom.org/jenkins/job/ttcn3-sccp-test-latest/ws/_cache/gi…
',> 'testenv-sccp-osmocom-latest-20260820-1309-363710b0-1', 'autoreconf', '-fi'][0m libtoolize: putting auxiliary files in AC_CONFIG_AUX_DIR, '.'. libtoolize: copying file './ltmain.sh' libtoolize: Consider adding 'AC_CONFIG_MACRO_DIRS([m4])' to configure.ac, libtoolize: and rerunning libtoolize and aclocal. libtoolize: Consider adding '-I m4' to ACLOCAL_AMFLAGS in Makefile.am. configure.ac:45: warning: The macro 'AC_CONFIG_HEADER' is obsolete. configure.ac:45: You should run autoupdate. ./lib/autoconf/status.m4:719: AC_CONFIG_HEADER is expanded from... configure.ac:45: the top level configure.ac:182: warning: The macro 'AC_HELP_STRING' is obsolete. configure.ac:182: You should run autoupdate. ./lib/autoconf/general.m4:204: AC_HELP_STRING is expanded from... configure.ac:182: the top level configure.ac:199: warning: AC_OUTPUT should be used without arguments. configure.ac:199: You should run autoupdate. configure.ac:23: installing './compile' configure.ac:25: installing './config.guess' configure.ac:25: installing './config.sub' configure.ac:9: installing './install-sh' configure.ac:9: installing './missing' examples/Makefile.am: installing './depcomp' include/osmocom/sigtran/Makefile.am:2: warning: dir $@: non-POSIX variable name include/osmocom/sigtran/Makefile.am:2: (probably a GNU make extension) [0;94m[testenv] + ['podman', 'exec', '-e', 'CCACHE_DIR=/home/osmocom-build/ccache/testenv', '-e', 'TESTENV_CACHE_DIR=<
https://jenkins.osmocom.org/jenkins/job/ttcn3-sccp-test-latest/ws/_cache
',> '-e', 'TESTENV_SRC_DIR=/home/osmocom-build/jenkins/workspace', '-e', 'TESTENV_INSTALL_DIR=/', '-e', 'TERM=dumb', '-e', 'PATH=<
https://jenkins.osmocom.org/jenkins/job/ttcn3-sccp-test-latest/ws/_testenv/…
>:<
https://jenkins.osmocom.org/jenkins/job/ttcn3-sccp-test-latest/ws/_testenv/…
>:<
https://jenkins.osmocom.org/jenkins/job/ttcn3-sccp-test-latest/ws/sccp
>:/usr/local/bin:/usr/sbin:/usr/bin:/sbin:/bin', '-e', 'HOME=/home/osmocom-build', '-e', 'PYTHONUNBUFFERED=1', '-t', '-w', '<
https://jenkins.osmocom.org/jenkins/job/ttcn3-sccp-test-latest/ws/_cache/gi…
',> 'testenv-sccp-osmocom-latest-20260820-1309-363710b0-1', './configure'][0m checking for a BSD-compatible install... /usr/bin/install -c checking whether sleep supports fractional seconds... yes checking filesystem timestamp resolution... 0.01 checking whether build environment is sane... yes checking for a race-free mkdir -p... /usr/bin/mkdir -p checking for gawk... no checking for mawk... mawk checking whether make sets $(MAKE)... yes checking whether make supports nested variables... yes checking xargs -n works... yes checking whether make sets $(MAKE)... (cached) yes checking for gcc... gcc checking whether the C compiler works... yes checking for C compiler default output file name... a.out checking for suffix of executables... checking whether we are cross compiling... no checking for suffix of object files... o checking whether the compiler supports GNU C... yes checking whether gcc accepts -g... yes checking for gcc option to enable C11 features... none needed checking whether gcc understands -c and -o together... yes checking whether make supports the include directive... yes (GNU style) checking dependency style of gcc... gcc3 checking build system type... x86_64-pc-linux-gnu checking host system type... x86_64-pc-linux-gnu checking how to print strings... printf checking for a sed that does not truncate output... /usr/bin/sed checking for grep that handles long lines and -e... /usr/bin/grep checking for egrep... /usr/bin/grep -E checking for fgrep... /usr/bin/grep -F checking for ld used by gcc... /usr/bin/ld checking if the linker (/usr/bin/ld) is GNU ld... yes checking for BSD- or MS-compatible name lister (nm)... /usr/bin/nm -B checking the name lister (/usr/bin/nm -B) interface... BSD nm checking whether ln -s works... yes checking the maximum length of command line arguments... 1572864 checking how to convert x86_64-pc-linux-gnu file names to x86_64-pc-linux-gnu format... func_convert_file_noop checking how to convert x86_64-pc-linux-gnu file names to toolchain format... func_convert_file_noop checking for /usr/bin/ld option to reload object files... -r checking for file... file checking for objdump... objdump checking how to recognize dependent libraries... pass_all checking for dlltool... no checking how to associate runtime and link libraries... printf %s\n checking for ranlib... ranlib checking for ar... ar checking for archiver @FILE support... @ checking for strip... strip checking command to parse /usr/bin/nm -B output from gcc object... ok checking for sysroot... no checking for a working dd... /usr/bin/dd checking how to truncate binary pipes... /usr/bin/dd bs=4096 count=1 checking for mt... mt checking if mt is a manifest tool... no checking for stdio.h... yes checking for stdlib.h... yes checking for string.h... yes checking for inttypes.h... yes checking for stdint.h... yes checking for strings.h... yes checking for sys/stat.h... yes checking for sys/types.h... yes checking for unistd.h... yes checking for dlfcn.h... yes checking for objdir... .libs checking if gcc supports -fno-rtti -fno-exceptions... no checking for gcc option to produce PIC... -fPIC -DPIC checking if gcc PIC flag -fPIC -DPIC works... yes checking if gcc static flag -static works... yes checking if gcc supports -c -o file.o... yes checking if gcc supports -c -o file.o... (cached) yes checking whether the gcc linker (/usr/bin/ld -m elf_x86_64) supports shared libraries... yes checking whether -lc should be explicitly linked in... no checking dynamic linker characteristics... GNU/Linux ld.so checking how to hardcode library paths into programs... immediate checking whether stripping libraries is possible... yes checking if libtool supports shared libraries... yes checking whether to build shared libraries... yes checking whether to build static libraries... yes checking for pkg-config... /usr/bin/pkg-config checking for pkg-config... /usr/bin/pkg-config checking pkg-config is at least version 0.20... yes checking for libosmocore >= 1.14.2... no configure: error: Package requirements (libosmocore >= 1.14.2) were not met: Package dependency requirement 'libosmocore >= 1.14.2' could not be satisfied. Package 'libosmocore' has version '1.14.1', required version is '>= 1.14.2' Consider adjusting the PKG_CONFIG_PATH environment variable if you installed software in a non-standard prefix. Alternatively, you may set the environment variables LIBOSMOCORE_CFLAGS and LIBOSMOCORE_LIBS to avoid the need to call pkg-config. See the pkg-config man page for more details. [1;91m[testenv] Command failed unexpectedly[0m [0;94m[testenv] Command: ['podman', 'exec', '-e', 'CCACHE_DIR=/home/osmocom-build/ccache/testenv', '-e', 'TESTENV_CACHE_DIR=<
https://jenkins.osmocom.org/jenkins/job/ttcn3-sccp-test-latest/ws/_cache
',> '-e', 'TESTENV_SRC_DIR=/home/osmocom-build/jenkins/workspace', '-e', 'TESTENV_INSTALL_DIR=/', '-e', 'TERM=dumb', '-e', 'PATH=<
https://jenkins.osmocom.org/jenkins/job/ttcn3-sccp-test-latest/ws/_testenv/…
>:<
https://jenkins.osmocom.org/jenkins/job/ttcn3-sccp-test-latest/ws/_testenv/…
>:<
https://jenkins.osmocom.org/jenkins/job/ttcn3-sccp-test-latest/ws/sccp
>:/usr/local/bin:/usr/sbin:/usr/bin:/sbin:/bin', '-e', 'HOME=/home/osmocom-build', '-e', 'PYTHONUNBUFFERED=1', '-t', '-w', '<
https://jenkins.osmocom.org/jenkins/job/ttcn3-sccp-test-latest/ws/_cache/gi…
',> 'testenv-sccp-osmocom-latest-20260820-1309-363710b0-1', './configure'][0m [0;94m[testenv] Returncode: 1[0m [1;34m[testenv] Stopping podman container[0m [0;94m[testenv] + ['podman', 'kill', 'testenv-sccp-osmocom-latest-20260820-1309-363710b0-1'][0m testenv-sccp-osmocom-latest-20260820-1309-363710b0-1 Traceback (most recent call last): File "<
https://jenkins.osmocom.org/jenkins/job/ttcn3-sccp-test-latest/ws/./testenv…
",> line 135, in <module> main() File "<
https://jenkins.osmocom.org/jenkins/job/ttcn3-sccp-test-latest/ws/./testenv…
",> line 124, in main run() File "<
https://jenkins.osmocom.org/jenkins/job/ttcn3-sccp-test-latest/ws/./testenv…
",> line 73, in run testenv.podman_install.packages(cfg, cfg_name) File "<
https://jenkins.osmocom.org/jenkins/job/ttcn3-sccp-test-latest/ws/_testenv/…
",> line 231, in packages from_source(cfg, cfg_name, section) File "<
https://jenkins.osmocom.org/jenkins/job/ttcn3-sccp-test-latest/ws/_testenv/…
",> line 208, in from_source return from_source_sccp_demo_user() ^^^^^^^^^^^^^^^^^^^^^^^^^^^^ File "<
https://jenkins.osmocom.org/jenkins/job/ttcn3-sccp-test-latest/ws/_testenv/…
",> line 170, in from_source_sccp_demo_user testenv.cmd.run(configure_cmd, cwd=sccp_dir) File "<
https://jenkins.osmocom.org/jenkins/job/ttcn3-sccp-test-latest/ws/_testenv/…
",> line 127, in run return testenv.podman.exec_cmd(cmd, check=check, env=env, **kwargs) ^^^^^^^^^^^^^^^^^^^^^^^^^^^^^^^^^^^^^^^^^^^^^^^^^^^^^^^^^^^^ File "<
https://jenkins.osmocom.org/jenkins/job/ttcn3-sccp-test-latest/ws/_testenv/…
",> line 156, in exec_cmd return testenv.cmd.run( ^^^^^^^^^^^^^^^^ File "<
https://jenkins.osmocom.org/jenkins/job/ttcn3-sccp-test-latest/ws/_testenv/…
",> line 144, in run exit_error_cmd(p, "Command failed unexpectedly") File "<
https://jenkins.osmocom.org/jenkins/job/ttcn3-sccp-test-latest/ws/_testenv/…
",> line 88, in exit_error_cmd raise RuntimeError("shell command related error, find details right above this python trace") RuntimeError: shell command related error, find details right above this python trace [0;94m[testenv] feed_watchdog_loop: podman container has stopped[0m [1;34m[testenv] Logs saved to:
https://jenkins.osmocom.org/jenkins/job/ttcn3-sccp-test-latest/1523/artifac…
[0m + RC=1 + [ 1 = 0 ] + + uptime grep --color=always -o load.* [01;31m[Kload average: 1.62, 1.61, 3.88[m[K + exit 1 Build step 'Execute shell' marked build as failure Recording test results ERROR: Step ‘Publish JUnit test result report’ failed: No test report files were found. Configuration error?
1
1
0
0
Jenkins build is back to stable : ttcn3-stp-test-latest #2469
by jenkins@lists.osmocom.org
21 Aug '26
21 Aug '26
See <
https://jenkins.osmocom.org/jenkins/job/ttcn3-stp-test-latest/2469/display/…
>
1
0
0
0
Build failed in Jenkins: ttcn3-msc-test #3222
by jenkins@lists.osmocom.org
21 Aug '26
21 Aug '26
See <
https://jenkins.osmocom.org/jenkins/job/ttcn3-msc-test/3222/display/redirec…
> Changes: [Pau Espin Pedrol] sgsn: Fail in obvious way when unexpected ServiceAccept is received [Oliver Smith] testenv: subprocess.run with explicit check=False [Oliver Smith] smdpp/generate_all_test_certificates: use f-string [Oliver Smith] testenv: remove *args from various functions [Oliver Smith] testenv: various small syntax tweaks ------------------------------------------ [...truncated 210.57 KiB...] CCLD MAP_SS_Code_part_7.so CCLD MAP_SS_DataTypes_part_1.so CCLD MAP_SS_DataTypes_part_2.so CCLD MAP_SS_DataTypes_part_3.so CCLD MAP_SS_DataTypes_part_4.so CCLD MAP_SS_DataTypes_part_5.so CCLD MAP_SS_DataTypes_part_6.so CCLD MAP_SS_DataTypes_part_7.so CCLD MAP_ShortMessageServiceOperations_part_1.so CCLD MAP_ShortMessageServiceOperations_part_2.so CCLD MAP_ShortMessageServiceOperations_part_3.so CCLD MAP_ShortMessageServiceOperations_part_4.so CCLD MAP_ShortMessageServiceOperations_part_5.so CCLD MAP_ShortMessageServiceOperations_part_6.so CCLD MAP_ShortMessageServiceOperations_part_7.so CCLD MAP_SupplementaryServiceOperations_part_1.so CCLD MAP_SupplementaryServiceOperations_part_2.so CCLD MAP_SupplementaryServiceOperations_part_3.so CCLD MAP_SupplementaryServiceOperations_part_4.so CCLD MAP_SupplementaryServiceOperations_part_5.so CCLD MAP_SupplementaryServiceOperations_part_6.so CCLD MAP_SupplementaryServiceOperations_part_7.so CCLD MAP_TS_Code_part_1.so CCLD MAP_TS_Code_part_2.so CCLD MAP_TS_Code_part_3.so CCLD MAP_TS_Code_part_4.so CCLD MAP_TS_Code_part_5.so CCLD MAP_TS_Code_part_6.so CCLD MAP_TS_Code_part_7.so CCLD MobileDomainDefinitions_part_1.so CCLD MobileDomainDefinitions_part_2.so CCLD MobileDomainDefinitions_part_3.so CCLD MobileDomainDefinitions_part_4.so CCLD MobileDomainDefinitions_part_5.so CCLD MobileDomainDefinitions_part_6.so CCLD MobileDomainDefinitions_part_7.so CCLD RANAP_CommonDataTypes_part_1.so CCLD RANAP_CommonDataTypes_part_2.so CCLD RANAP_CommonDataTypes_part_3.so CCLD RANAP_CommonDataTypes_part_4.so CCLD RANAP_CommonDataTypes_part_5.so CCLD RANAP_CommonDataTypes_part_6.so CCLD RANAP_CommonDataTypes_part_7.so CCLD RANAP_Constants_part_1.so CCLD RANAP_Constants_part_2.so CCLD RANAP_Constants_part_3.so CCLD RANAP_Constants_part_4.so CCLD RANAP_Constants_part_5.so CCLD RANAP_Constants_part_6.so CCLD RANAP_Constants_part_7.so CCLD RANAP_Containers_part_1.so CCLD RANAP_Containers_part_2.so CCLD RANAP_Containers_part_3.so CCLD RANAP_Containers_part_4.so CCLD RANAP_Containers_part_5.so CCLD RANAP_Containers_part_6.so CCLD RANAP_Containers_part_7.so CCLD RANAP_IEs_part_1.so CCLD RANAP_IEs_part_2.so CCLD RANAP_IEs_part_3.so CCLD RANAP_IEs_part_4.so CCLD RANAP_IEs_part_5.so CCLD RANAP_IEs_part_6.so CCLD RANAP_IEs_part_7.so CCLD RANAP_PDU_Contents_part_1.so CCLD RANAP_PDU_Contents_part_2.so CCLD RANAP_PDU_Contents_part_3.so CCLD RANAP_PDU_Contents_part_4.so CCLD RANAP_PDU_Contents_part_5.so CCLD RANAP_PDU_Contents_part_6.so CCLD RANAP_PDU_Contents_part_7.so CCLD RANAP_PDU_Descriptions_part_1.so CCLD RANAP_PDU_Descriptions_part_2.so CCLD RANAP_PDU_Descriptions_part_3.so CCLD RANAP_PDU_Descriptions_part_4.so CCLD RANAP_PDU_Descriptions_part_5.so CCLD RANAP_PDU_Descriptions_part_6.so CCLD RANAP_PDU_Descriptions_part_7.so CCLD Remote_Operations_Generic_ROS_PDUs_part_1.so CCLD Remote_Operations_Generic_ROS_PDUs_part_2.so CCLD Remote_Operations_Generic_ROS_PDUs_part_3.so CCLD Remote_Operations_Generic_ROS_PDUs_part_4.so CCLD Remote_Operations_Generic_ROS_PDUs_part_5.so CCLD Remote_Operations_Generic_ROS_PDUs_part_6.so CCLD Remote_Operations_Generic_ROS_PDUs_part_7.so CCLD Remote_Operations_Information_Objects_part_1.so CCLD Remote_Operations_Information_Objects_part_2.so CCLD Remote_Operations_Information_Objects_part_3.so CCLD Remote_Operations_Information_Objects_part_4.so CCLD Remote_Operations_Information_Objects_part_5.so CCLD Remote_Operations_Information_Objects_part_6.so CCLD Remote_Operations_Information_Objects_part_7.so CCLD SS_DataTypes_part_1.so CCLD SS_DataTypes_part_2.so CCLD SS_DataTypes_part_3.so CCLD SS_DataTypes_part_4.so CCLD SS_DataTypes_part_5.so CCLD SS_DataTypes_part_6.so CCLD SS_DataTypes_part_7.so CCLD SS_Errors_part_2.so CCLD SS_Errors_part_1.so CCLD SS_Errors_part_3.so CCLD SS_Errors_part_4.so CCLD SS_Errors_part_5.so CCLD SS_Errors_part_6.so CCLD SS_Errors_part_7.so CCLD SS_Operations_part_1.so CCLD SS_Operations_part_2.so CCLD SS_Operations_part_3.so CCLD SS_Operations_part_4.so CCLD SS_Operations_part_5.so CCLD SS_Operations_part_6.so CCLD SS_Operations_part_7.so CCLD SS_PDU_Defs_part_1.so CCLD SS_PDU_Defs_part_2.so CCLD SS_PDU_Defs_part_3.so CCLD SS_PDU_Defs_part_4.so CCLD SS_PDU_Defs_part_5.so CCLD SS_PDU_Defs_part_6.so CCLD SS_PDU_Defs_part_7.so CCLD SS_Protocol_part_2.so CCLD SS_Protocol_part_1.so CCLD SS_Protocol_part_3.so CCLD SS_Protocol_part_4.so CCLD SS_Protocol_part_5.so CCLD SS_Protocol_part_7.so CCLD SDP_parse_.tab.so CCLD SS_Protocol_part_6.so CCLD lex.SDP_parse_.so CCLD IPA_CodecPort_CtrlFunctDef.so CCLD IPL4asp_PT.so CCLD IPL4asp_discovery.so CCLD MAP_EncDec.so CCLD MGCP_CodecPort_CtrlFunctDef.so CCLD MNCC_EncDec.so CCLD Native_FunctionDefs.so CCLD RANAP_EncDec.so CCLD RTP_CodecPort_CtrlFunctDef.so CCLD RTP_EncDec.so CCLD SCCP_EncDec.so CCLD SCTPasp_PT.so CCLD SDP_EncDec.so CCLD SGsAP_CodecPort_CtrlFunctDef.so CCLD SMPP_CodecPort_CtrlFunctDef.so CCLD SMPP_EncDec.so CCLD StatsD_CodecPort_CtrlFunctdef.so CCLD SS_EncDec.so CCLD TCCConversion.so CCLD TCCEncoding.so CCLD TCCInterface.so CCLD TCCOpenSecurity.so CCLD TELNETasp_PT.so CCLD UD_PT.so CCLD MSC_Tests make[1]: Leaving directory '<
https://jenkins.osmocom.org/jenkins/job/ttcn3-msc-test/ws/_cache/podman/tit…
'> [1;34m[testenv] Stopping podman container (restart)[0m [0;94m[testenv] + ['podman', 'kill', 'testenv-msc-osmocom-nightly-20260821-1032-0968e843-0'][0m testenv-msc-osmocom-nightly-20260821-1032-0968e843-0 [0;94m[testenv] + ['podman', 'run', '--rm', '--name', 'testenv-msc-osmocom-nightly-20260821-1032-0968e843-1', '--log-driver', 'json-file', '--log-opt', 'path=<
https://jenkins.osmocom.org/jenkins/job/ttcn3-msc-test/3222/artifact/logs/p…
',> '--security-opt=seccomp=<
https://jenkins.osmocom.org/jenkins/job/ttcn3-msc-test/ws/_testenv/data/pod…
',> '--cap-add=NET_ADMIN', '--cap-add=NET_RAW', '--cap-add=SYS_ADMIN', '--device=/dev/net/tun', '--volume', '<
https://jenkins.osmocom.org/jenkins/job/ttcn3-msc-test/ws/_cache/podman/var…
>:/var/cache/apt', '--volume', '<
https://jenkins.osmocom.org/jenkins/job/ttcn3-msc-test/ws/_cache/podman/var…
>:/var/lib/apt', '--sysctl', 'net.ipv4.conf.all.send_redirects=0', '--sysctl', 'net.ipv4.conf.default.send_redirects=0', '-e', 'PODMAN=1', '-e', 'HOST_USER=osmocom-build', '-e', 'TESTENV_BINARY_REPO=1', '--volume', '<
https://jenkins.osmocom.org/jenkins/job/ttcn3-msc-test/ws/logs
>:<
https://jenkins.osmocom.org/jenkins/job/ttcn3-msc-test/ws/logs
',> '--volume', '<
https://jenkins.osmocom.org/jenkins/job/ttcn3-msc-test/ws/_cache
>:<
https://jenkins.osmocom.org/jenkins/job/ttcn3-msc-test/ws/_cache
',> '--volume', '/home/osmocom-build/ccache/testenv:/home/osmocom-build/ccache/testenv', '--volume', '/home/osmocom-build/jenkins/workspace:/home/osmocom-build/jenkins/workspace', 'debian-trixie-osmo-ttcn3-testenv', '<
https://jenkins.osmocom.org/jenkins/job/ttcn3-msc-test/ws/_testenv/data/scr…
'][0m> [0;94m[testenv] feed_watchdog_loop: podman container has stopped[0m Running testenv-podman-main.sh [0;94m[testenv] + ['podman', 'exec', '-e', 'CCACHE_DIR=/home/osmocom-build/ccache/testenv', '-e', 'TESTENV_CACHE_DIR=<
https://jenkins.osmocom.org/jenkins/job/ttcn3-msc-test/ws/_cache
',> '-e', 'TESTENV_SRC_DIR=/home/osmocom-build/jenkins/workspace', '-e', 'TESTENV_INSTALL_DIR=/', '-e', 'TERM=dumb', '-e', 'PATH=<
https://jenkins.osmocom.org/jenkins/job/ttcn3-msc-test/ws/_testenv/data/scr…
>:<
https://jenkins.osmocom.org/jenkins/job/ttcn3-msc-test/ws/_testenv/data/scr…
>:<
https://jenkins.osmocom.org/jenkins/job/ttcn3-msc-test/ws/msc
>:/usr/local/bin:/usr/sbin:/usr/bin:/sbin:/bin', '-e', 'HOME=/home/osmocom-build', '-e', 'PYTHONUNBUFFERED=1', '-t', 'testenv-msc-osmocom-nightly-20260821-1032-0968e843-1', 'rm', '/etc/apt/apt.conf.d/docker-clean'][0m [0;94m[testenv] + ['podman', 'exec', '-e', 'CCACHE_DIR=/home/osmocom-build/ccache/testenv', '-e', 'TESTENV_CACHE_DIR=<
https://jenkins.osmocom.org/jenkins/job/ttcn3-msc-test/ws/_cache
',> '-e', 'TESTENV_SRC_DIR=/home/osmocom-build/jenkins/workspace', '-e', 'TESTENV_INSTALL_DIR=/', '-e', 'TERM=dumb', '-e', 'PATH=<
https://jenkins.osmocom.org/jenkins/job/ttcn3-msc-test/ws/_testenv/data/scr…
>:<
https://jenkins.osmocom.org/jenkins/job/ttcn3-msc-test/ws/_testenv/data/scr…
>:<
https://jenkins.osmocom.org/jenkins/job/ttcn3-msc-test/ws/msc
>:/usr/local/bin:/usr/sbin:/usr/bin:/sbin:/bin', '-e', 'HOME=/home/osmocom-build', '-e', 'PYTHONUNBUFFERED=1', '-t', 'testenv-msc-osmocom-nightly-20260821-1032-0968e843-1', 'sh', '-c', "echo 'deb [signed-by=/obs.key]
https://downloads.osmocom.org/packages/osmocom:/nightly/Debian_13/
./' > /etc/apt/sources.list.d/osmocom.list"][0m [0;94m[testenv] + ['podman', 'exec', '-e', 'CCACHE_DIR=/home/osmocom-build/ccache/testenv', '-e', 'TESTENV_CACHE_DIR=<
https://jenkins.osmocom.org/jenkins/job/ttcn3-msc-test/ws/_cache
',> '-e', 'TESTENV_SRC_DIR=/home/osmocom-build/jenkins/workspace', '-e', 'TESTENV_INSTALL_DIR=/', '-e', 'TERM=dumb', '-e', 'PATH=<
https://jenkins.osmocom.org/jenkins/job/ttcn3-msc-test/ws/_testenv/data/scr…
>:<
https://jenkins.osmocom.org/jenkins/job/ttcn3-msc-test/ws/_testenv/data/scr…
>:<
https://jenkins.osmocom.org/jenkins/job/ttcn3-msc-test/ws/msc
>:/usr/local/bin:/usr/sbin:/usr/bin:/sbin:/bin', '-e', 'HOME=/home/osmocom-build', '-e', 'PYTHONUNBUFFERED=1', '-t', 'testenv-msc-osmocom-nightly-20260821-1032-0968e843-1', 'sh', '-c', 'echo \'Package: *\nPin: origin "
downloads.osmocom.org
"\nPin-Priority: 1100\n\' > /etc/apt/preferences.d/osmocom-apt-pin'][0m [0;94m[testenv] + ['podman', 'exec', '-e', 'CCACHE_DIR=/home/osmocom-build/ccache/testenv', '-e', 'TESTENV_CACHE_DIR=<
https://jenkins.osmocom.org/jenkins/job/ttcn3-msc-test/ws/_cache
',> '-e', 'TESTENV_SRC_DIR=/home/osmocom-build/jenkins/workspace', '-e', 'TESTENV_INSTALL_DIR=/', '-e', 'TERM=dumb', '-e', 'PATH=<
https://jenkins.osmocom.org/jenkins/job/ttcn3-msc-test/ws/_testenv/data/scr…
>:<
https://jenkins.osmocom.org/jenkins/job/ttcn3-msc-test/ws/_testenv/data/scr…
>:<
https://jenkins.osmocom.org/jenkins/job/ttcn3-msc-test/ws/msc
>:/usr/local/bin:/usr/sbin:/usr/bin:/sbin:/bin', '-e', 'HOME=/home/osmocom-build', '-e', 'PYTHONUNBUFFERED=1', '-t', 'testenv-msc-osmocom-nightly-20260821-1032-0968e843-1', 'apt-get', '-q', 'update'][0m Hit:1
http://deb.debian.org/debian
trixie InRelease Hit:2
http://deb.debian.org/debian
trixie-updates InRelease Get:3
https://downloads.osmocom.org/packages/osmocom:/nightly/Debian_13
./ InRelease [1620 B] Hit:4
http://deb.debian.org/debian-security
trixie-security InRelease Get:5
https://downloads.osmocom.org/packages/osmocom:/nightly/Debian_13
./ Packages [200 kB] Fetched 201 kB in 0s (1880 kB/s) Reading package lists... [0;94m[testenv] + ['podman', 'exec', '-e', 'CCACHE_DIR=/home/osmocom-build/ccache/testenv', '-e', 'TESTENV_CACHE_DIR=<
https://jenkins.osmocom.org/jenkins/job/ttcn3-msc-test/ws/_cache
',> '-e', 'TESTENV_SRC_DIR=/home/osmocom-build/jenkins/workspace', '-e', 'TESTENV_INSTALL_DIR=/', '-e', 'TERM=dumb', '-e', 'PATH=<
https://jenkins.osmocom.org/jenkins/job/ttcn3-msc-test/ws/_testenv/data/scr…
>:<
https://jenkins.osmocom.org/jenkins/job/ttcn3-msc-test/ws/_testenv/data/scr…
>:<
https://jenkins.osmocom.org/jenkins/job/ttcn3-msc-test/ws/msc
>:/usr/local/bin:/usr/sbin:/usr/bin:/sbin:/bin', '-e', 'HOME=/home/osmocom-build', '-e', 'PYTHONUNBUFFERED=1', '-t', 'testenv-msc-osmocom-nightly-20260821-1032-0968e843-1', 'sh', '-c', 'apt-cache pkgnames | grep -- -dbg > <
https://jenkins.osmocom.org/jenkins/job/ttcn3-msc-test/ws/_cache/podman/dbg…
'][0m> [0;94m[testenv] + ['podman', 'exec', '-e', 'CCACHE_DIR=/home/osmocom-build/ccache/testenv', '-e', 'TESTENV_CACHE_DIR=<
https://jenkins.osmocom.org/jenkins/job/ttcn3-msc-test/ws/_cache
',> '-e', 'TESTENV_SRC_DIR=/home/osmocom-build/jenkins/workspace', '-e', 'TESTENV_INSTALL_DIR=/', '-e', 'TERM=dumb', '-e', 'PATH=<
https://jenkins.osmocom.org/jenkins/job/ttcn3-msc-test/ws/_testenv/data/scr…
>:<
https://jenkins.osmocom.org/jenkins/job/ttcn3-msc-test/ws/_testenv/data/scr…
>:<
https://jenkins.osmocom.org/jenkins/job/ttcn3-msc-test/ws/msc
>:/usr/local/bin:/usr/sbin:/usr/bin:/sbin:/bin', '-e', 'HOME=/home/osmocom-build', '-e', 'PYTHONUNBUFFERED=1', '-t', 'testenv-msc-osmocom-nightly-20260821-1032-0968e843-1', 'apt-rdepends', 'osmo-stp'][0m [0;94m[testenv] osmo-stp -> osmo-stp: installing osmo-stp-dbg[0m [0;94m[testenv] osmo-stp -> libc6: installing libc6-dbg[0m [0;94m[testenv] osmo-stp -> libosmo-sigtran12: installing libosmo-sigtran-dbg[0m [0;94m[testenv] osmo-stp -> libosmo-asn1-tcap1: installing libosmo-asn1-tcap-dbg[0m [0;94m[testenv] osmo-stp -> libosmocore22: installing libosmocore-dbg[0m [0;94m[testenv] + ['podman', 'exec', '-e', 'CCACHE_DIR=/home/osmocom-build/ccache/testenv', '-e', 'TESTENV_CACHE_DIR=<
https://jenkins.osmocom.org/jenkins/job/ttcn3-msc-test/ws/_cache
',> '-e', 'TESTENV_SRC_DIR=/home/osmocom-build/jenkins/workspace', '-e', 'TESTENV_INSTALL_DIR=/', '-e', 'TERM=dumb', '-e', 'PATH=<
https://jenkins.osmocom.org/jenkins/job/ttcn3-msc-test/ws/_testenv/data/scr…
>:<
https://jenkins.osmocom.org/jenkins/job/ttcn3-msc-test/ws/_testenv/data/scr…
>:<
https://jenkins.osmocom.org/jenkins/job/ttcn3-msc-test/ws/msc
>:/usr/local/bin:/usr/sbin:/usr/bin:/sbin:/bin', '-e', 'HOME=/home/osmocom-build', '-e', 'PYTHONUNBUFFERED=1', '-t', 'testenv-msc-osmocom-nightly-20260821-1032-0968e843-1', 'apt-rdepends', 'osmo-msc'][0m [0;94m[testenv] osmo-msc -> osmo-msc: installing osmo-msc-dbg[0m [0;94m[testenv] osmo-msc -> libasn1c1: installing libasn1c-dbg[0m [0;94m[testenv] osmo-msc -> libc6: installing libc6-dbg[0m [0;94m[testenv] osmo-msc -> libosmocore22: installing libosmocore-dbg[0m [0;94m[testenv] osmo-msc -> libosmo-mgcp-client14: installing libosmo-mgcp-client14-dbgsym[0m [0;94m[testenv] osmo-msc -> libosmo-ranap7: installing libosmo-ranap-dbg[0m [0;94m[testenv] osmo-msc -> libosmo-sigtran12: installing libosmo-sigtran-dbg[0m [0;94m[testenv] osmo-msc -> libosmo-asn1-tcap1: installing libosmo-asn1-tcap-dbg[0m [1;34m[testenv] Installing packages: osmo-stp, osmo-msc, osmo-stp-dbg, libc6-dbg, libosmo-sigtran-dbg, libosmo-asn1-tcap-dbg, libosmocore-dbg, osmo-msc-dbg, libasn1c-dbg, libosmo-mgcp-client14-dbgsym, libosmo-ranap-dbg[0m [0;94m[testenv] + ['podman', 'exec', '-e', 'CCACHE_DIR=/home/osmocom-build/ccache/testenv', '-e', 'TESTENV_CACHE_DIR=<
https://jenkins.osmocom.org/jenkins/job/ttcn3-msc-test/ws/_cache
',> '-e', 'TESTENV_SRC_DIR=/home/osmocom-build/jenkins/workspace', '-e', 'TESTENV_INSTALL_DIR=/', '-e', 'TERM=dumb', '-e', 'PATH=<
https://jenkins.osmocom.org/jenkins/job/ttcn3-msc-test/ws/_testenv/data/scr…
>:<
https://jenkins.osmocom.org/jenkins/job/ttcn3-msc-test/ws/_testenv/data/scr…
>:<
https://jenkins.osmocom.org/jenkins/job/ttcn3-msc-test/ws/msc
>:/usr/local/bin:/usr/sbin:/usr/bin:/sbin:/bin', '-e', 'HOME=/home/osmocom-build', '-e', 'PYTHONUNBUFFERED=1', '-t', 'testenv-msc-osmocom-nightly-20260821-1032-0968e843-1', 'apt-get', '-q', 'install', '-y', '--no-install-recommends', 'osmo-stp', 'osmo-msc', 'osmo-stp-dbg', 'libc6-dbg', 'libosmo-sigtran-dbg', 'libosmo-asn1-tcap-dbg', 'libosmocore-dbg', 'osmo-msc-dbg', 'libasn1c-dbg', 'libosmo-mgcp-client14-dbgsym', 'libosmo-ranap-dbg'][0m Reading package lists... Building dependency tree... Solving dependencies... Some packages could not be installed. This may mean that you have requested an impossible situation or if you are using the unstable distribution that some required packages have not yet been created or been moved out of Incoming. The following information may help to resolve the situation: The following packages have unmet dependencies: libosmo-mgcp-client14 : Depends: osmocom-nightly (= 202608191800) but 202608201800 is to be installed osmo-msc : Depends: osmocom-nightly (= 202608191800) but 202608201800 is to be installed osmo-msc-dbg : Depends: osmocom-nightly (= 202608191800) but 202608201800 is to be installed E: Unable to correct problems, you have held broken packages. E: The following information from --solver 3.0 may provide additional context: Unable to satisfy dependencies. Reached two conflicting decisions: 1. osmo-msc:amd64=1.15.0.10.2326.202608191800 is selected for install 2. osmo-msc:amd64=1.15.0.10.2326.202608191800 Depends osmocom-nightly (= 202608191800) but none of the choices are installable: [no choices] [1;91m[testenv] Command failed unexpectedly[0m [0;94m[testenv] Command: ['podman', 'exec', '-e', 'CCACHE_DIR=/home/osmocom-build/ccache/testenv', '-e', 'TESTENV_CACHE_DIR=<
https://jenkins.osmocom.org/jenkins/job/ttcn3-msc-test/ws/_cache
',> '-e', 'TESTENV_SRC_DIR=/home/osmocom-build/jenkins/workspace', '-e', 'TESTENV_INSTALL_DIR=/', '-e', 'TERM=dumb', '-e', 'PATH=<
https://jenkins.osmocom.org/jenkins/job/ttcn3-msc-test/ws/_testenv/data/scr…
>:<
https://jenkins.osmocom.org/jenkins/job/ttcn3-msc-test/ws/_testenv/data/scr…
>:<
https://jenkins.osmocom.org/jenkins/job/ttcn3-msc-test/ws/msc
>:/usr/local/bin:/usr/sbin:/usr/bin:/sbin:/bin', '-e', 'HOME=/home/osmocom-build', '-e', 'PYTHONUNBUFFERED=1', '-t', 'testenv-msc-osmocom-nightly-20260821-1032-0968e843-1', 'apt-get', '-q', 'install', '-y', '--no-install-recommends', 'osmo-stp', 'osmo-msc', 'osmo-stp-dbg', 'libc6-dbg', 'libosmo-sigtran-dbg', 'libosmo-asn1-tcap-dbg', 'libosmocore-dbg', 'osmo-msc-dbg', 'libasn1c-dbg', 'libosmo-mgcp-client14-dbgsym', 'libosmo-ranap-dbg'][0m [0;94m[testenv] Returncode: 100[0m [1;34m[testenv] Stopping podman container[0m [0;94m[testenv] + ['podman', 'kill', 'testenv-msc-osmocom-nightly-20260821-1032-0968e843-1'][0m testenv-msc-osmocom-nightly-20260821-1032-0968e843-1 Traceback (most recent call last): File "<
https://jenkins.osmocom.org/jenkins/job/ttcn3-msc-test/ws/./testenv.py
",> line 135, in <module> main() File "<
https://jenkins.osmocom.org/jenkins/job/ttcn3-msc-test/ws/./testenv.py
",> line 124, in main run() File "<
https://jenkins.osmocom.org/jenkins/job/ttcn3-msc-test/ws/./testenv.py
",> line 73, in run testenv.podman_install.packages(cfg, cfg_name) File "<
https://jenkins.osmocom.org/jenkins/job/ttcn3-msc-test/ws/_testenv/testenv/…
",> line 233, in packages apt_install(packages) File "<
https://jenkins.osmocom.org/jenkins/job/ttcn3-msc-test/ws/_testenv/testenv/…
",> line 99, in apt_install testenv.cmd.run(["apt-get", "-q", "install", "-y", "--no-install-recommends"] + pkgs) File "<
https://jenkins.osmocom.org/jenkins/job/ttcn3-msc-test/ws/_testenv/testenv/…
",> line 127, in run return testenv.podman.exec_cmd(cmd, check=check, env=env, **kwargs) ^^^^^^^^^^^^^^^^^^^^^^^^^^^^^^^^^^^^^^^^^^^^^^^^^^^^^^^^^^^^ File "<
https://jenkins.osmocom.org/jenkins/job/ttcn3-msc-test/ws/_testenv/testenv/…
",> line 156, in exec_cmd return testenv.cmd.run( ^^^^^^^^^^^^^^^^ File "<
https://jenkins.osmocom.org/jenkins/job/ttcn3-msc-test/ws/_testenv/testenv/…
",> line 144, in run exit_error_cmd(p, "Command failed unexpectedly") File "<
https://jenkins.osmocom.org/jenkins/job/ttcn3-msc-test/ws/_testenv/testenv/…
",> line 88, in exit_error_cmd raise RuntimeError("shell command related error, find details right above this python trace") RuntimeError: shell command related error, find details right above this python trace [0;94m[testenv] feed_watchdog_loop: podman container has stopped[0m [1;34m[testenv] Logs saved to:
https://jenkins.osmocom.org/jenkins/job/ttcn3-msc-test/3222/artifact/logs/
[0m + RC=1 + [ 1 = 0 ] + uptime + grep --color=always -o load.* [01;31m[Kload average: 16.85, 14.42, 12.90[m[K + exit 1 Build step 'Execute shell' marked build as failure Recording test results ERROR: Step ‘Publish JUnit test result report’ failed: No test report files were found. Configuration error?
1
0
0
0
← Newer
1
...
9
10
11
12
13
14
15
...
670
Older →
Jump to page:
1
2
3
4
5
6
7
8
9
10
11
12
13
14
15
16
17
18
19
20
21
22
23
24
25
26
27
28
29
30
31
32
33
34
35
36
37
38
39
40
41
42
43
44
45
46
47
48
49
50
51
52
53
54
55
56
57
58
59
60
61
62
63
64
65
66
67
68
69
70
71
72
73
74
75
76
77
78
79
80
81
82
83
84
85
86
87
88
89
90
91
92
93
94
95
96
97
98
99
100
101
102
103
104
105
106
107
108
109
110
111
112
113
114
115
116
117
118
119
120
121
122
123
124
125
126
127
128
129
130
131
132
133
134
135
136
137
138
139
140
141
142
143
144
145
146
147
148
149
150
151
152
153
154
155
156
157
158
159
160
161
162
163
164
165
166
167
168
169
170
171
172
173
174
175
176
177
178
179
180
181
182
183
184
185
186
187
188
189
190
191
192
193
194
195
196
197
198
199
200
201
202
203
204
205
206
207
208
209
210
211
212
213
214
215
216
217
218
219
220
221
222
223
224
225
226
227
228
229
230
231
232
233
234
235
236
237
238
239
240
241
242
243
244
245
246
247
248
249
250
251
252
253
254
255
256
257
258
259
260
261
262
263
264
265
266
267
268
269
270
271
272
273
274
275
276
277
278
279
280
281
282
283
284
285
286
287
288
289
290
291
292
293
294
295
296
297
298
299
300
301
302
303
304
305
306
307
308
309
310
311
312
313
314
315
316
317
318
319
320
321
322
323
324
325
326
327
328
329
330
331
332
333
334
335
336
337
338
339
340
341
342
343
344
345
346
347
348
349
350
351
352
353
354
355
356
357
358
359
360
361
362
363
364
365
366
367
368
369
370
371
372
373
374
375
376
377
378
379
380
381
382
383
384
385
386
387
388
389
390
391
392
393
394
395
396
397
398
399
400
401
402
403
404
405
406
407
408
409
410
411
412
413
414
415
416
417
418
419
420
421
422
423
424
425
426
427
428
429
430
431
432
433
434
435
436
437
438
439
440
441
442
443
444
445
446
447
448
449
450
451
452
453
454
455
456
457
458
459
460
461
462
463
464
465
466
467
468
469
470
471
472
473
474
475
476
477
478
479
480
481
482
483
484
485
486
487
488
489
490
491
492
493
494
495
496
497
498
499
500
501
502
503
504
505
506
507
508
509
510
511
512
513
514
515
516
517
518
519
520
521
522
523
524
525
526
527
528
529
530
531
532
533
534
535
536
537
538
539
540
541
542
543
544
545
546
547
548
549
550
551
552
553
554
555
556
557
558
559
560
561
562
563
564
565
566
567
568
569
570
571
572
573
574
575
576
577
578
579
580
581
582
583
584
585
586
587
588
589
590
591
592
593
594
595
596
597
598
599
600
601
602
603
604
605
606
607
608
609
610
611
612
613
614
615
616
617
618
619
620
621
622
623
624
625
626
627
628
629
630
631
632
633
634
635
636
637
638
639
640
641
642
643
644
645
646
647
648
649
650
651
652
653
654
655
656
657
658
659
660
661
662
663
664
665
666
667
668
669
670
Results per page:
10
25
50
100
200