lists.osmocom.org
Sign In
Sign Up
Sign In
Sign Up
Manage this list
×
Keyboard Shortcuts
Thread View
j
: Next unread message
k
: Previous unread message
j a
: Jump to all threads
j l
: Jump to MailingList overview
2026
September
August
July
June
May
April
March
February
January
2025
December
November
October
September
August
July
June
May
April
March
February
January
2024
December
November
October
September
August
July
June
May
April
March
February
January
2023
December
November
October
September
August
July
June
May
April
March
February
January
2022
December
November
October
September
August
July
June
May
April
March
February
January
2021
December
November
October
September
August
July
June
May
April
March
February
January
2020
December
November
October
September
August
July
June
May
April
March
February
January
2019
December
November
October
September
August
July
June
May
April
March
List overview
Download
jenkins-notifications
----- 2026 -----
September 2026
August 2026
July 2026
June 2026
May 2026
April 2026
March 2026
February 2026
January 2026
----- 2025 -----
December 2025
November 2025
October 2025
September 2025
August 2025
July 2025
June 2025
May 2025
April 2025
March 2025
February 2025
January 2025
----- 2024 -----
December 2024
November 2024
October 2024
September 2024
August 2024
July 2024
June 2024
May 2024
April 2024
March 2024
February 2024
January 2024
----- 2023 -----
December 2023
November 2023
October 2023
September 2023
August 2023
July 2023
June 2023
May 2023
April 2023
March 2023
February 2023
January 2023
----- 2022 -----
December 2022
November 2022
October 2022
September 2022
August 2022
July 2022
June 2022
May 2022
April 2022
March 2022
February 2022
January 2022
----- 2021 -----
December 2021
November 2021
October 2021
September 2021
August 2021
July 2021
June 2021
May 2021
April 2021
March 2021
February 2021
January 2021
----- 2020 -----
December 2020
November 2020
October 2020
September 2020
August 2020
July 2020
June 2020
May 2020
April 2020
March 2020
February 2020
January 2020
----- 2019 -----
December 2019
November 2019
October 2019
September 2019
August 2019
July 2019
June 2019
May 2019
April 2019
March 2019
jenkins-notifications@lists.osmocom.org
1 participants
6691 discussions
Start a n
N
ew thread
Build failed in Jenkins: ttcn3-hss-test-ogs-latest #278
by jenkins@lists.osmocom.org
18 Aug '26
18 Aug '26
See <
https://jenkins.osmocom.org/jenkins/job/ttcn3-hss-test-ogs-latest/278/displ…
> Changes: ------------------------------------------ [...truncated 38.15 KiB...] CCLD HTTPmsg_Types_part_6.so CCLD HTTPmsg_Types_part_7.so CCLD IPL4asp_Functions_part_1.so CCLD IPL4asp_Functions_part_2.so CCLD IPL4asp_Functions_part_3.so CCLD IPL4asp_Functions_part_4.so CCLD IPL4asp_Functions_part_5.so CCLD IPL4asp_Functions_part_6.so CCLD IPL4asp_Functions_part_7.so CCLD IPL4asp_PortType_part_1.so CCLD IPL4asp_PortType_part_2.so CCLD IPL4asp_PortType_part_3.so CCLD IPL4asp_PortType_part_4.so CCLD IPL4asp_PortType_part_5.so CCLD IPL4asp_PortType_part_6.so CCLD IPL4asp_PortType_part_7.so CCLD IPL4asp_Types_part_1.so CCLD IPL4asp_Types_part_2.so CCLD IPL4asp_Types_part_3.so CCLD IPL4asp_Types_part_4.so CCLD IPL4asp_Types_part_5.so CCLD IPL4asp_Types_part_6.so CCLD IPL4asp_Types_part_7.so CCLD Misc_Helpers_part_1.so CCLD Misc_Helpers_part_2.so CCLD Misc_Helpers_part_3.so CCLD Misc_Helpers_part_4.so CCLD Misc_Helpers_part_5.so CCLD Misc_Helpers_part_6.so CCLD Misc_Helpers_part_7.so CCLD Native_Functions_part_1.so CCLD Native_Functions_part_2.so CCLD Native_Functions_part_3.so CCLD Native_Functions_part_4.so CCLD Native_Functions_part_5.so CCLD Native_Functions_part_6.so CCLD Native_Functions_part_7.so CCLD Osmocom_Types_part_1.so CCLD Osmocom_Types_part_2.so CCLD Osmocom_Types_part_3.so CCLD Osmocom_Types_part_4.so CCLD Osmocom_Types_part_5.so CCLD Osmocom_Types_part_6.so CCLD Osmocom_Types_part_7.so CCLD Prometheus_Checker_part_1.so CCLD Prometheus_Checker_part_2.so CCLD Prometheus_Checker_part_3.so CCLD Prometheus_Checker_part_4.so CCLD Prometheus_Checker_part_5.so CCLD Prometheus_Checker_part_6.so CCLD Prometheus_Checker_part_7.so CCLD SCTP_Templates_part_1.so CCLD SCTP_Templates_part_2.so CCLD SCTP_Templates_part_3.so CCLD SCTP_Templates_part_4.so CCLD SCTP_Templates_part_5.so CCLD SCTP_Templates_part_6.so CCLD SCTP_Templates_part_7.so CCLD Socket_API_Definitions_part_1.so CCLD Socket_API_Definitions_part_2.so CCLD Socket_API_Definitions_part_3.so CCLD Socket_API_Definitions_part_4.so CCLD Socket_API_Definitions_part_5.so CCLD Socket_API_Definitions_part_6.so CCLD Socket_API_Definitions_part_7.so CCLD TCCConversion_Functions_part_1.so CCLD TCCConversion_Functions_part_2.so CCLD TCCConversion_Functions_part_3.so CCLD TCCConversion_Functions_part_4.so CCLD TCCConversion_Functions_part_5.so CCLD TCCConversion_Functions_part_6.so CCLD TCCConversion_Functions_part_7.so CCLD TCCEncoding_Functions_part_1.so CCLD TCCEncoding_Functions_part_2.so CCLD TCCEncoding_Functions_part_3.so CCLD TCCEncoding_Functions_part_4.so CCLD TCCEncoding_Functions_part_5.so CCLD TCCEncoding_Functions_part_6.so CCLD TCCEncoding_Functions_part_7.so CCLD TCCInterface_Functions_part_1.so CCLD TCCInterface_Functions_part_2.so CCLD TCCInterface_Functions_part_3.so CCLD TCCInterface_Functions_part_4.so CCLD TCCInterface_Functions_part_5.so CCLD TCCInterface_Functions_part_6.so CCLD TCCInterface_Functions_part_7.so CCLD Abstract_Socket.so CCLD DIAMETER_CodecPort_CtrlFunctDef.so CCLD DIAMETER_EncDec.so CCLD HTTPmsg_MessageLen_Function.so CCLD HTTPmsg_PT.so CCLD IPL4asp_PT.so CCLD IPL4asp_discovery.so CCLD Native_FunctionDefs.so CCLD TCCConversion.so CCLD TCCEncoding.so CCLD TCCInterface.so CCLD HSS_Tests make[1]: Leaving directory '<
https://jenkins.osmocom.org/jenkins/job/ttcn3-hss-test-ogs-latest/ws/_cache…
'> [1;34m[testenv][open5gs] Stopping podman container (restart)[0m [0;94m[testenv][open5gs] + ['podman', 'kill', 'testenv-hss-open5gs-osmocom-latest-20260817-1330-d633fe8d-0'][0m testenv-hss-open5gs-osmocom-latest-20260817-1330-d633fe8d-0 [0;94m[testenv][open5gs] + ['podman', 'run', '--rm', '--name', 'testenv-hss-open5gs-osmocom-latest-20260817-1330-d633fe8d-1', '--log-driver', 'json-file', '--log-opt', 'path=<
https://jenkins.osmocom.org/jenkins/job/ttcn3-hss-test-ogs-latest/278/artif…
',> '--security-opt=seccomp=<
https://jenkins.osmocom.org/jenkins/job/ttcn3-hss-test-ogs-latest/ws/_teste…
',> '--cap-add=NET_ADMIN', '--cap-add=NET_RAW', '--cap-add=SYS_ADMIN', '--device=/dev/net/tun', '--volume', '<
https://jenkins.osmocom.org/jenkins/job/ttcn3-hss-test-ogs-latest/ws/_cache…
>:/var/cache/apt', '--volume', '<
https://jenkins.osmocom.org/jenkins/job/ttcn3-hss-test-ogs-latest/ws/_cache…
>:/var/lib/apt', '--sysctl', 'net.ipv4.conf.all.send_redirects=0', '--sysctl', 'net.ipv4.conf.default.send_redirects=0', '-e', 'PODMAN=1', '-e', 'HOST_USER=osmocom-build', '-e', 'TESTENV_BINARY_REPO=1', '--volume', '<
https://jenkins.osmocom.org/jenkins/job/ttcn3-hss-test-ogs-latest/ws/logs
>:<
https://jenkins.osmocom.org/jenkins/job/ttcn3-hss-test-ogs-latest/ws/logs
',> '--volume', '<
https://jenkins.osmocom.org/jenkins/job/ttcn3-hss-test-ogs-latest/ws/_cache
>:<
https://jenkins.osmocom.org/jenkins/job/ttcn3-hss-test-ogs-latest/ws/_cache
',> '--volume', '/home/osmocom-build/ccache/testenv:/home/osmocom-build/ccache/testenv', '--volume', '/home/osmocom-build/jenkins/workspace:/home/osmocom-build/jenkins/workspace', 'debian-trixie-osmo-ttcn3-testenv', '<
https://jenkins.osmocom.org/jenkins/job/ttcn3-hss-test-ogs-latest/ws/_teste…
'][0m> [0;94m[testenv][open5gs] + ['podman', 'exec', '-e', 'CCACHE_DIR=/home/osmocom-build/ccache/testenv', '-e', 'TESTENV_CACHE_DIR=<
https://jenkins.osmocom.org/jenkins/job/ttcn3-hss-test-ogs-latest/ws/_cache
',> '-e', 'TESTENV_SRC_DIR=/home/osmocom-build/jenkins/workspace', '-e', 'TESTENV_INSTALL_DIR=/', '-e', 'TERM=dumb', '-e', 'PATH=<
https://jenkins.osmocom.org/jenkins/job/ttcn3-hss-test-ogs-latest/ws/_teste…
>:<
https://jenkins.osmocom.org/jenkins/job/ttcn3-hss-test-ogs-latest/ws/_teste…
>:<
https://jenkins.osmocom.org/jenkins/job/ttcn3-hss-test-ogs-latest/ws/hss
>:/usr/local/bin:/usr/sbin:/usr/bin:/sbin:/bin', '-e', 'HOME=/home/osmocom-build', '-e', 'PYTHONUNBUFFERED=1', '-t', 'testenv-hss-open5gs-osmocom-latest-20260817-1330-d633fe8d-1', 'rm', '/etc/apt/apt.conf.d/docker-clean'][0m Running testenv-podman-main.sh [0;94m[testenv][open5gs] + ['podman', 'exec', '-e', 'CCACHE_DIR=/home/osmocom-build/ccache/testenv', '-e', 'TESTENV_CACHE_DIR=<
https://jenkins.osmocom.org/jenkins/job/ttcn3-hss-test-ogs-latest/ws/_cache
',> '-e', 'TESTENV_SRC_DIR=/home/osmocom-build/jenkins/workspace', '-e', 'TESTENV_INSTALL_DIR=/', '-e', 'TERM=dumb', '-e', 'PATH=<
https://jenkins.osmocom.org/jenkins/job/ttcn3-hss-test-ogs-latest/ws/_teste…
>:<
https://jenkins.osmocom.org/jenkins/job/ttcn3-hss-test-ogs-latest/ws/_teste…
>:<
https://jenkins.osmocom.org/jenkins/job/ttcn3-hss-test-ogs-latest/ws/hss
>:/usr/local/bin:/usr/sbin:/usr/bin:/sbin:/bin', '-e', 'HOME=/home/osmocom-build', '-e', 'PYTHONUNBUFFERED=1', '-t', 'testenv-hss-open5gs-osmocom-latest-20260817-1330-d633fe8d-1', 'sh', '-c', "echo 'deb [signed-by=/obs.key]
https://downloads.osmocom.org/packages/osmocom:/latest/Debian_13/
./' > /etc/apt/sources.list.d/osmocom.list"][0m [0;94m[testenv][open5gs] + ['podman', 'exec', '-e', 'CCACHE_DIR=/home/osmocom-build/ccache/testenv', '-e', 'TESTENV_CACHE_DIR=<
https://jenkins.osmocom.org/jenkins/job/ttcn3-hss-test-ogs-latest/ws/_cache
',> '-e', 'TESTENV_SRC_DIR=/home/osmocom-build/jenkins/workspace', '-e', 'TESTENV_INSTALL_DIR=/', '-e', 'TERM=dumb', '-e', 'PATH=<
https://jenkins.osmocom.org/jenkins/job/ttcn3-hss-test-ogs-latest/ws/_teste…
>:<
https://jenkins.osmocom.org/jenkins/job/ttcn3-hss-test-ogs-latest/ws/_teste…
>:<
https://jenkins.osmocom.org/jenkins/job/ttcn3-hss-test-ogs-latest/ws/hss
>:/usr/local/bin:/usr/sbin:/usr/bin:/sbin:/bin', '-e', 'HOME=/home/osmocom-build', '-e', 'PYTHONUNBUFFERED=1', '-t', 'testenv-hss-open5gs-osmocom-latest-20260817-1330-d633fe8d-1', 'sh', '-c', 'echo \'Package: *\nPin: origin "
downloads.osmocom.org
"\nPin-Priority: 1100\n\' > /etc/apt/preferences.d/osmocom-apt-pin'][0m [0;94m[testenv] feed_watchdog_loop: podman container has stopped[0m [0;94m[testenv][open5gs] + ['podman', 'exec', '-e', 'CCACHE_DIR=/home/osmocom-build/ccache/testenv', '-e', 'TESTENV_CACHE_DIR=<
https://jenkins.osmocom.org/jenkins/job/ttcn3-hss-test-ogs-latest/ws/_cache
',> '-e', 'TESTENV_SRC_DIR=/home/osmocom-build/jenkins/workspace', '-e', 'TESTENV_INSTALL_DIR=/', '-e', 'TERM=dumb', '-e', 'PATH=<
https://jenkins.osmocom.org/jenkins/job/ttcn3-hss-test-ogs-latest/ws/_teste…
>:<
https://jenkins.osmocom.org/jenkins/job/ttcn3-hss-test-ogs-latest/ws/_teste…
>:<
https://jenkins.osmocom.org/jenkins/job/ttcn3-hss-test-ogs-latest/ws/hss
>:/usr/local/bin:/usr/sbin:/usr/bin:/sbin:/bin', '-e', 'HOME=/home/osmocom-build', '-e', 'PYTHONUNBUFFERED=1', '-t', 'testenv-hss-open5gs-osmocom-latest-20260817-1330-d633fe8d-1', 'apt-get', '-q', 'update'][0m Hit:1
http://deb.debian.org/debian
trixie InRelease Hit:2
http://deb.debian.org/debian
trixie-updates InRelease Hit:3
http://deb.debian.org/debian-security
trixie-security InRelease Get:4
https://downloads.osmocom.org/packages/osmocom:/latest/Debian_13
./ InRelease [1621 B] Get:5
https://downloads.osmocom.org/packages/osmocom:/latest/Debian_13
./ Packages [193 kB] Fetched 194 kB in 1s (298 kB/s) Reading package lists... [0;94m[testenv][open5gs] + ['podman', 'exec', '-e', 'CCACHE_DIR=/home/osmocom-build/ccache/testenv', '-e', 'TESTENV_CACHE_DIR=<
https://jenkins.osmocom.org/jenkins/job/ttcn3-hss-test-ogs-latest/ws/_cache
',> '-e', 'TESTENV_SRC_DIR=/home/osmocom-build/jenkins/workspace', '-e', 'TESTENV_INSTALL_DIR=/', '-e', 'TERM=dumb', '-e', 'PATH=<
https://jenkins.osmocom.org/jenkins/job/ttcn3-hss-test-ogs-latest/ws/_teste…
>:<
https://jenkins.osmocom.org/jenkins/job/ttcn3-hss-test-ogs-latest/ws/_teste…
>:<
https://jenkins.osmocom.org/jenkins/job/ttcn3-hss-test-ogs-latest/ws/hss
>:/usr/local/bin:/usr/sbin:/usr/bin:/sbin:/bin', '-e', 'HOME=/home/osmocom-build', '-e', 'PYTHONUNBUFFERED=1', '-t', 'testenv-hss-open5gs-osmocom-latest-20260817-1330-d633fe8d-1', 'sh', '-c', 'apt-cache pkgnames | grep -- -dbg > <
https://jenkins.osmocom.org/jenkins/job/ttcn3-hss-test-ogs-latest/ws/_cache…
'][0m> [0;94m[testenv][open5gs] + ['podman', 'exec', '-e', 'CCACHE_DIR=/home/osmocom-build/ccache/testenv', '-e', 'TESTENV_CACHE_DIR=<
https://jenkins.osmocom.org/jenkins/job/ttcn3-hss-test-ogs-latest/ws/_cache
',> '-e', 'TESTENV_SRC_DIR=/home/osmocom-build/jenkins/workspace', '-e', 'TESTENV_INSTALL_DIR=/', '-e', 'TERM=dumb', '-e', 'PATH=<
https://jenkins.osmocom.org/jenkins/job/ttcn3-hss-test-ogs-latest/ws/_teste…
>:<
https://jenkins.osmocom.org/jenkins/job/ttcn3-hss-test-ogs-latest/ws/_teste…
>:<
https://jenkins.osmocom.org/jenkins/job/ttcn3-hss-test-ogs-latest/ws/hss
>:/usr/local/bin:/usr/sbin:/usr/bin:/sbin:/bin', '-e', 'HOME=/home/osmocom-build', '-e', 'PYTHONUNBUFFERED=1', '-t', 'testenv-hss-open5gs-osmocom-latest-20260817-1330-d633fe8d-1', 'apt-rdepends', 'open5gs-hss'][0m [0;94m[testenv][open5gs] open5gs-hss -> open5gs-hss: installing open5gs-hss-dbgsym[0m [0;94m[testenv][open5gs] open5gs-hss -> libc6: installing libc6-dbg[0m [0;94m[testenv][open5gs] open5gs-hss -> open5gs-common: installing open5gs-common-dbgsym[0m [1;34m[testenv][open5gs] Installing packages: open5gs-hss, open5gs-hss-dbgsym, libc6-dbg, open5gs-common-dbgsym[0m [0;94m[testenv][open5gs] + ['podman', 'exec', '-e', 'CCACHE_DIR=/home/osmocom-build/ccache/testenv', '-e', 'TESTENV_CACHE_DIR=<
https://jenkins.osmocom.org/jenkins/job/ttcn3-hss-test-ogs-latest/ws/_cache
',> '-e', 'TESTENV_SRC_DIR=/home/osmocom-build/jenkins/workspace', '-e', 'TESTENV_INSTALL_DIR=/', '-e', 'TERM=dumb', '-e', 'PATH=<
https://jenkins.osmocom.org/jenkins/job/ttcn3-hss-test-ogs-latest/ws/_teste…
>:<
https://jenkins.osmocom.org/jenkins/job/ttcn3-hss-test-ogs-latest/ws/_teste…
>:<
https://jenkins.osmocom.org/jenkins/job/ttcn3-hss-test-ogs-latest/ws/hss
>:/usr/local/bin:/usr/sbin:/usr/bin:/sbin:/bin', '-e', 'HOME=/home/osmocom-build', '-e', 'PYTHONUNBUFFERED=1', '-t', 'testenv-hss-open5gs-osmocom-latest-20260817-1330-d633fe8d-1', 'apt-get', '-q', 'install', '-y', '--no-install-recommends', 'open5gs-hss', 'open5gs-hss-dbgsym', 'libc6-dbg', 'open5gs-common-dbgsym'][0m Reading package lists... Building dependency tree... The following additional packages will be installed: open5gs-common The following NEW packages will be installed: libc6-dbg open5gs-common open5gs-common-dbgsym open5gs-hss open5gs-hss-dbgsym 0 upgraded, 5 newly installed, 0 to remove and 35 not upgraded. Need to get 23.2 MB of archives. After this operation, 55.9 MB of additional disk space will be used. Get:1
http://deb.debian.org/debian
trixie/main amd64 libc6-dbg amd64 2.41-12+deb13u3 [7394 kB] Get:2
https://downloads.osmocom.org/packages/osmocom:/latest/Debian_13
./ open5gs-common 2.8.0 [3568 kB] Get:3
https://downloads.osmocom.org/packages/osmocom:/latest/Debian_13
./ open5gs-common-dbgsym 2.8.0 [12.1 MB] Get:4
https://downloads.osmocom.org/packages/osmocom:/latest/Debian_13
./ open5gs-hss 2.8.0 [62.9 kB] Get:5
https://downloads.osmocom.org/packages/osmocom:/latest/Debian_13
./ open5gs-hss-dbgsym 2.8.0 [121 kB] Fetched 23.2 MB in 0s (86.3 MB/s) Selecting previously unselected package libc6-dbg:amd64. (Reading database ... (Reading database ... 5%(Reading database ... 10%(Reading database ... 15%(Reading database ... 20%(Reading database ... 25%(Reading database ... 30%(Reading database ... 35%(Reading database ... 40%(Reading database ... 45%(Reading database ... 50%(Reading database ... 55%(Reading database ... 60%(Reading database ... 65%(Reading database ... 70%(Reading database ... 75%(Reading database ... 80%(Reading database ... 85%(Reading database ... 90%(Reading database ... 95%(Reading database ... 100%(Reading database ... 44387 files and directories currently installed.) Preparing to unpack .../libc6-dbg_2.41-12+deb13u3_amd64.deb ... Unpacking libc6-dbg:amd64 (2.41-12+deb13u3) ... Selecting previously unselected package open5gs-common:amd64. Preparing to unpack .../open5gs-common_2.8.0_amd64.deb ... Unpacking open5gs-common:amd64 (2.8.0) ... Selecting previously unselected package open5gs-common-dbgsym:amd64. Preparing to unpack .../open5gs-common-dbgsym_2.8.0_amd64.deb ... Unpacking open5gs-common-dbgsym:amd64 (2.8.0) ... Selecting previously unselected package open5gs-hss:amd64. Preparing to unpack .../open5gs-hss_2.8.0_amd64.deb ... Unpacking open5gs-hss:amd64 (2.8.0) ... Selecting previously unselected package open5gs-hss-dbgsym:amd64. Preparing to unpack .../open5gs-hss-dbgsym_2.8.0_amd64.deb ... Unpacking open5gs-hss-dbgsym:amd64 (2.8.0) ... Setting up open5gs-common:amd64 (2.8.0) ... Setting up libc6-dbg:amd64 (2.41-12+deb13u3) ... Setting up open5gs-common-dbgsym:amd64 (2.8.0) ... Setting up open5gs-hss:amd64 (2.8.0) ... Created symlink '/etc/systemd/system/multi-user.target.wants/open5gs-hssd.service' → '/usr/lib/systemd/system/open5gs-hssd.service'. Setting up open5gs-hss-dbgsym:amd64 (2.8.0) ... Processing triggers for libc-bin (2.41-12+deb13u3) ... [1;34m[testenv][open5gs] Preparing testdir: <
https://jenkins.osmocom.org/jenkins/job/ttcn3-hss-test-ogs-latest/ws/logs[…
> [0;94m[testenv][open5gs] + ['podman', 'exec', '-e', 'CCACHE_DIR=/home/osmocom-build/ccache/testenv', '-e', 'TESTENV_CACHE_DIR=<
https://jenkins.osmocom.org/jenkins/job/ttcn3-hss-test-ogs-latest/ws/_cache
',> '-e', 'TESTENV_SRC_DIR=/home/osmocom-build/jenkins/workspace', '-e', 'TESTENV_INSTALL_DIR=/', '-e', 'TERM=dumb', '-e', 'PATH=<
https://jenkins.osmocom.org/jenkins/job/ttcn3-hss-test-ogs-latest/ws/_teste…
>:<
https://jenkins.osmocom.org/jenkins/job/ttcn3-hss-test-ogs-latest/ws/_teste…
>:<
https://jenkins.osmocom.org/jenkins/job/ttcn3-hss-test-ogs-latest/ws/hss
>:/usr/local/bin:/usr/sbin:/usr/bin:/sbin:/bin', '-e', 'HOME=/home/osmocom-build', '-e', 'PYTHONUNBUFFERED=1', '-t', 'testenv-hss-open5gs-osmocom-latest-20260817-1330-d633fe8d-1', 'install', '-Dm644', '<
https://jenkins.osmocom.org/jenkins/job/ttcn3-hss-test-ogs-latest/ws/hss/HS…
',> '<
https://jenkins.osmocom.org/jenkins/job/ttcn3-hss-test-ogs-latest/278/artif…
'][0m> [0;94m[testenv][open5gs] + ['cp', '-a', 'mongod.conf', '<
https://jenkins.osmocom.org/jenkins/job/ttcn3-hss-test-ogs-latest/278/artif…
'][0m> [0;94m[testenv][open5gs] + ['cp', '-a', 'open5gs-hss.yaml', 'freediameter.conf', '<
https://jenkins.osmocom.org/jenkins/job/ttcn3-hss-test-ogs-latest/278/artif…
'][0m> [0;94m[testenv][open5gs] + ['podman', 'exec', '-e', 'CCACHE_DIR=/home/osmocom-build/ccache/testenv', '-e', 'TESTENV_CACHE_DIR=<
https://jenkins.osmocom.org/jenkins/job/ttcn3-hss-test-ogs-latest/ws/_cache
',> '-e', 'TESTENV_SRC_DIR=/home/osmocom-build/jenkins/workspace', '-e', 'TESTENV_INSTALL_DIR=/', '-e', 'TERM=dumb', '-e', 'PATH=<
https://jenkins.osmocom.org/jenkins/job/ttcn3-hss-test-ogs-latest/ws/_teste…
>:<
https://jenkins.osmocom.org/jenkins/job/ttcn3-hss-test-ogs-latest/ws/_teste…
>:<
https://jenkins.osmocom.org/jenkins/job/ttcn3-hss-test-ogs-latest/ws/hss
>:/usr/local/bin:/usr/sbin:/usr/bin:/sbin:/bin', '-e', 'HOME=/home/osmocom-build', '-e', 'PYTHONUNBUFFERED=1', '-t', 'testenv-hss-open5gs-osmocom-latest-20260817-1330-d633fe8d-1', 'install', '-Dm644', '<
https://jenkins.osmocom.org/jenkins/job/ttcn3-hss-test-ogs-latest/ws/hss/HS…
',> '<
https://jenkins.osmocom.org/jenkins/job/ttcn3-hss-test-ogs-latest/278/artif…
'][0m> [0;94m[testenv][open5gs] + ['podman', 'exec', '-e', 'CCACHE_DIR=/home/osmocom-build/ccache/testenv', '-e', 'TESTENV_CACHE_DIR=<
https://jenkins.osmocom.org/jenkins/job/ttcn3-hss-test-ogs-latest/ws/_cache
',> '-e', 'TESTENV_SRC_DIR=/home/osmocom-build/jenkins/workspace', '-e', 'TESTENV_INSTALL_DIR=/', '-e', 'TERM=dumb', '-e', 'PATH=<
https://jenkins.osmocom.org/jenkins/job/ttcn3-hss-test-ogs-latest/ws/_teste…
>:<
https://jenkins.osmocom.org/jenkins/job/ttcn3-hss-test-ogs-latest/ws/_teste…
>:<
https://jenkins.osmocom.org/jenkins/job/ttcn3-hss-test-ogs-latest/ws/hss
>:/usr/local/bin:/usr/sbin:/usr/bin:/sbin:/bin', '-e', 'HOME=/home/osmocom-build', '-e', 'PYTHONUNBUFFERED=1', '-t', 'testenv-hss-open5gs-osmocom-latest-20260817-1330-d633fe8d-1', 'install', '-Dm644', '<
https://jenkins.osmocom.org/jenkins/job/ttcn3-hss-test-ogs-latest/ws/Common…
',> '<
https://jenkins.osmocom.org/jenkins/job/ttcn3-hss-test-ogs-latest/278/artif…
'][0m> [0;94m[testenv][open5gs] + ['podman', 'exec', '-e', 'CCACHE_DIR=/home/osmocom-build/ccache/testenv', '-e', 'TESTENV_CACHE_DIR=<
https://jenkins.osmocom.org/jenkins/job/ttcn3-hss-test-ogs-latest/ws/_cache
',> '-e', 'TESTENV_SRC_DIR=/home/osmocom-build/jenkins/workspace', '-e', 'TESTENV_INSTALL_DIR=/', '-e', 'TERM=dumb', '-e', 'PATH=<
https://jenkins.osmocom.org/jenkins/job/ttcn3-hss-test-ogs-latest/ws/_teste…
>:<
https://jenkins.osmocom.org/jenkins/job/ttcn3-hss-test-ogs-latest/ws/_teste…
>:<
https://jenkins.osmocom.org/jenkins/job/ttcn3-hss-test-ogs-latest/ws/hss
>:/usr/local/bin:/usr/sbin:/usr/bin:/sbin:/bin', '-e', 'HOME=/home/osmocom-build', '-e', 'PYTHONUNBUFFERED=1', '-t', 'testenv-hss-open5gs-osmocom-latest-20260817-1330-d633fe8d-1', 'sed', '-i', 's#TTCN3_HACKS_PATH := .*#TTCN3_HACKS_PATH := "<
https://jenkins.osmocom.org/jenkins/job/ttcn3-hss-test-ogs-latest/ws/
">#', '<
https://jenkins.osmocom.org/jenkins/job/ttcn3-hss-test-ogs-latest/278/artif…
'][0m> [0;94m[testenv][open5gs] Adjusting testsuite config: <
https://jenkins.osmocom.org/jenkins/job/ttcn3-hss-test-ogs-latest/278/artif…
> [0;94m[testenv][open5gs] + ['podman', 'exec', '-e', 'CCACHE_DIR=/home/osmocom-build/ccache/testenv', '-e', 'TESTENV_CACHE_DIR=<
https://jenkins.osmocom.org/jenkins/job/ttcn3-hss-test-ogs-latest/ws/_cache
',> '-e', 'TESTENV_SRC_DIR=/home/osmocom-build/jenkins/workspace', '-e', 'TESTENV_INSTALL_DIR=/', '-e', 'TERM=dumb', '-e', 'PATH=<
https://jenkins.osmocom.org/jenkins/job/ttcn3-hss-test-ogs-latest/ws/_teste…
>:<
https://jenkins.osmocom.org/jenkins/job/ttcn3-hss-test-ogs-latest/ws/_teste…
>:<
https://jenkins.osmocom.org/jenkins/job/ttcn3-hss-test-ogs-latest/ws/hss
>:/usr/local/bin:/usr/sbin:/usr/bin:/sbin:/bin', '-e', 'HOME=/home/osmocom-build', '-e', 'PYTHONUNBUFFERED=1', '-t', 'testenv-hss-open5gs-osmocom-latest-20260817-1330-d633fe8d-1', 'sed', '-i', '-e', 's/\\[MODULE_PARAMETERS\\]/\\[MODULE_PARAMETERS\\]\\nMisc_Helpers.mp_osmo_repo := "latest"/g', '-e', 's#../Common.cfg#Common.cfg#', '<
https://jenkins.osmocom.org/jenkins/job/ttcn3-hss-test-ogs-latest/278/artif…
'][0m> [0;94m[testenv][open5gs] Adjusting testsuite config: <
https://jenkins.osmocom.org/jenkins/job/ttcn3-hss-test-ogs-latest/278/artif…
> [0;94m[testenv][open5gs] + ['podman', 'exec', '-e', 'CCACHE_DIR=/home/osmocom-build/ccache/testenv', '-e', 'TESTENV_CACHE_DIR=<
https://jenkins.osmocom.org/jenkins/job/ttcn3-hss-test-ogs-latest/ws/_cache
',> '-e', 'TESTENV_SRC_DIR=/home/osmocom-build/jenkins/workspace', '-e', 'TESTENV_INSTALL_DIR=/', '-e', 'TERM=dumb', '-e', 'PATH=<
https://jenkins.osmocom.org/jenkins/job/ttcn3-hss-test-ogs-latest/ws/_teste…
>:<
https://jenkins.osmocom.org/jenkins/job/ttcn3-hss-test-ogs-latest/ws/_teste…
>:<
https://jenkins.osmocom.org/jenkins/job/ttcn3-hss-test-ogs-latest/ws/hss
>:/usr/local/bin:/usr/sbin:/usr/bin:/sbin:/bin', '-e', 'HOME=/home/osmocom-build', '-e', 'PYTHONUNBUFFERED=1', '-t', 'testenv-hss-open5gs-osmocom-latest-20260817-1330-d633fe8d-1', 'sed', '-i', '-e', 's/\\[MODULE_PARAMETERS\\]/\\[MODULE_PARAMETERS\\]\\nMisc_Helpers.mp_osmo_repo := "latest"/g', '-e', 's#../Common.cfg#Common.cfg#', '<
https://jenkins.osmocom.org/jenkins/job/ttcn3-hss-test-ogs-latest/278/artif…
'][0m> [0;94m[testenv][open5gs] Adjusting testsuite config: <
https://jenkins.osmocom.org/jenkins/job/ttcn3-hss-test-ogs-latest/278/artif…
> [0;94m[testenv][open5gs] + ['podman', 'exec', '-e', 'CCACHE_DIR=/home/osmocom-build/ccache/testenv', '-e', 'TESTENV_CACHE_DIR=<
https://jenkins.osmocom.org/jenkins/job/ttcn3-hss-test-ogs-latest/ws/_cache
',> '-e', 'TESTENV_SRC_DIR=/home/osmocom-build/jenkins/workspace', '-e', 'TESTENV_INSTALL_DIR=/', '-e', 'TERM=dumb', '-e', 'PATH=<
https://jenkins.osmocom.org/jenkins/job/ttcn3-hss-test-ogs-latest/ws/_teste…
>:<
https://jenkins.osmocom.org/jenkins/job/ttcn3-hss-test-ogs-latest/ws/_teste…
>:<
https://jenkins.osmocom.org/jenkins/job/ttcn3-hss-test-ogs-latest/ws/hss
>:/usr/local/bin:/usr/sbin:/usr/bin:/sbin:/bin', '-e', 'HOME=/home/osmocom-build', '-e', 'PYTHONUNBUFFERED=1', '-t', 'testenv-hss-open5gs-osmocom-latest-20260817-1330-d633fe8d-1', 'sed', '-i', '-e', 's/\\[MODULE_PARAMETERS\\]/\\[MODULE_PARAMETERS\\]\\nMisc_Helpers.mp_osmo_repo := "latest"/g', '-e', 's#../Common.cfg#Common.cfg#', '<
https://jenkins.osmocom.org/jenkins/job/ttcn3-hss-test-ogs-latest/278/artif…
'][0m> [1;34m[testenv][open5gs] Running db prepare script[0m [0;94m[testenv][open5gs] + ['podman', 'exec', '-e', 'CCACHE_DIR=/home/osmocom-build/ccache/testenv', '-e', 'TESTENV_CACHE_DIR=<
https://jenkins.osmocom.org/jenkins/job/ttcn3-hss-test-ogs-latest/ws/_cache
',> '-e', 'TESTENV_SRC_DIR=/home/osmocom-build/jenkins/workspace', '-e', 'TESTENV_INSTALL_DIR=/', '-e', 'TERM=dumb', '-e', 'PATH=<
https://jenkins.osmocom.org/jenkins/job/ttcn3-hss-test-ogs-latest/ws/_teste…
>:<
https://jenkins.osmocom.org/jenkins/job/ttcn3-hss-test-ogs-latest/ws/_teste…
>:<
https://jenkins.osmocom.org/jenkins/job/ttcn3-hss-test-ogs-latest/ws/hss
>:/usr/local/bin:/usr/sbin:/usr/bin:/sbin:/bin', '-e', 'HOME=/home/osmocom-build', '-e', 'PYTHONUNBUFFERED=1', '-t', '-w', '<
https://jenkins.osmocom.org/jenkins/job/ttcn3-hss-test-ogs-latest/278/artif…
',> 'testenv-hss-open5gs-osmocom-latest-20260817-1330-d633fe8d-1', 'sh', '-c', 'mkdir db'][0m [1;34m[testenv][open5gs] Running db[0m [0;94m[testenv][open5gs] + ['podman', 'exec', '-e', 'CCACHE_DIR=/home/osmocom-build/ccache/testenv', '-e', 'TESTENV_CACHE_DIR=<
https://jenkins.osmocom.org/jenkins/job/ttcn3-hss-test-ogs-latest/ws/_cache
',> '-e', 'TESTENV_SRC_DIR=/home/osmocom-build/jenkins/workspace', '-e', 'TESTENV_INSTALL_DIR=/', '-e', 'TERM=dumb', '-e', 'PATH=<
https://jenkins.osmocom.org/jenkins/job/ttcn3-hss-test-ogs-latest/ws/_teste…
>:<
https://jenkins.osmocom.org/jenkins/job/ttcn3-hss-test-ogs-latest/ws/_teste…
>:<
https://jenkins.osmocom.org/jenkins/job/ttcn3-hss-test-ogs-latest/ws/hss
>:/usr/local/bin:/usr/sbin:/usr/bin:/sbin:/bin', '-e', 'HOME=/home/osmocom-build', '-e', 'PYTHONUNBUFFERED=1', '-w', '<
https://jenkins.osmocom.org/jenkins/job/ttcn3-hss-test-ogs-latest/278/artif…
',> 'testenv-hss-open5gs-osmocom-latest-20260817-1330-d633fe8d-1', 'sh', '-c', 'ulimit -c unlimited; mongod --config mongod.conf 2>&1 | tee <
https://jenkins.osmocom.org/jenkins/job/ttcn3-hss-test-ogs-latest/278/artif…
'][0m> [1;34m[testenv][open5gs] Running db setup script[0m [0;94m[testenv][open5gs] + ['podman', 'exec', '-e', 'CCACHE_DIR=/home/osmocom-build/ccache/testenv', '-e', 'TESTENV_CACHE_DIR=<
https://jenkins.osmocom.org/jenkins/job/ttcn3-hss-test-ogs-latest/ws/_cache
',> '-e', 'TESTENV_SRC_DIR=/home/osmocom-build/jenkins/workspace', '-e', 'TESTENV_INSTALL_DIR=/', '-e', 'TERM=dumb', '-e', 'PATH=<
https://jenkins.osmocom.org/jenkins/job/ttcn3-hss-test-ogs-latest/ws/_teste…
>:<
https://jenkins.osmocom.org/jenkins/job/ttcn3-hss-test-ogs-latest/ws/_teste…
>:<
https://jenkins.osmocom.org/jenkins/job/ttcn3-hss-test-ogs-latest/ws/hss
>:/usr/local/bin:/usr/sbin:/usr/bin:/sbin:/bin', '-e', 'HOME=/home/osmocom-build', '-e', 'PYTHONUNBUFFERED=1', '-t', '-w', '<
https://jenkins.osmocom.org/jenkins/job/ttcn3-hss-test-ogs-latest/278/artif…
',> 'testenv-hss-open5gs-osmocom-latest-20260817-1330-d633fe8d-1', 'sh', '-c', 'create_test_subscribers.sh'][0m {"t":{"$date":"2026-08-17T13:30:16.578+00:00"},"s":"I", "c":"CONTROL", "id":23285, "ctx":"main","msg":"Automatically disabling TLS 1.0, to force-enable TLS 1.0 specify --sslDisabledProtocols 'none'"} {"t":{"$date":"2026-08-17T13:30:16.580+00:00"},"s":"I", "c":"NETWORK", "id":4915701, "ctx":"main","msg":"Initialized wire specification","attr":{"spec":{"incomingExternalClient":{"minWireVersion":0,"maxWireVersion":13},"incomingInternalClient":{"minWireVersion":0,"maxWireVersion":13},"outgoing":{"minWireVersion":0,"maxWireVersion":13},"isInternalClient":true}}} {"t":{"$date":"2026-08-17T13:30:16.580+00:00"},"s":"W", "c":"ASIO", "id":22601, "ctx":"main","msg":"No TransportLayer configured during NetworkInterface startup"} {"t":{"$date":"2026-08-17T13:30:16.580+00:00"},"s":"I", "c":"NETWORK", "id":4648601, "ctx":"main","msg":"Implicit TCP FastOpen unavailable. If TCP FastOpen is required, set tcpFastOpenServer, tcpFastOpenClient, and tcpFastOpenQueueSize."} + DB_URI=mongodb://127.0.0.103/open5gs + DBCTL=<
https://jenkins.osmocom.org/jenkins/job/ttcn3-hss-test-ogs-latest/ws/_cache…
> + DBCTL_CMD=<
https://jenkins.osmocom.org/jenkins/job/ttcn3-hss-test-ogs-latest/ws/_cache…
> --db_uri=mongodb://127.0.0.103/open5gs + [ -e <
https://jenkins.osmocom.org/jenkins/job/ttcn3-hss-test-ogs-latest/ws/_cache…
> ] + wget
https://raw.githubusercontent.com/open5gs/open5gs/v2.7.1/misc/db/open5gs-db…
-O <
https://jenkins.osmocom.org/jenkins/job/ttcn3-hss-test-ogs-latest/ws/_cache…
> --2026-08-17 13:30:16--
https://raw.githubusercontent.com/open5gs/open5gs/v2.7.1/misc/db/open5gs-db…
Resolving
raw.githubusercontent.com
(
raw.githubusercontent.com
)... 185.199.111.133, 185.199.108.133, 185.199.109.133, ... Connecting to
raw.githubusercontent.com
(raw.githubusercontent.com)|185.199.111.133|:443... connected. {"t":{"$date":"2026-08-17T13:30:16.670+00:00"},"s":"W", "c":"ASIO", "id":22601, "ctx":"main","msg":"No TransportLayer configured during NetworkInterface startup"} {"t":{"$date":"2026-08-17T13:30:16.670+00:00"},"s":"I", "c":"REPL", "id":5123008, "ctx":"main","msg":"Successfully registered PrimaryOnlyService","attr":{"service":"TenantMigrationDonorService","ns":"config.tenantMigrationDonors"}} {"t":{"$date":"2026-08-17T13:30:16.670+00:00"},"s":"I", "c":"REPL", "id":5123008, "ctx":"main","msg":"Successfully registered PrimaryOnlyService","attr":{"service":"TenantMigrationRecipientService","ns":"config.tenantMigrationRecipients"}} {"t":{"$date":"2026-08-17T13:30:16.670+00:00"},"s":"I", "c":"CONTROL", "id":5945603, "ctx":"main","msg":"Multi threading initialized"} {"t":{"$date":"2026-08-17T13:30:16.670+00:00"},"s":"I", "c":"CONTROL", "id":4615611, "ctx":"initandlisten","msg":"MongoDB starting","attr":{"pid":150,"port":27017,"dbPath":"db","architecture":"64-bit","host":"37eeacd264c6"}} {"t":{"$date":"2026-08-17T13:30:16.670+00:00"},"s":"I", "c":"CONTROL", "id":23403, "ctx":"initandlisten","msg":"Build Info","attr":{"buildInfo":{"version":"5.0.34","gitVersion":"3ed0d39e497e5876dab3a0b825f2e504806d0afd","openSSLVersion":"OpenSSL 1.1.1n 15 Mar 2022","modules":[],"allocator":"tcmalloc","environment":{"distmod":"debian11","distarch":"x86_64","target_arch":"x86_64"}}}} {"t":{"$date":"2026-08-17T13:30:16.670+00:00"},"s":"I", "c":"CONTROL", "id":51765, "ctx":"initandlisten","msg":"Operating System","attr":{"os":{"name":"PRETTY_NAME=\"Debian GNU/Linux 13 (trixie)\"","version":"Kernel 6.12.101+deb13-amd64"}}} {"t":{"$date":"2026-08-17T13:30:16.670+00:00"},"s":"I", "c":"CONTROL", "id":21951, "ctx":"initandlisten","msg":"Options set by command line","attr":{"options":{"config":"mongod.conf","net":{"bindIp":"127.0.0.103","port":27017},"processManagement":{"timeZoneInfo":"/usr/share/zoneinfo"},"storage":{"dbPath":"db"}}}} {"t":{"$date":"2026-08-17T13:30:16.672+00:00"},"s":"I", "c":"STORAGE", "id":22297, "ctx":"initandlisten","msg":"Using the XFS filesystem is strongly recommended with the WiredTiger storage engine. See
http://dochub.mongodb.org/core/prodnotes-filesystem
","tags":["startupWarnings"]} {"t":{"$date":"2026-08-17T13:30:16.672+00:00"},"s":"I", "c":"STORAGE", "id":22315, "ctx":"initandlisten","msg":"Opening WiredTiger","attr":{"config":"create,cache_size=31543M,session_max=33000,eviction=(threads_min=4,threads_max=4),config_base=false,statistics=(fast),log=(enabled=true,archive=true,path=journal,compressor=snappy),builtin_extension_config=(zstd=(compression_level=6)),file_manager=(close_idle_time=600,close_scan_interval=10,close_handle_minimum=2000),statistics_log=(wait=0),verbose=[recovery_progress,checkpoint_progress,compact_progress],"}} HTTP request sent, awaiting response... {"t":{"$date":"2026-08-17T13:30:16.811+00:00"},"s":"I", "c":"STORAGE", "id":22430, "ctx":"initandlisten","msg":"WiredTiger message","attr":{"message":"[1786973416:811325][150:0x7ffa4de3bc80], txn-recover: [WT_VERB_RECOVERY_PROGRESS] recovery log replay has successfully finished and ran for 0 milliseconds"}} {"t":{"$date":"2026-08-17T13:30:16.811+00:00"},"s":"I", "c":"STORAGE", "id":22430, "ctx":"initandlisten","msg":"WiredTiger message","attr":{"message":"[1786973416:811380][150:0x7ffa4de3bc80], txn-recover: [WT_VERB_RECOVERY_ALL] Set global recovery timestamp: (0, 0)"}} {"t":{"$date":"2026-08-17T13:30:16.811+00:00"},"s":"I", "c":"STORAGE", "id":22430, "ctx":"initandlisten","msg":"WiredTiger message","attr":{"message":"[1786973416:811392][150:0x7ffa4de3bc80], txn-recover: [WT_VERB_RECOVERY_ALL] Set global oldest timestamp: (0, 0)"}} {"t":{"$date":"2026-08-17T13:30:16.811+00:00"},"s":"I", "c":"STORAGE", "id":22430, "ctx":"initandlisten","msg":"WiredTiger message","attr":{"message":"[1786973416:811416][150:0x7ffa4de3bc80], txn-recover: [WT_VERB_RECOVERY_PROGRESS] recovery was completed successfully and took 0ms, including 0ms for the log replay, 0ms for the rollback to stable, and 0ms for the checkpoint."}} {"t":{"$date":"2026-08-17T13:30:16.840+00:00"},"s":"I", "c":"STORAGE", "id":4795906, "ctx":"initandlisten","msg":"WiredTiger opened","attr":{"durationMillis":168}} {"t":{"$date":"2026-08-17T13:30:16.840+00:00"},"s":"I", "c":"RECOVERY", "id":23987, "ctx":"initandlisten","msg":"WiredTiger recoveryTimestamp","attr":{"recoveryTimestamp":{"$timestamp":{"t":0,"i":0}}}} {"t":{"$date":"2026-08-17T13:30:16.906+00:00"},"s":"I", "c":"STORAGE", "id":22262, "ctx":"initandlisten","msg":"Timestamp monitor starting"} {"t":{"$date":"2026-08-17T13:30:16.936+00:00"},"s":"W", "c":"CONTROL", "id":22120, "ctx":"initandlisten","msg":"Access control is not enabled for the database. Read and write access to data and configuration is unrestricted","tags":["startupWarnings"]} {"t":{"$date":"2026-08-17T13:30:16.936+00:00"},"s":"W", "c":"CONTROL", "id":22138, "ctx":"initandlisten","msg":"You are running this process as the root user, which is not recommended","tags":["startupWarnings"]} {"t":{"$date":"2026-08-17T13:30:16.936+00:00"},"s":"W", "c":"CONTROL", "id":22178, "ctx":"initandlisten","msg":"/sys/kernel/mm/transparent_hugepage/enabled is 'always'. We suggest setting it to 'never' in this binary version","tags":["startupWarnings"]} {"t":{"$date":"2026-08-17T13:30:16.941+00:00"},"s":"I", "c":"STORAGE", "id":20320, "ctx":"initandlisten","msg":"createCollection","attr":{"namespace":"admin.system.version","uuidDisposition":"provided","uuid":{"uuid":{"$uuid":"1e01c6c5-b693-4f7b-a86f-e9d855c847ad"}},"options":{"uuid":{"$uuid":"1e01c6c5-b693-4f7b-a86f-e9d855c847ad"}}}} {"t":{"$date":"2026-08-17T13:30:16.985+00:00"},"s":"I", "c":"INDEX", "id":20345, "ctx":"initandlisten","msg":"Index build: done building","attr":{"buildUUID":null,"namespace":"admin.system.version","index":"_id_","commitTimestamp":null}} {"t":{"$date":"2026-08-17T13:30:16.986+00:00"},"s":"I", "c":"REPL", "id":20459, "ctx":"initandlisten","msg":"Setting featureCompatibilityVersion","attr":{"newVersion":"5.0"}} {"t":{"$date":"2026-08-17T13:30:16.986+00:00"},"s":"I", "c":"NETWORK", "id":4915702, "ctx":"initandlisten","msg":"Updated wire specification","attr":{"oldSpec":{"incomingExternalClient":{"minWireVersion":0,"maxWireVersion":13},"incomingInternalClient":{"minWireVersion":0,"maxWireVersion":13},"outgoing":{"minWireVersion":0,"maxWireVersion":13},"isInternalClient":true},"newSpec":{"incomingExternalClient":{"minWireVersion":0,"maxWireVersion":13},"incomingInternalClient":{"minWireVersion":13,"maxWireVersion":13},"outgoing":{"minWireVersion":13,"maxWireVersion":13},"isInternalClient":true}}} {"t":{"$date":"2026-08-17T13:30:16.987+00:00"},"s":"I", "c":"NETWORK", "id":4915702, "ctx":"initandlisten","msg":"Updated wire specification","attr":{"oldSpec":{"incomingExternalClient":{"minWireVersion":0,"maxWireVersion":13},"incomingInternalClient":{"minWireVersion":13,"maxWireVersion":13},"outgoing":{"minWireVersion":13,"maxWireVersion":13},"isInternalClient":true},"newSpec":{"incomingExternalClient":{"minWireVersion":0,"maxWireVersion":13},"incomingInternalClient":{"minWireVersion":13,"maxWireVersion":13},"outgoing":{"minWireVersion":13,"maxWireVersion":13},"isInternalClient":true}}} {"t":{"$date":"2026-08-17T13:30:16.987+00:00"},"s":"I", "c":"STORAGE", "id":5071100, "ctx":"initandlisten","msg":"Clearing temp directory"} {"t":{"$date":"2026-08-17T13:30:16.988+00:00"},"s":"I", "c":"CONTROL", "id":20536, "ctx":"initandlisten","msg":"Flow Control is enabled on this deployment"} {"t":{"$date":"2026-08-17T13:30:16.990+00:00"},"s":"I", "c":"FTDC", "id":20625, "ctx":"initandlisten","msg":"Initializing full-time diagnostic data capture","attr":{"dataDirectory":"db/diagnostic.data"}} {"t":{"$date":"2026-08-17T13:30:16.991+00:00"},"s":"I", "c":"STORAGE", "id":20320, "ctx":"initandlisten","msg":"createCollection","attr":{"namespace":"local.startup_log","uuidDisposition":"generated","uuid":{"uuid":{"$uuid":"8f8f7858-c74c-488c-8c74-877db010baf3"}},"options":{"capped":true,"size":10485760}}} {"t":{"$date":"2026-08-17T13:30:17.033+00:00"},"s":"I", "c":"INDEX", "id":20345, "ctx":"initandlisten","msg":"Index build: done building","attr":{"buildUUID":null,"namespace":"local.startup_log","index":"_id_","commitTimestamp":null}} {"t":{"$date":"2026-08-17T13:30:17.034+00:00"},"s":"I", "c":"REPL", "id":6015317, "ctx":"initandlisten","msg":"Setting new configuration state","attr":{"newState":"ConfigReplicationDisabled","oldState":"ConfigPreStart"}} {"t":{"$date":"2026-08-17T13:30:17.036+00:00"},"s":"I", "c":"NETWORK", "id":23015, "ctx":"listener","msg":"Listening on","attr":{"address":"/tmp/mongodb-27017.sock"}} {"t":{"$date":"2026-08-17T13:30:17.036+00:00"},"s":"I", "c":"NETWORK", "id":23015, "ctx":"listener","msg":"Listening on","attr":{"address":"127.0.0.103"}} {"t":{"$date":"2026-08-17T13:30:17.036+00:00"},"s":"I", "c":"NETWORK", "id":23016, "ctx":"listener","msg":"Waiting for connections","attr":{"port":27017,"ssl":"off"}} {"t":{"$date":"2026-08-17T13:30:17.039+00:00"},"s":"I", "c":"STORAGE", "id":20320, "ctx":"LogicalSessionCacheRefresh","msg":"createCollection","attr":{"namespace":"config.system.sessions","uuidDisposition":"generated","uuid":{"uuid":{"$uuid":"bfeee3df-165e-4270-ac07-7e3a8a4baea9"}},"options":{}}} {"t":{"$date":"2026-08-17T13:30:17.039+00:00"},"s":"I", "c":"CONTROL", "id":20712, "ctx":"LogicalSessionCacheReap","msg":"Sessions collection is not set up; waiting until next sessions reap interval","attr":{"error":"NamespaceNotFound: config.system.sessions does not exist"}} {"t":{"$date":"2026-08-17T13:30:17.104+00:00"},"s":"I", "c":"INDEX", "id":20345, "ctx":"LogicalSessionCacheRefresh","msg":"Index build: done building","attr":{"buildUUID":null,"namespace":"config.system.sessions","index":"_id_","commitTimestamp":null}} {"t":{"$date":"2026-08-17T13:30:17.105+00:00"},"s":"I", "c":"INDEX", "id":20345, "ctx":"LogicalSessionCacheRefresh","msg":"Index build: done building","attr":{"buildUUID":null,"namespace":"config.system.sessions","index":"lsidTTLIndex","commitTimestamp":null}} 429 Too Many Requests 2026-08-17 13:30:20 ERROR 429: Too Many Requests. [1;91m[testenv][open5gs] db: setup script failed[0m [1;34m[testenv][open5gs] Stopping podman container[0m [0;94m[testenv][open5gs] + ['podman', 'kill', 'testenv-hss-open5gs-osmocom-latest-20260817-1330-d633fe8d-1'][0m testenv-hss-open5gs-osmocom-latest-20260817-1330-d633fe8d-1 [0;94m[testenv][open5gs] feed_watchdog_loop: podman container has stopped[0m [1;34m[testenv][open5gs] Logs saved to:
https://jenkins.osmocom.org/jenkins/job/ttcn3-hss-test-ogs-latest/278/artif…
[0m + RC=1 + [ 1 = 0 ] + uptime + grep --color=always -o load.* [01;31m[Kload average: 2.97, 4.75, 3.31[m[K + exit 1 Build step 'Execute shell' marked build as failure Recording test results ERROR: Step ‘Publish JUnit test result report’ failed: No test report files were found. Configuration error?
1
1
0
0
Build failed in Jenkins: ttcn3-hlr-test-pyhss-latest #287
by jenkins@lists.osmocom.org
18 Aug '26
18 Aug '26
See <
https://jenkins.osmocom.org/jenkins/job/ttcn3-hlr-test-pyhss-latest/287/dis…
> Changes: ------------------------------------------ [...truncated 160.38 KiB...] Selecting previously unselected package python3-babel. Preparing to unpack .../68-python3-babel_2.17.0-1_all.deb ... Unpacking python3-babel (2.17.0-1) ... Selecting previously unselected package python3-infinity. Preparing to unpack .../69-python3-infinity_1.5-4_all.deb ... Unpacking python3-infinity (1.5-4) ... Selecting previously unselected package python3-sqlalchemy-utils. Preparing to unpack .../70-python3-sqlalchemy-utils_0.41.0-5_all.deb ... Unpacking python3-sqlalchemy-utils (0.41.0-5) ... Selecting previously unselected package python3-yaml. Preparing to unpack .../71-python3-yaml_6.0.2-1+b2_amd64.deb ... Unpacking python3-yaml (6.0.2-1+b2) ... Selecting previously unselected package python3-aniso8601. Preparing to unpack .../72-python3-aniso8601_10.0.1-1_all.deb ... Unpacking python3-aniso8601 (10.0.1-1) ... Selecting previously unselected package python3-rpds-py. Preparing to unpack .../73-python3-rpds-py_0.21.0-2+b1_amd64.deb ... Unpacking python3-rpds-py (0.21.0-2+b1) ... Selecting previously unselected package python3-referencing. Preparing to unpack .../74-python3-referencing_0.36.2-1_all.deb ... Unpacking python3-referencing (0.36.2-1) ... Selecting previously unselected package python3-jsonschema-specifications. Preparing to unpack .../75-python3-jsonschema-specifications_2023.12.1-2_all.deb ... Unpacking python3-jsonschema-specifications (2023.12.1-2) ... Selecting previously unselected package python3-jsonschema. Preparing to unpack .../76-python3-jsonschema_4.19.2-6_all.deb ... Unpacking python3-jsonschema (4.19.2-6) ... Selecting previously unselected package python3-asn1crypto. Preparing to unpack .../77-python3-asn1crypto_1.5.1-3_all.deb ... Unpacking python3-asn1crypto (1.5.1-3) ... Selecting previously unselected package python3-bitstruct. Preparing to unpack .../78-python3-bitstruct_8.20.0-2_amd64.deb ... Unpacking python3-bitstruct (8.20.0-2) ... Selecting previously unselected package python3-pyparsing. Preparing to unpack .../79-python3-pyparsing_3.1.2-1_all.deb ... Unpacking python3-pyparsing (3.1.2-1) ... Selecting previously unselected package python3-bitarray. Preparing to unpack .../80-python3-bitarray_2.9.2-1+b3_amd64.deb ... Unpacking python3-bitarray (2.9.2-1+b3) ... Selecting previously unselected package python3-bitstring. Preparing to unpack .../81-python3-bitstring_4.2.3-1_all.deb ... Unpacking python3-bitstring (4.2.3-1) ... Selecting previously unselected package python3-construct. Preparing to unpack .../82-python3-construct_2.10.68+dfsg1-2_all.deb ... Unpacking python3-construct (2.10.68+dfsg1-2) ... Selecting previously unselected package pyhss. Preparing to unpack .../83-pyhss_2.0.0_amd64.deb ... Unpacking pyhss (2.0.0) ... Selecting previously unselected package pyhss-dbgsym. Preparing to unpack .../84-pyhss-dbgsym_2.0.0_amd64.deb ... Unpacking pyhss-dbgsym (2.0.0) ... Selecting previously unselected package python3.13-dbg. Preparing to unpack .../85-python3.13-dbg_3.13.5-2+deb13u4_amd64.deb ... Unpacking python3.13-dbg (3.13.5-2+deb13u4) ... Selecting previously unselected package python3-dbg. Preparing to unpack .../86-python3-dbg_3.13.5-1_amd64.deb ... Unpacking python3-dbg (3.13.5-1) ... Setting up python3-attr (25.3.0-1) ... Setting up libxau6:amd64 (1:1.0.11-1) ... Setting up libxdmcp6:amd64 (1:1.1.5-1) ... Setting up libxcb1:amd64 (1.17.0-2+b1) ... Setting up python3-pydantic-core (2.27.2-3+b1) ... Setting up python3-pycryptodome (3.20.0+dfsg-3) ... Setting up python3-ply (3.11-9) ... Setting up x11-common (1:7.7+24+deb13u1) ... invoke-rc.d: could not determine current runlevel invoke-rc.d: policy-rc.d denied execution of start. Setting up python3-itsdangerous (2.2.0-2) ... Setting up python3-yaml (6.0.2-1+b2) ... Setting up python3-pytz (2025.2-3) ... Setting up python3-click (8.2.0+0.really.8.1.8-1) ... Setting up python3-markupsafe (2.1.5-1+b3) ... Setting up python3-annotated-types (0.7.0-1) ... Setting up python3-multidict (6.4.3-1) ... Setting up python3-tz (2025.2-3) ... Setting up python-babel-localedata (2.17.0-1) ... Setting up python3-frozenlist (1.6.0-1) ... Setting up libc6-dbg:amd64 (2.41-12+deb13u3) ... Setting up python3-aiosignal (1.3.2-1) ... Setting up python3-async-timeout (5.0.1-1) ... Setting up libpython3.13-minimal:amd64 (3.13.5-2+deb13u4) ... Setting up python3-bitarray (2.9.2-1+b3) ... Setting up python3-decorator (5.2.1-2) ... Setting up python3-jinja2 (3.1.6-1) ... Setting up python3-aniso8601 (10.0.1-1) ... Setting up python3-pyparsing (3.1.2-1) ... Setting up libfreetype6:amd64 (2.13.3+dfsg-1+deb13u1) ... Setting up libx11-data (2:1.8.12-1) ... Setting up python3-typeshed (0.0~git20241223.ea91db2-1) ... Setting up python3-werkzeug (3.1.3-2) ... Setting up python3-greenlet (3.1.0-1+b2) ... Setting up fonts-dejavu-mono (2.37-8) ... Setting up fonts-dejavu-core (2.37-8) ... Setting up python3-construct (2.10.68+dfsg1-2) ... Setting up python3-redis (6.1.0-2) ... Setting up python3-aiohappyeyeballs (2.6.1-1) ... Setting up python3-bitstruct (8.20.0-2) ... Setting up python3-rpds-py (0.21.0-2+b1) ... Setting up python3-pysmi (0.3.4-3) ... Setting up python3-infinity (1.5-4) ... Setting up python3-dnspython (2.7.0-1) ... Setting up python3-propcache (0.3.1-1) ... Setting up python3-pyasn1 (0.6.1-1+deb13u2) ... Setting up python3.13-minimal (3.13.5-2+deb13u4) ... Setting up libx11-6:amd64 (2:1.8.12-1) ... Setting up python3-dateutil (2.9.0-4) ... Setting up python3-email-validator (2.2.0-1) ... Setting up python3-msgpack (1.0.3-3+b4) ... Setting up python3-pyasyncore (1.0.2-3) ... Setting up python3-yarl (1.19.0-1) ... Setting up libpython3.13-stdlib:amd64 (3.13.5-2+deb13u4) ... Setting up python3-asn1crypto (1.5.1-3) ... Setting up python3-bitstring (4.2.3-1) ... Setting up python3-referencing (0.36.2-1) ... Setting up python3-blinker (1.9.0-1) ... Setting up libpython3.13:amd64 (3.13.5-2+deb13u4) ... Setting up python3-pysnmp4 (4.4.12-4) ... /usr/lib/python3/dist-packages/pysnmp/hlapi/asyncio/cmdgen.py:82: SyntaxWarning: invalid escape sequence '\*' \*varBinds : :py:class:`~pysnmp.smi.rfc1902.ObjectType` /usr/lib/python3/dist-packages/pysnmp/hlapi/asyncio/cmdgen.py:189: SyntaxWarning: invalid escape sequence '\*' \*varBinds : :py:class:`~pysnmp.smi.rfc1902.ObjectType` /usr/lib/python3/dist-packages/pysnmp/hlapi/asyncio/cmdgen.py:296: SyntaxWarning: invalid escape sequence '\*' \*varBinds : :py:class:`~pysnmp.smi.rfc1902.ObjectType` /usr/lib/python3/dist-packages/pysnmp/hlapi/asyncio/cmdgen.py:419: SyntaxWarning: invalid escape sequence '\*' \*varBinds : :py:class:`~pysnmp.smi.rfc1902.ObjectType` /usr/lib/python3/dist-packages/pysnmp/hlapi/asyncio/ntforg.py:71: SyntaxWarning: invalid escape sequence '\*' \*\*options : /usr/lib/python3/dist-packages/pysnmp/hlapi/asyncore/cmdgen.py:47: SyntaxWarning: invalid escape sequence '\*' \*varBinds : :py:class:`~pysnmp.smi.rfc1902.ObjectType` /usr/lib/python3/dist-packages/pysnmp/hlapi/asyncore/cmdgen.py:160: SyntaxWarning: invalid escape sequence '\*' \*varBinds : :py:class:`~pysnmp.smi.rfc1902.ObjectType` /usr/lib/python3/dist-packages/pysnmp/hlapi/asyncore/cmdgen.py:271: SyntaxWarning: invalid escape sequence '\*' \*varBinds : :py:class:`~pysnmp.smi.rfc1902.ObjectType` /usr/lib/python3/dist-packages/pysnmp/hlapi/asyncore/cmdgen.py:394: SyntaxWarning: invalid escape sequence '\*' \*varBinds : :py:class:`~pysnmp.smi.rfc1902.ObjectType` /usr/lib/python3/dist-packages/pysnmp/hlapi/asyncore/sync/cmdgen.py:45: SyntaxWarning: invalid escape sequence '\*' \*varBinds : :py:class:`~pysnmp.smi.rfc1902.ObjectType` /usr/lib/python3/dist-packages/pysnmp/hlapi/asyncore/sync/cmdgen.py:150: SyntaxWarning: invalid escape sequence '\*' \*varBinds : :py:class:`~pysnmp.smi.rfc1902.ObjectType` /usr/lib/python3/dist-packages/pysnmp/hlapi/asyncore/sync/cmdgen.py:257: SyntaxWarning: invalid escape sequence '\*' \*varBinds : :py:class:`~pysnmp.smi.rfc1902.ObjectType` /usr/lib/python3/dist-packages/pysnmp/hlapi/asyncore/sync/cmdgen.py:452: SyntaxWarning: invalid escape sequence '\*' \*varBinds : :py:class:`~pysnmp.smi.rfc1902.ObjectType` /usr/lib/python3/dist-packages/pysnmp/hlapi/asyncore/sync/ntforg.py:56: SyntaxWarning: invalid escape sequence '\*' \*\*options : /usr/lib/python3/dist-packages/pysnmp/hlapi/twisted/cmdgen.py:49: SyntaxWarning: invalid escape sequence '\*' \*varBinds : :class:`~pysnmp.smi.rfc1902.ObjectType` /usr/lib/python3/dist-packages/pysnmp/hlapi/twisted/cmdgen.py:167: SyntaxWarning: invalid escape sequence '\*' \*varBinds : :class:`~pysnmp.smi.rfc1902.ObjectType` /usr/lib/python3/dist-packages/pysnmp/hlapi/twisted/cmdgen.py:285: SyntaxWarning: invalid escape sequence '\*' \*varBinds : :class:`~pysnmp.smi.rfc1902.ObjectType` /usr/lib/python3/dist-packages/pysnmp/hlapi/twisted/cmdgen.py:427: SyntaxWarning: invalid escape sequence '\*' \*varBinds : :class:`~pysnmp.smi.rfc1902.ObjectType` /usr/lib/python3/dist-packages/pysnmp/hlapi/twisted/ntforg.py:61: SyntaxWarning: invalid escape sequence '\*' \*\*options : Setting up python3-arrow (1.3.0-1.1) ... Setting up libxrender1:amd64 (1:0.9.12-1) ... Setting up python3-babel (2.17.0-1) ... update-alternatives: using /usr/bin/pybabel-python3 to provide /usr/bin/pybabel (pybabel) in auto mode Setting up python3.13 (3.13.5-2+deb13u4) ... Setting up fontconfig-config (2.15.0-2.3) ... Setting up python3-influxdb (5.3.2-5) ... Setting up python3-flask (3.1.1-1) ... Setting up python3-aiohttp (3.11.16-1+deb13u1) ... Setting up libxext6:amd64 (2:1.3.4-1+b3) ... Setting up python3.13-venv (3.13.5-2+deb13u4) ... Setting up python3-sqlalchemy (2.0.40+ds1-1) ... Setting up python3-prometheus-client (0.21.1+ds1-1) ... Setting up python3-pydantic (2.10.6-2) ... Setting up libpython3.13-dev:amd64 (3.13.5-2+deb13u4) ... Setting up libxss1:amd64 (1:1.2.3-1+b3) ... Setting up python3-jsonschema-specifications (2023.12.1-2) ... Setting up python3-sqlalchemy-utils (0.41.0-5) ... Setting up python3-prometheus-flask-exporter (0.23.1-1) ... Setting up python3.13-dev (3.13.5-2+deb13u4) ... Setting up python3-jsonschema (4.19.2-6) ... Setting up pyhss (2.0.0) ... Creating group 'pyhss' with GID 990. Creating user 'pyhss' (n/a) with UID 990 and GID 990. Created symlink '/etc/systemd/system/multi-user.target.wants/pyhss_api.service' → '/usr/lib/systemd/system/pyhss_api.service'. Created symlink '/etc/systemd/system/pyhss.service.wants/pyhss_diameter.service' → '/usr/lib/systemd/system/pyhss_diameter.service'. Unit /usr/lib/systemd/system/pyhss_diameter.service is added as a dependency to a non-existent unit pyhss.service. Created symlink '/etc/systemd/system/multi-user.target.wants/pyhss_diameter.service' → '/usr/lib/systemd/system/pyhss_diameter.service'. Created symlink '/etc/systemd/system/pyhss.service.wants/pyhss_gsup.service' → '/usr/lib/systemd/system/pyhss_gsup.service'. Unit /usr/lib/systemd/system/pyhss_gsup.service is added as a dependency to a non-existent unit pyhss.service. Created symlink '/etc/systemd/system/multi-user.target.wants/pyhss_gsup.service' → '/usr/lib/systemd/system/pyhss_gsup.service'. Created symlink '/etc/systemd/system/pyhss.service.wants/pyhss_hss.service' → '/usr/lib/systemd/system/pyhss_hss.service'. Unit /usr/lib/systemd/system/pyhss_hss.service is added as a dependency to a non-existent unit pyhss.service. Created symlink '/etc/systemd/system/multi-user.target.wants/pyhss_hss.service' → '/usr/lib/systemd/system/pyhss_hss.service'. Created symlink '/etc/systemd/system/pyhss.service.wants/pyhss_metric.service' → '/usr/lib/systemd/system/pyhss_metric.service'. Unit /usr/lib/systemd/system/pyhss_metric.service is added as a dependency to a non-existent unit pyhss.service. Created symlink '/etc/systemd/system/multi-user.target.wants/pyhss_metric.service' → '/usr/lib/systemd/system/pyhss_metric.service'. Setting up pyhss-dbgsym (2.0.0) ... Processing triggers for libc-bin (2.41-12+deb13u3) ... Processing triggers for systemd (257.13-1~deb13u1) ... Processing triggers for sgml-base (1.31+nmu1) ... Setting up libfontconfig1:amd64 (2.15.0-2.3) ... Setting up libxft2:amd64 (2.3.6-1+b4) ... Setting up libtk8.6:amd64 (8.6.16-1) ... Setting up libpython3.13-dbg:amd64 (3.13.5-2+deb13u4) ... Setting up python3.13-dbg (3.13.5-2+deb13u4) ... python3.13-dbg: can't get files for byte-compilation Setting up libpython3-dbg:amd64 (3.13.5-1) ... Setting up python3-dbg (3.13.5-1) ... Processing triggers for libc-bin (2.41-12+deb13u3) ... [1;34m[testenv][pyhss] Preparing testdir: <
https://jenkins.osmocom.org/jenkins/job/ttcn3-hlr-test-pyhss-latest/ws/logs…
> [0;94m[testenv][pyhss] + ['podman', 'exec', '-e', 'CCACHE_DIR=/home/osmocom-build/ccache/testenv', '-e', 'TESTENV_CACHE_DIR=<
https://jenkins.osmocom.org/jenkins/job/ttcn3-hlr-test-pyhss-latest/ws/_cac…
',> '-e', 'TESTENV_SRC_DIR=/home/osmocom-build/jenkins/workspace', '-e', 'TESTENV_INSTALL_DIR=/', '-e', 'TERM=dumb', '-e', 'PATH=<
https://jenkins.osmocom.org/jenkins/job/ttcn3-hlr-test-pyhss-latest/ws/_tes…
>:<
https://jenkins.osmocom.org/jenkins/job/ttcn3-hlr-test-pyhss-latest/ws/_tes…
>:<
https://jenkins.osmocom.org/jenkins/job/ttcn3-hlr-test-pyhss-latest/ws/hlr
>:/usr/local/bin:/usr/sbin:/usr/bin:/sbin:/bin', '-e', 'HOME=/home/osmocom-build', '-e', 'PYTHONUNBUFFERED=1', '-t', 'testenv-hlr-pyhss-osmocom-latest-20260817-1207-b4d2cfcc-1', 'install', '-Dm644', '<
https://jenkins.osmocom.org/jenkins/job/ttcn3-hlr-test-pyhss-latest/ws/hlr/…
',> '<
https://jenkins.osmocom.org/jenkins/job/ttcn3-hlr-test-pyhss-latest/287/art…
'][0m> [0;94m[testenv][pyhss] + ['cp', '-a', 'pyhss/HLR_Tests.cfg', '<
https://jenkins.osmocom.org/jenkins/job/ttcn3-hlr-test-pyhss-latest/287/art…
'][0m> [0;94m[testenv][pyhss] + ['cp', '-a', 'pyhss/redis.conf', '<
https://jenkins.osmocom.org/jenkins/job/ttcn3-hlr-test-pyhss-latest/287/art…
'][0m> [0;94m[testenv][pyhss] + ['cp', '-a', 'pyhss/config.yaml', 'pyhss/run_in_venv.sh', '<
https://jenkins.osmocom.org/jenkins/job/ttcn3-hlr-test-pyhss-latest/287/art…
'][0m> [0;94m[testenv][pyhss] + ['cp', '-a', 'pyhss/setup_db.sh', '<
https://jenkins.osmocom.org/jenkins/job/ttcn3-hlr-test-pyhss-latest/287/art…
'][0m> [0;94m[testenv][pyhss] + ['podman', 'exec', '-e', 'CCACHE_DIR=/home/osmocom-build/ccache/testenv', '-e', 'TESTENV_CACHE_DIR=<
https://jenkins.osmocom.org/jenkins/job/ttcn3-hlr-test-pyhss-latest/ws/_cac…
',> '-e', 'TESTENV_SRC_DIR=/home/osmocom-build/jenkins/workspace', '-e', 'TESTENV_INSTALL_DIR=/', '-e', 'TERM=dumb', '-e', 'PATH=<
https://jenkins.osmocom.org/jenkins/job/ttcn3-hlr-test-pyhss-latest/ws/_tes…
>:<
https://jenkins.osmocom.org/jenkins/job/ttcn3-hlr-test-pyhss-latest/ws/_tes…
>:<
https://jenkins.osmocom.org/jenkins/job/ttcn3-hlr-test-pyhss-latest/ws/hlr
>:/usr/local/bin:/usr/sbin:/usr/bin:/sbin:/bin', '-e', 'HOME=/home/osmocom-build', '-e', 'PYTHONUNBUFFERED=1', '-t', 'testenv-hlr-pyhss-osmocom-latest-20260817-1207-b4d2cfcc-1', 'install', '-Dm644', '<
https://jenkins.osmocom.org/jenkins/job/ttcn3-hlr-test-pyhss-latest/ws/hlr/…
',> '<
https://jenkins.osmocom.org/jenkins/job/ttcn3-hlr-test-pyhss-latest/287/art…
'][0m> [0;94m[testenv][pyhss] + ['podman', 'exec', '-e', 'CCACHE_DIR=/home/osmocom-build/ccache/testenv', '-e', 'TESTENV_CACHE_DIR=<
https://jenkins.osmocom.org/jenkins/job/ttcn3-hlr-test-pyhss-latest/ws/_cac…
',> '-e', 'TESTENV_SRC_DIR=/home/osmocom-build/jenkins/workspace', '-e', 'TESTENV_INSTALL_DIR=/', '-e', 'TERM=dumb', '-e', 'PATH=<
https://jenkins.osmocom.org/jenkins/job/ttcn3-hlr-test-pyhss-latest/ws/_tes…
>:<
https://jenkins.osmocom.org/jenkins/job/ttcn3-hlr-test-pyhss-latest/ws/_tes…
>:<
https://jenkins.osmocom.org/jenkins/job/ttcn3-hlr-test-pyhss-latest/ws/hlr
>:/usr/local/bin:/usr/sbin:/usr/bin:/sbin:/bin', '-e', 'HOME=/home/osmocom-build', '-e', 'PYTHONUNBUFFERED=1', '-t', 'testenv-hlr-pyhss-osmocom-latest-20260817-1207-b4d2cfcc-1', 'install', '-Dm644', '<
https://jenkins.osmocom.org/jenkins/job/ttcn3-hlr-test-pyhss-latest/ws/Comm…
',> '<
https://jenkins.osmocom.org/jenkins/job/ttcn3-hlr-test-pyhss-latest/287/art…
'][0m> [0;94m[testenv][pyhss] + ['podman', 'exec', '-e', 'CCACHE_DIR=/home/osmocom-build/ccache/testenv', '-e', 'TESTENV_CACHE_DIR=<
https://jenkins.osmocom.org/jenkins/job/ttcn3-hlr-test-pyhss-latest/ws/_cac…
',> '-e', 'TESTENV_SRC_DIR=/home/osmocom-build/jenkins/workspace', '-e', 'TESTENV_INSTALL_DIR=/', '-e', 'TERM=dumb', '-e', 'PATH=<
https://jenkins.osmocom.org/jenkins/job/ttcn3-hlr-test-pyhss-latest/ws/_tes…
>:<
https://jenkins.osmocom.org/jenkins/job/ttcn3-hlr-test-pyhss-latest/ws/_tes…
>:<
https://jenkins.osmocom.org/jenkins/job/ttcn3-hlr-test-pyhss-latest/ws/hlr
>:/usr/local/bin:/usr/sbin:/usr/bin:/sbin:/bin', '-e', 'HOME=/home/osmocom-build', '-e', 'PYTHONUNBUFFERED=1', '-t', 'testenv-hlr-pyhss-osmocom-latest-20260817-1207-b4d2cfcc-1', 'sed', '-i', 's#TTCN3_HACKS_PATH := .*#TTCN3_HACKS_PATH := "<
https://jenkins.osmocom.org/jenkins/job/ttcn3-hlr-test-pyhss-latest/ws/
">#', '<
https://jenkins.osmocom.org/jenkins/job/ttcn3-hlr-test-pyhss-latest/287/art…
'][0m> [0;94m[testenv][pyhss] Adjusting testsuite config: <
https://jenkins.osmocom.org/jenkins/job/ttcn3-hlr-test-pyhss-latest/287/art…
> [0;94m[testenv][pyhss] + ['podman', 'exec', '-e', 'CCACHE_DIR=/home/osmocom-build/ccache/testenv', '-e', 'TESTENV_CACHE_DIR=<
https://jenkins.osmocom.org/jenkins/job/ttcn3-hlr-test-pyhss-latest/ws/_cac…
',> '-e', 'TESTENV_SRC_DIR=/home/osmocom-build/jenkins/workspace', '-e', 'TESTENV_INSTALL_DIR=/', '-e', 'TERM=dumb', '-e', 'PATH=<
https://jenkins.osmocom.org/jenkins/job/ttcn3-hlr-test-pyhss-latest/ws/_tes…
>:<
https://jenkins.osmocom.org/jenkins/job/ttcn3-hlr-test-pyhss-latest/ws/_tes…
>:<
https://jenkins.osmocom.org/jenkins/job/ttcn3-hlr-test-pyhss-latest/ws/hlr
>:/usr/local/bin:/usr/sbin:/usr/bin:/sbin:/bin', '-e', 'HOME=/home/osmocom-build', '-e', 'PYTHONUNBUFFERED=1', '-t', 'testenv-hlr-pyhss-osmocom-latest-20260817-1207-b4d2cfcc-1', 'sed', '-i', '-e', 's/\\[MODULE_PARAMETERS\\]/\\[MODULE_PARAMETERS\\]\\nMisc_Helpers.mp_osmo_repo := "latest"/g', '-e', 's#../Common.cfg#Common.cfg#', '<
https://jenkins.osmocom.org/jenkins/job/ttcn3-hlr-test-pyhss-latest/287/art…
'][0m> [0;94m[testenv][pyhss] Adjusting testsuite config: <
https://jenkins.osmocom.org/jenkins/job/ttcn3-hlr-test-pyhss-latest/287/art…
> [0;94m[testenv][pyhss] + ['podman', 'exec', '-e', 'CCACHE_DIR=/home/osmocom-build/ccache/testenv', '-e', 'TESTENV_CACHE_DIR=<
https://jenkins.osmocom.org/jenkins/job/ttcn3-hlr-test-pyhss-latest/ws/_cac…
',> '-e', 'TESTENV_SRC_DIR=/home/osmocom-build/jenkins/workspace', '-e', 'TESTENV_INSTALL_DIR=/', '-e', 'TERM=dumb', '-e', 'PATH=<
https://jenkins.osmocom.org/jenkins/job/ttcn3-hlr-test-pyhss-latest/ws/_tes…
>:<
https://jenkins.osmocom.org/jenkins/job/ttcn3-hlr-test-pyhss-latest/ws/_tes…
>:<
https://jenkins.osmocom.org/jenkins/job/ttcn3-hlr-test-pyhss-latest/ws/hlr
>:/usr/local/bin:/usr/sbin:/usr/bin:/sbin:/bin', '-e', 'HOME=/home/osmocom-build', '-e', 'PYTHONUNBUFFERED=1', '-t', 'testenv-hlr-pyhss-osmocom-latest-20260817-1207-b4d2cfcc-1', 'sed', '-i', '-e', 's/\\[MODULE_PARAMETERS\\]/\\[MODULE_PARAMETERS\\]\\nMisc_Helpers.mp_osmo_repo := "latest"/g', '-e', 's#../Common.cfg#Common.cfg#', '<
https://jenkins.osmocom.org/jenkins/job/ttcn3-hlr-test-pyhss-latest/287/art…
'][0m> [0;94m[testenv][pyhss] Adjusting testsuite config: <
https://jenkins.osmocom.org/jenkins/job/ttcn3-hlr-test-pyhss-latest/287/art…
> [0;94m[testenv][pyhss] + ['podman', 'exec', '-e', 'CCACHE_DIR=/home/osmocom-build/ccache/testenv', '-e', 'TESTENV_CACHE_DIR=<
https://jenkins.osmocom.org/jenkins/job/ttcn3-hlr-test-pyhss-latest/ws/_cac…
',> '-e', 'TESTENV_SRC_DIR=/home/osmocom-build/jenkins/workspace', '-e', 'TESTENV_INSTALL_DIR=/', '-e', 'TERM=dumb', '-e', 'PATH=<
https://jenkins.osmocom.org/jenkins/job/ttcn3-hlr-test-pyhss-latest/ws/_tes…
>:<
https://jenkins.osmocom.org/jenkins/job/ttcn3-hlr-test-pyhss-latest/ws/_tes…
>:<
https://jenkins.osmocom.org/jenkins/job/ttcn3-hlr-test-pyhss-latest/ws/hlr
>:/usr/local/bin:/usr/sbin:/usr/bin:/sbin:/bin', '-e', 'HOME=/home/osmocom-build', '-e', 'PYTHONUNBUFFERED=1', '-t', 'testenv-hlr-pyhss-osmocom-latest-20260817-1207-b4d2cfcc-1', 'sed', '-i', '-e', 's/\\[MODULE_PARAMETERS\\]/\\[MODULE_PARAMETERS\\]\\nMisc_Helpers.mp_osmo_repo := "latest"/g', '-e', 's#../Common.cfg#Common.cfg#', '<
https://jenkins.osmocom.org/jenkins/job/ttcn3-hlr-test-pyhss-latest/287/art…
'][0m> [1;34m[testenv][pyhss] Running redis[0m [0;94m[testenv][pyhss] + ['podman', 'exec', '-e', 'CCACHE_DIR=/home/osmocom-build/ccache/testenv', '-e', 'TESTENV_CACHE_DIR=<
https://jenkins.osmocom.org/jenkins/job/ttcn3-hlr-test-pyhss-latest/ws/_cac…
',> '-e', 'TESTENV_SRC_DIR=/home/osmocom-build/jenkins/workspace', '-e', 'TESTENV_INSTALL_DIR=/', '-e', 'TERM=dumb', '-e', 'PATH=<
https://jenkins.osmocom.org/jenkins/job/ttcn3-hlr-test-pyhss-latest/ws/_tes…
>:<
https://jenkins.osmocom.org/jenkins/job/ttcn3-hlr-test-pyhss-latest/ws/_tes…
>:<
https://jenkins.osmocom.org/jenkins/job/ttcn3-hlr-test-pyhss-latest/ws/hlr
>:/usr/local/bin:/usr/sbin:/usr/bin:/sbin:/bin', '-e', 'HOME=/home/osmocom-build', '-e', 'PYTHONUNBUFFERED=1', '-w', '<
https://jenkins.osmocom.org/jenkins/job/ttcn3-hlr-test-pyhss-latest/287/art…
',> 'testenv-hlr-pyhss-osmocom-latest-20260817-1207-b4d2cfcc-1', 'sh', '-c', 'ulimit -c unlimited; redis-server ./redis.conf 2>&1 | tee <
https://jenkins.osmocom.org/jenkins/job/ttcn3-hlr-test-pyhss-latest/287/art…
'][0m> 1522:C 17 Aug 2026 12:07:32.939 # WARNING Memory overcommit must be enabled! Without it, a background save or replication may fail under low memory condition. Being disabled, it can also cause failures without low memory condition, see
https://github.com/jemalloc/jemalloc/issues/1328
. To fix this issue add 'vm.overcommit_memory = 1' to /etc/sysctl.conf and then reboot or run the command 'sysctl vm.overcommit_memory=1' for this to take effect. 1522:C 17 Aug 2026 12:07:32.939 * oO0OoO0OoO0Oo Redis is starting oO0OoO0OoO0Oo 1522:C 17 Aug 2026 12:07:32.939 * Redis version=8.0.2, bits=64, commit=00000000, modified=0, pid=1522, just started 1522:C 17 Aug 2026 12:07:32.939 * Configuration loaded 1522:M 17 Aug 2026 12:07:32.940 * monotonic clock: POSIX clock_gettime 1522:M 17 Aug 2026 12:07:32.941 * Running mode=standalone, port=6379. 1522:M 17 Aug 2026 12:07:32.941 * Server initialized 1522:M 17 Aug 2026 12:07:32.941 * Ready to accept connections tcp [1;34m[testenv][pyhss] Running pyhss_hss[0m [0;94m[testenv][pyhss] + ['podman', 'exec', '-e', 'CCACHE_DIR=/home/osmocom-build/ccache/testenv', '-e', 'TESTENV_CACHE_DIR=<
https://jenkins.osmocom.org/jenkins/job/ttcn3-hlr-test-pyhss-latest/ws/_cac…
',> '-e', 'TESTENV_SRC_DIR=/home/osmocom-build/jenkins/workspace', '-e', 'TESTENV_INSTALL_DIR=/', '-e', 'TERM=dumb', '-e', 'PATH=<
https://jenkins.osmocom.org/jenkins/job/ttcn3-hlr-test-pyhss-latest/ws/_tes…
>:<
https://jenkins.osmocom.org/jenkins/job/ttcn3-hlr-test-pyhss-latest/ws/_tes…
>:<
https://jenkins.osmocom.org/jenkins/job/ttcn3-hlr-test-pyhss-latest/ws/hlr
>:/usr/local/bin:/usr/sbin:/usr/bin:/sbin:/bin', '-e', 'HOME=/home/osmocom-build', '-e', 'PYTHONUNBUFFERED=1', '-w', '<
https://jenkins.osmocom.org/jenkins/job/ttcn3-hlr-test-pyhss-latest/287/art…
',> 'testenv-hlr-pyhss-osmocom-latest-20260817-1207-b4d2cfcc-1', 'sh', '-c', 'ulimit -c unlimited; cd ../pyhss_gsup && ./run_in_venv.sh pyhss_hss 2>&1 | tee <
https://jenkins.osmocom.org/jenkins/job/ttcn3-hlr-test-pyhss-latest/287/art…
'][0m> ./run_in_venv.sh: 12: pyhss_hss: not found [1;34m[testenv][pyhss] Looking for a coredump file[0m [1;91m[testenv][pyhss] program failed to start: cd ../pyhss_gsup && ./run_in_venv.sh pyhss_hss[0m [1;34m[testenv][pyhss] Stopping podman container[0m [0;94m[testenv][pyhss] + ['podman', 'kill', 'testenv-hlr-pyhss-osmocom-latest-20260817-1207-b4d2cfcc-1'][0m testenv-hlr-pyhss-osmocom-latest-20260817-1207-b4d2cfcc-1 [0;94m[testenv][pyhss] feed_watchdog_loop: podman container has stopped[0m [1;34m[testenv][pyhss] Logs saved to:
https://jenkins.osmocom.org/jenkins/job/ttcn3-hlr-test-pyhss-latest/287/art…
[0m + RC=1 + [ 1 = 0 ] + uptime + grep --color=always -o load.* [01;31m[Kload average: 2.03, 0.96, 0.55[m[K + exit 1 Build step 'Execute shell' marked build as failure Recording test results ERROR: Step ‘Publish JUnit test result report’ failed: No test report files were found. Configuration error?
1
1
0
0
Build failed in Jenkins: ttcn3-hlr-test-pyhss #287
by jenkins@lists.osmocom.org
18 Aug '26
18 Aug '26
See <
https://jenkins.osmocom.org/jenkins/job/ttcn3-hlr-test-pyhss/287/display/re…
> Changes: ------------------------------------------ [...truncated 159.99 KiB...] Unpacking python3-infinity (1.5-4) ... Selecting previously unselected package python3-sqlalchemy-utils. Preparing to unpack .../70-python3-sqlalchemy-utils_0.41.0-5_all.deb ... Unpacking python3-sqlalchemy-utils (0.41.0-5) ... Selecting previously unselected package python3-yaml. Preparing to unpack .../71-python3-yaml_6.0.2-1+b2_amd64.deb ... Unpacking python3-yaml (6.0.2-1+b2) ... Selecting previously unselected package python3-aniso8601. Preparing to unpack .../72-python3-aniso8601_10.0.1-1_all.deb ... Unpacking python3-aniso8601 (10.0.1-1) ... Selecting previously unselected package python3-rpds-py. Preparing to unpack .../73-python3-rpds-py_0.21.0-2+b1_amd64.deb ... Unpacking python3-rpds-py (0.21.0-2+b1) ... Selecting previously unselected package python3-referencing. Preparing to unpack .../74-python3-referencing_0.36.2-1_all.deb ... Unpacking python3-referencing (0.36.2-1) ... Selecting previously unselected package python3-jsonschema-specifications. Preparing to unpack .../75-python3-jsonschema-specifications_2023.12.1-2_all.deb ... Unpacking python3-jsonschema-specifications (2023.12.1-2) ... Selecting previously unselected package python3-jsonschema. Preparing to unpack .../76-python3-jsonschema_4.19.2-6_all.deb ... Unpacking python3-jsonschema (4.19.2-6) ... Selecting previously unselected package python3-asn1crypto. Preparing to unpack .../77-python3-asn1crypto_1.5.1-3_all.deb ... Unpacking python3-asn1crypto (1.5.1-3) ... Selecting previously unselected package python3-bitstruct. Preparing to unpack .../78-python3-bitstruct_8.20.0-2_amd64.deb ... Unpacking python3-bitstruct (8.20.0-2) ... Selecting previously unselected package python3-pyparsing. Preparing to unpack .../79-python3-pyparsing_3.1.2-1_all.deb ... Unpacking python3-pyparsing (3.1.2-1) ... Selecting previously unselected package python3-bitarray. Preparing to unpack .../80-python3-bitarray_2.9.2-1+b3_amd64.deb ... Unpacking python3-bitarray (2.9.2-1+b3) ... Selecting previously unselected package python3-bitstring. Preparing to unpack .../81-python3-bitstring_4.2.3-1_all.deb ... Unpacking python3-bitstring (4.2.3-1) ... Selecting previously unselected package python3-construct. Preparing to unpack .../82-python3-construct_2.10.68+dfsg1-2_all.deb ... Unpacking python3-construct (2.10.68+dfsg1-2) ... Selecting previously unselected package pyhss. Preparing to unpack .../83-pyhss_2.0.0.1538.47a3.202608171800_amd64.deb ... Unpacking pyhss (2.0.0.1538.47a3.202608171800) ... Selecting previously unselected package pyhss-dbgsym. Preparing to unpack .../84-pyhss-dbgsym_2.0.0.1538.47a3.202608171800_amd64.deb ... Unpacking pyhss-dbgsym (2.0.0.1538.47a3.202608171800) ... Selecting previously unselected package python3.13-dbg. Preparing to unpack .../85-python3.13-dbg_3.13.5-2+deb13u4_amd64.deb ... Unpacking python3.13-dbg (3.13.5-2+deb13u4) ... Selecting previously unselected package python3-dbg. Preparing to unpack .../86-python3-dbg_3.13.5-1_amd64.deb ... Unpacking python3-dbg (3.13.5-1) ... Setting up python3-attr (25.3.0-1) ... Setting up libxau6:amd64 (1:1.0.11-1) ... Setting up libxdmcp6:amd64 (1:1.1.5-1) ... Setting up libxcb1:amd64 (1.17.0-2+b1) ... Setting up python3-pydantic-core (2.27.2-3+b1) ... Setting up python3-pycryptodome (3.20.0+dfsg-3) ... Setting up python3-ply (3.11-9) ... Setting up x11-common (1:7.7+24+deb13u1) ... invoke-rc.d: could not determine current runlevel invoke-rc.d: policy-rc.d denied execution of start. Setting up python3-itsdangerous (2.2.0-2) ... Setting up python3-yaml (6.0.2-1+b2) ... Setting up python3-pytz (2025.2-3) ... Setting up python3-click (8.2.0+0.really.8.1.8-1) ... Setting up python3-markupsafe (2.1.5-1+b3) ... Setting up python3-annotated-types (0.7.0-1) ... Setting up python3-multidict (6.4.3-1) ... Setting up python3-tz (2025.2-3) ... Setting up python-babel-localedata (2.17.0-1) ... Setting up python3-frozenlist (1.6.0-1) ... Setting up libc6-dbg:amd64 (2.41-12+deb13u3) ... Setting up python3-aiosignal (1.3.2-1) ... Setting up python3-async-timeout (5.0.1-1) ... Setting up libpython3.13-minimal:amd64 (3.13.5-2+deb13u4) ... Setting up python3-bitarray (2.9.2-1+b3) ... Setting up python3-decorator (5.2.1-2) ... Setting up python3-jinja2 (3.1.6-1) ... Setting up python3-aniso8601 (10.0.1-1) ... Setting up python3-pyparsing (3.1.2-1) ... Setting up libfreetype6:amd64 (2.13.3+dfsg-1+deb13u1) ... Setting up libx11-data (2:1.8.12-1) ... Setting up python3-typeshed (0.0~git20241223.ea91db2-1) ... Setting up python3-werkzeug (3.1.3-2) ... Setting up python3-greenlet (3.1.0-1+b2) ... Setting up fonts-dejavu-mono (2.37-8) ... Setting up fonts-dejavu-core (2.37-8) ... Setting up python3-construct (2.10.68+dfsg1-2) ... Setting up python3-redis (6.1.0-2) ... Setting up python3-aiohappyeyeballs (2.6.1-1) ... Setting up python3-bitstruct (8.20.0-2) ... Setting up python3-rpds-py (0.21.0-2+b1) ... Setting up python3-pysmi (0.3.4-3) ... Setting up python3-infinity (1.5-4) ... Setting up python3-dnspython (2.7.0-1) ... Setting up python3-propcache (0.3.1-1) ... Setting up python3-pyasn1 (0.6.1-1+deb13u2) ... Setting up python3.13-minimal (3.13.5-2+deb13u4) ... Setting up libx11-6:amd64 (2:1.8.12-1) ... Setting up python3-dateutil (2.9.0-4) ... Setting up python3-email-validator (2.2.0-1) ... Setting up python3-msgpack (1.0.3-3+b4) ... Setting up python3-pyasyncore (1.0.2-3) ... Setting up python3-yarl (1.19.0-1) ... Setting up libpython3.13-stdlib:amd64 (3.13.5-2+deb13u4) ... Setting up python3-asn1crypto (1.5.1-3) ... Setting up python3-bitstring (4.2.3-1) ... Setting up python3-referencing (0.36.2-1) ... Setting up python3-blinker (1.9.0-1) ... Setting up libpython3.13:amd64 (3.13.5-2+deb13u4) ... Setting up python3-pysnmp4 (4.4.12-4) ... /usr/lib/python3/dist-packages/pysnmp/hlapi/asyncio/cmdgen.py:82: SyntaxWarning: invalid escape sequence '\*' \*varBinds : :py:class:`~pysnmp.smi.rfc1902.ObjectType` /usr/lib/python3/dist-packages/pysnmp/hlapi/asyncio/cmdgen.py:189: SyntaxWarning: invalid escape sequence '\*' \*varBinds : :py:class:`~pysnmp.smi.rfc1902.ObjectType` /usr/lib/python3/dist-packages/pysnmp/hlapi/asyncio/cmdgen.py:296: SyntaxWarning: invalid escape sequence '\*' \*varBinds : :py:class:`~pysnmp.smi.rfc1902.ObjectType` /usr/lib/python3/dist-packages/pysnmp/hlapi/asyncio/cmdgen.py:419: SyntaxWarning: invalid escape sequence '\*' \*varBinds : :py:class:`~pysnmp.smi.rfc1902.ObjectType` /usr/lib/python3/dist-packages/pysnmp/hlapi/asyncio/ntforg.py:71: SyntaxWarning: invalid escape sequence '\*' \*\*options : /usr/lib/python3/dist-packages/pysnmp/hlapi/asyncore/cmdgen.py:47: SyntaxWarning: invalid escape sequence '\*' \*varBinds : :py:class:`~pysnmp.smi.rfc1902.ObjectType` /usr/lib/python3/dist-packages/pysnmp/hlapi/asyncore/cmdgen.py:160: SyntaxWarning: invalid escape sequence '\*' \*varBinds : :py:class:`~pysnmp.smi.rfc1902.ObjectType` /usr/lib/python3/dist-packages/pysnmp/hlapi/asyncore/cmdgen.py:271: SyntaxWarning: invalid escape sequence '\*' \*varBinds : :py:class:`~pysnmp.smi.rfc1902.ObjectType` /usr/lib/python3/dist-packages/pysnmp/hlapi/asyncore/cmdgen.py:394: SyntaxWarning: invalid escape sequence '\*' \*varBinds : :py:class:`~pysnmp.smi.rfc1902.ObjectType` /usr/lib/python3/dist-packages/pysnmp/hlapi/asyncore/sync/cmdgen.py:45: SyntaxWarning: invalid escape sequence '\*' \*varBinds : :py:class:`~pysnmp.smi.rfc1902.ObjectType` /usr/lib/python3/dist-packages/pysnmp/hlapi/asyncore/sync/cmdgen.py:150: SyntaxWarning: invalid escape sequence '\*' \*varBinds : :py:class:`~pysnmp.smi.rfc1902.ObjectType` /usr/lib/python3/dist-packages/pysnmp/hlapi/asyncore/sync/cmdgen.py:257: SyntaxWarning: invalid escape sequence '\*' \*varBinds : :py:class:`~pysnmp.smi.rfc1902.ObjectType` /usr/lib/python3/dist-packages/pysnmp/hlapi/asyncore/sync/cmdgen.py:452: SyntaxWarning: invalid escape sequence '\*' \*varBinds : :py:class:`~pysnmp.smi.rfc1902.ObjectType` /usr/lib/python3/dist-packages/pysnmp/hlapi/asyncore/sync/ntforg.py:56: SyntaxWarning: invalid escape sequence '\*' \*\*options : /usr/lib/python3/dist-packages/pysnmp/hlapi/twisted/cmdgen.py:49: SyntaxWarning: invalid escape sequence '\*' \*varBinds : :class:`~pysnmp.smi.rfc1902.ObjectType` /usr/lib/python3/dist-packages/pysnmp/hlapi/twisted/cmdgen.py:167: SyntaxWarning: invalid escape sequence '\*' \*varBinds : :class:`~pysnmp.smi.rfc1902.ObjectType` /usr/lib/python3/dist-packages/pysnmp/hlapi/twisted/cmdgen.py:285: SyntaxWarning: invalid escape sequence '\*' \*varBinds : :class:`~pysnmp.smi.rfc1902.ObjectType` /usr/lib/python3/dist-packages/pysnmp/hlapi/twisted/cmdgen.py:427: SyntaxWarning: invalid escape sequence '\*' \*varBinds : :class:`~pysnmp.smi.rfc1902.ObjectType` /usr/lib/python3/dist-packages/pysnmp/hlapi/twisted/ntforg.py:61: SyntaxWarning: invalid escape sequence '\*' \*\*options : Setting up python3-arrow (1.3.0-1.1) ... Setting up libxrender1:amd64 (1:0.9.12-1) ... Setting up python3-babel (2.17.0-1) ... update-alternatives: using /usr/bin/pybabel-python3 to provide /usr/bin/pybabel (pybabel) in auto mode Setting up python3.13 (3.13.5-2+deb13u4) ... Setting up fontconfig-config (2.15.0-2.3) ... Setting up python3-influxdb (5.3.2-5) ... Setting up python3-flask (3.1.1-1) ... Setting up python3-aiohttp (3.11.16-1+deb13u1) ... Setting up libxext6:amd64 (2:1.3.4-1+b3) ... Setting up python3.13-venv (3.13.5-2+deb13u4) ... Setting up python3-sqlalchemy (2.0.40+ds1-1) ... Setting up python3-prometheus-client (0.21.1+ds1-1) ... Setting up python3-pydantic (2.10.6-2) ... Setting up libpython3.13-dev:amd64 (3.13.5-2+deb13u4) ... Setting up libxss1:amd64 (1:1.2.3-1+b3) ... Setting up python3-jsonschema-specifications (2023.12.1-2) ... Setting up python3-sqlalchemy-utils (0.41.0-5) ... Setting up python3-prometheus-flask-exporter (0.23.1-1) ... Setting up python3.13-dev (3.13.5-2+deb13u4) ... Setting up python3-jsonschema (4.19.2-6) ... Setting up pyhss (2.0.0.1538.47a3.202608171800) ... Creating group 'pyhss' with GID 990. Creating user 'pyhss' (n/a) with UID 990 and GID 990. Created symlink '/etc/systemd/system/multi-user.target.wants/pyhss_api.service' → '/usr/lib/systemd/system/pyhss_api.service'. Created symlink '/etc/systemd/system/pyhss.service.wants/pyhss_diameter.service' → '/usr/lib/systemd/system/pyhss_diameter.service'. Unit /usr/lib/systemd/system/pyhss_diameter.service is added as a dependency to a non-existent unit pyhss.service. Created symlink '/etc/systemd/system/multi-user.target.wants/pyhss_diameter.service' → '/usr/lib/systemd/system/pyhss_diameter.service'. Created symlink '/etc/systemd/system/pyhss.service.wants/pyhss_gsup.service' → '/usr/lib/systemd/system/pyhss_gsup.service'. Unit /usr/lib/systemd/system/pyhss_gsup.service is added as a dependency to a non-existent unit pyhss.service. Created symlink '/etc/systemd/system/multi-user.target.wants/pyhss_gsup.service' → '/usr/lib/systemd/system/pyhss_gsup.service'. Created symlink '/etc/systemd/system/pyhss.service.wants/pyhss_hss.service' → '/usr/lib/systemd/system/pyhss_hss.service'. Unit /usr/lib/systemd/system/pyhss_hss.service is added as a dependency to a non-existent unit pyhss.service. Created symlink '/etc/systemd/system/multi-user.target.wants/pyhss_hss.service' → '/usr/lib/systemd/system/pyhss_hss.service'. Created symlink '/etc/systemd/system/pyhss.service.wants/pyhss_metric.service' → '/usr/lib/systemd/system/pyhss_metric.service'. Unit /usr/lib/systemd/system/pyhss_metric.service is added as a dependency to a non-existent unit pyhss.service. Created symlink '/etc/systemd/system/multi-user.target.wants/pyhss_metric.service' → '/usr/lib/systemd/system/pyhss_metric.service'. Setting up pyhss-dbgsym (2.0.0.1538.47a3.202608171800) ... Processing triggers for libc-bin (2.41-12+deb13u3) ... Processing triggers for systemd (257.13-1~deb13u1) ... Processing triggers for sgml-base (1.31+nmu1) ... Setting up libfontconfig1:amd64 (2.15.0-2.3) ... Setting up libxft2:amd64 (2.3.6-1+b4) ... Setting up libtk8.6:amd64 (8.6.16-1) ... Setting up libpython3.13-dbg:amd64 (3.13.5-2+deb13u4) ... Setting up python3.13-dbg (3.13.5-2+deb13u4) ... python3.13-dbg: can't get files for byte-compilation Setting up libpython3-dbg:amd64 (3.13.5-1) ... Setting up python3-dbg (3.13.5-1) ... Processing triggers for libc-bin (2.41-12+deb13u3) ... [1;34m[testenv][pyhss] Preparing testdir: <
https://jenkins.osmocom.org/jenkins/job/ttcn3-hlr-test-pyhss/ws/logs[0m
> [0;94m[testenv][pyhss] + ['podman', 'exec', '-e', 'CCACHE_DIR=/home/osmocom-build/ccache/testenv', '-e', 'TESTENV_CACHE_DIR=<
https://jenkins.osmocom.org/jenkins/job/ttcn3-hlr-test-pyhss/ws/_cache
',> '-e', 'TESTENV_SRC_DIR=/home/osmocom-build/jenkins/workspace', '-e', 'TESTENV_INSTALL_DIR=/', '-e', 'TERM=dumb', '-e', 'PATH=<
https://jenkins.osmocom.org/jenkins/job/ttcn3-hlr-test-pyhss/ws/_testenv/da…
>:<
https://jenkins.osmocom.org/jenkins/job/ttcn3-hlr-test-pyhss/ws/_testenv/da…
>:<
https://jenkins.osmocom.org/jenkins/job/ttcn3-hlr-test-pyhss/ws/hlr
>:/usr/local/bin:/usr/sbin:/usr/bin:/sbin:/bin', '-e', 'HOME=/home/osmocom-build', '-e', 'PYTHONUNBUFFERED=1', '-t', 'testenv-hlr-pyhss-osmocom-nightly-20260818-0855-66e692bb-1', 'install', '-Dm644', '<
https://jenkins.osmocom.org/jenkins/job/ttcn3-hlr-test-pyhss/ws/hlr/HLR_Tes…
',> '<
https://jenkins.osmocom.org/jenkins/job/ttcn3-hlr-test-pyhss/287/artifact/l…
'][0m> [0;94m[testenv][pyhss] + ['cp', '-a', 'pyhss/HLR_Tests.cfg', '<
https://jenkins.osmocom.org/jenkins/job/ttcn3-hlr-test-pyhss/287/artifact/l…
'][0m> [0;94m[testenv][pyhss] + ['cp', '-a', 'pyhss/redis.conf', '<
https://jenkins.osmocom.org/jenkins/job/ttcn3-hlr-test-pyhss/287/artifact/l…
'][0m> [0;94m[testenv][pyhss] + ['cp', '-a', 'pyhss/config.yaml', 'pyhss/run_in_venv.sh', '<
https://jenkins.osmocom.org/jenkins/job/ttcn3-hlr-test-pyhss/287/artifact/l…
'][0m> [0;94m[testenv][pyhss] + ['cp', '-a', 'pyhss/setup_db.sh', '<
https://jenkins.osmocom.org/jenkins/job/ttcn3-hlr-test-pyhss/287/artifact/l…
'][0m> [0;94m[testenv][pyhss] + ['podman', 'exec', '-e', 'CCACHE_DIR=/home/osmocom-build/ccache/testenv', '-e', 'TESTENV_CACHE_DIR=<
https://jenkins.osmocom.org/jenkins/job/ttcn3-hlr-test-pyhss/ws/_cache
',> '-e', 'TESTENV_SRC_DIR=/home/osmocom-build/jenkins/workspace', '-e', 'TESTENV_INSTALL_DIR=/', '-e', 'TERM=dumb', '-e', 'PATH=<
https://jenkins.osmocom.org/jenkins/job/ttcn3-hlr-test-pyhss/ws/_testenv/da…
>:<
https://jenkins.osmocom.org/jenkins/job/ttcn3-hlr-test-pyhss/ws/_testenv/da…
>:<
https://jenkins.osmocom.org/jenkins/job/ttcn3-hlr-test-pyhss/ws/hlr
>:/usr/local/bin:/usr/sbin:/usr/bin:/sbin:/bin', '-e', 'HOME=/home/osmocom-build', '-e', 'PYTHONUNBUFFERED=1', '-t', 'testenv-hlr-pyhss-osmocom-nightly-20260818-0855-66e692bb-1', 'install', '-Dm644', '<
https://jenkins.osmocom.org/jenkins/job/ttcn3-hlr-test-pyhss/ws/hlr/HLR_Tes…
',> '<
https://jenkins.osmocom.org/jenkins/job/ttcn3-hlr-test-pyhss/287/artifact/l…
'][0m> [0;94m[testenv][pyhss] + ['podman', 'exec', '-e', 'CCACHE_DIR=/home/osmocom-build/ccache/testenv', '-e', 'TESTENV_CACHE_DIR=<
https://jenkins.osmocom.org/jenkins/job/ttcn3-hlr-test-pyhss/ws/_cache
',> '-e', 'TESTENV_SRC_DIR=/home/osmocom-build/jenkins/workspace', '-e', 'TESTENV_INSTALL_DIR=/', '-e', 'TERM=dumb', '-e', 'PATH=<
https://jenkins.osmocom.org/jenkins/job/ttcn3-hlr-test-pyhss/ws/_testenv/da…
>:<
https://jenkins.osmocom.org/jenkins/job/ttcn3-hlr-test-pyhss/ws/_testenv/da…
>:<
https://jenkins.osmocom.org/jenkins/job/ttcn3-hlr-test-pyhss/ws/hlr
>:/usr/local/bin:/usr/sbin:/usr/bin:/sbin:/bin', '-e', 'HOME=/home/osmocom-build', '-e', 'PYTHONUNBUFFERED=1', '-t', 'testenv-hlr-pyhss-osmocom-nightly-20260818-0855-66e692bb-1', 'install', '-Dm644', '<
https://jenkins.osmocom.org/jenkins/job/ttcn3-hlr-test-pyhss/ws/Common.cfg
',> '<
https://jenkins.osmocom.org/jenkins/job/ttcn3-hlr-test-pyhss/287/artifact/l…
'][0m> [0;94m[testenv][pyhss] + ['podman', 'exec', '-e', 'CCACHE_DIR=/home/osmocom-build/ccache/testenv', '-e', 'TESTENV_CACHE_DIR=<
https://jenkins.osmocom.org/jenkins/job/ttcn3-hlr-test-pyhss/ws/_cache
',> '-e', 'TESTENV_SRC_DIR=/home/osmocom-build/jenkins/workspace', '-e', 'TESTENV_INSTALL_DIR=/', '-e', 'TERM=dumb', '-e', 'PATH=<
https://jenkins.osmocom.org/jenkins/job/ttcn3-hlr-test-pyhss/ws/_testenv/da…
>:<
https://jenkins.osmocom.org/jenkins/job/ttcn3-hlr-test-pyhss/ws/_testenv/da…
>:<
https://jenkins.osmocom.org/jenkins/job/ttcn3-hlr-test-pyhss/ws/hlr
>:/usr/local/bin:/usr/sbin:/usr/bin:/sbin:/bin', '-e', 'HOME=/home/osmocom-build', '-e', 'PYTHONUNBUFFERED=1', '-t', 'testenv-hlr-pyhss-osmocom-nightly-20260818-0855-66e692bb-1', 'sed', '-i', 's#TTCN3_HACKS_PATH := .*#TTCN3_HACKS_PATH := "<
https://jenkins.osmocom.org/jenkins/job/ttcn3-hlr-test-pyhss/ws/
">#', '<
https://jenkins.osmocom.org/jenkins/job/ttcn3-hlr-test-pyhss/287/artifact/l…
'][0m> [0;94m[testenv][pyhss] Adjusting testsuite config: <
https://jenkins.osmocom.org/jenkins/job/ttcn3-hlr-test-pyhss/287/artifact/l…
> [0;94m[testenv][pyhss] + ['podman', 'exec', '-e', 'CCACHE_DIR=/home/osmocom-build/ccache/testenv', '-e', 'TESTENV_CACHE_DIR=<
https://jenkins.osmocom.org/jenkins/job/ttcn3-hlr-test-pyhss/ws/_cache
',> '-e', 'TESTENV_SRC_DIR=/home/osmocom-build/jenkins/workspace', '-e', 'TESTENV_INSTALL_DIR=/', '-e', 'TERM=dumb', '-e', 'PATH=<
https://jenkins.osmocom.org/jenkins/job/ttcn3-hlr-test-pyhss/ws/_testenv/da…
>:<
https://jenkins.osmocom.org/jenkins/job/ttcn3-hlr-test-pyhss/ws/_testenv/da…
>:<
https://jenkins.osmocom.org/jenkins/job/ttcn3-hlr-test-pyhss/ws/hlr
>:/usr/local/bin:/usr/sbin:/usr/bin:/sbin:/bin', '-e', 'HOME=/home/osmocom-build', '-e', 'PYTHONUNBUFFERED=1', '-t', 'testenv-hlr-pyhss-osmocom-nightly-20260818-0855-66e692bb-1', 'sed', '-i', '-e', 's/\\[MODULE_PARAMETERS\\]/\\[MODULE_PARAMETERS\\]\\nMisc_Helpers.mp_osmo_repo := "nightly"/g', '-e', 's#../Common.cfg#Common.cfg#', '<
https://jenkins.osmocom.org/jenkins/job/ttcn3-hlr-test-pyhss/287/artifact/l…
'][0m> [0;94m[testenv][pyhss] Adjusting testsuite config: <
https://jenkins.osmocom.org/jenkins/job/ttcn3-hlr-test-pyhss/287/artifact/l…
> [0;94m[testenv][pyhss] + ['podman', 'exec', '-e', 'CCACHE_DIR=/home/osmocom-build/ccache/testenv', '-e', 'TESTENV_CACHE_DIR=<
https://jenkins.osmocom.org/jenkins/job/ttcn3-hlr-test-pyhss/ws/_cache
',> '-e', 'TESTENV_SRC_DIR=/home/osmocom-build/jenkins/workspace', '-e', 'TESTENV_INSTALL_DIR=/', '-e', 'TERM=dumb', '-e', 'PATH=<
https://jenkins.osmocom.org/jenkins/job/ttcn3-hlr-test-pyhss/ws/_testenv/da…
>:<
https://jenkins.osmocom.org/jenkins/job/ttcn3-hlr-test-pyhss/ws/_testenv/da…
>:<
https://jenkins.osmocom.org/jenkins/job/ttcn3-hlr-test-pyhss/ws/hlr
>:/usr/local/bin:/usr/sbin:/usr/bin:/sbin:/bin', '-e', 'HOME=/home/osmocom-build', '-e', 'PYTHONUNBUFFERED=1', '-t', 'testenv-hlr-pyhss-osmocom-nightly-20260818-0855-66e692bb-1', 'sed', '-i', '-e', 's/\\[MODULE_PARAMETERS\\]/\\[MODULE_PARAMETERS\\]\\nMisc_Helpers.mp_osmo_repo := "nightly"/g', '-e', 's#../Common.cfg#Common.cfg#', '<
https://jenkins.osmocom.org/jenkins/job/ttcn3-hlr-test-pyhss/287/artifact/l…
'][0m> [0;94m[testenv][pyhss] Adjusting testsuite config: <
https://jenkins.osmocom.org/jenkins/job/ttcn3-hlr-test-pyhss/287/artifact/l…
> [0;94m[testenv][pyhss] + ['podman', 'exec', '-e', 'CCACHE_DIR=/home/osmocom-build/ccache/testenv', '-e', 'TESTENV_CACHE_DIR=<
https://jenkins.osmocom.org/jenkins/job/ttcn3-hlr-test-pyhss/ws/_cache
',> '-e', 'TESTENV_SRC_DIR=/home/osmocom-build/jenkins/workspace', '-e', 'TESTENV_INSTALL_DIR=/', '-e', 'TERM=dumb', '-e', 'PATH=<
https://jenkins.osmocom.org/jenkins/job/ttcn3-hlr-test-pyhss/ws/_testenv/da…
>:<
https://jenkins.osmocom.org/jenkins/job/ttcn3-hlr-test-pyhss/ws/_testenv/da…
>:<
https://jenkins.osmocom.org/jenkins/job/ttcn3-hlr-test-pyhss/ws/hlr
>:/usr/local/bin:/usr/sbin:/usr/bin:/sbin:/bin', '-e', 'HOME=/home/osmocom-build', '-e', 'PYTHONUNBUFFERED=1', '-t', 'testenv-hlr-pyhss-osmocom-nightly-20260818-0855-66e692bb-1', 'sed', '-i', '-e', 's/\\[MODULE_PARAMETERS\\]/\\[MODULE_PARAMETERS\\]\\nMisc_Helpers.mp_osmo_repo := "nightly"/g', '-e', 's#../Common.cfg#Common.cfg#', '<
https://jenkins.osmocom.org/jenkins/job/ttcn3-hlr-test-pyhss/287/artifact/l…
'][0m> [1;34m[testenv][pyhss] Running redis[0m [0;94m[testenv][pyhss] + ['podman', 'exec', '-e', 'CCACHE_DIR=/home/osmocom-build/ccache/testenv', '-e', 'TESTENV_CACHE_DIR=<
https://jenkins.osmocom.org/jenkins/job/ttcn3-hlr-test-pyhss/ws/_cache
',> '-e', 'TESTENV_SRC_DIR=/home/osmocom-build/jenkins/workspace', '-e', 'TESTENV_INSTALL_DIR=/', '-e', 'TERM=dumb', '-e', 'PATH=<
https://jenkins.osmocom.org/jenkins/job/ttcn3-hlr-test-pyhss/ws/_testenv/da…
>:<
https://jenkins.osmocom.org/jenkins/job/ttcn3-hlr-test-pyhss/ws/_testenv/da…
>:<
https://jenkins.osmocom.org/jenkins/job/ttcn3-hlr-test-pyhss/ws/hlr
>:/usr/local/bin:/usr/sbin:/usr/bin:/sbin:/bin', '-e', 'HOME=/home/osmocom-build', '-e', 'PYTHONUNBUFFERED=1', '-w', '<
https://jenkins.osmocom.org/jenkins/job/ttcn3-hlr-test-pyhss/287/artifact/l…
',> 'testenv-hlr-pyhss-osmocom-nightly-20260818-0855-66e692bb-1', 'sh', '-c', 'ulimit -c unlimited; redis-server ./redis.conf 2>&1 | tee <
https://jenkins.osmocom.org/jenkins/job/ttcn3-hlr-test-pyhss/287/artifact/l…
'][0m> 1524:C 18 Aug 2026 08:56:16.593 # WARNING Memory overcommit must be enabled! Without it, a background save or replication may fail under low memory condition. Being disabled, it can also cause failures without low memory condition, see
https://github.com/jemalloc/jemalloc/issues/1328
. To fix this issue add 'vm.overcommit_memory = 1' to /etc/sysctl.conf and then reboot or run the command 'sysctl vm.overcommit_memory=1' for this to take effect. 1524:C 18 Aug 2026 08:56:16.594 * oO0OoO0OoO0Oo Redis is starting oO0OoO0OoO0Oo 1524:C 18 Aug 2026 08:56:16.594 * Redis version=8.0.2, bits=64, commit=00000000, modified=0, pid=1524, just started 1524:C 18 Aug 2026 08:56:16.594 * Configuration loaded 1524:M 18 Aug 2026 08:56:16.594 * monotonic clock: POSIX clock_gettime 1524:M 18 Aug 2026 08:56:16.595 * Running mode=standalone, port=6379. 1524:M 18 Aug 2026 08:56:16.595 * Server initialized 1524:M 18 Aug 2026 08:56:16.595 * Ready to accept connections tcp [1;34m[testenv][pyhss] Running pyhss_hss[0m [0;94m[testenv][pyhss] + ['podman', 'exec', '-e', 'CCACHE_DIR=/home/osmocom-build/ccache/testenv', '-e', 'TESTENV_CACHE_DIR=<
https://jenkins.osmocom.org/jenkins/job/ttcn3-hlr-test-pyhss/ws/_cache
',> '-e', 'TESTENV_SRC_DIR=/home/osmocom-build/jenkins/workspace', '-e', 'TESTENV_INSTALL_DIR=/', '-e', 'TERM=dumb', '-e', 'PATH=<
https://jenkins.osmocom.org/jenkins/job/ttcn3-hlr-test-pyhss/ws/_testenv/da…
>:<
https://jenkins.osmocom.org/jenkins/job/ttcn3-hlr-test-pyhss/ws/_testenv/da…
>:<
https://jenkins.osmocom.org/jenkins/job/ttcn3-hlr-test-pyhss/ws/hlr
>:/usr/local/bin:/usr/sbin:/usr/bin:/sbin:/bin', '-e', 'HOME=/home/osmocom-build', '-e', 'PYTHONUNBUFFERED=1', '-w', '<
https://jenkins.osmocom.org/jenkins/job/ttcn3-hlr-test-pyhss/287/artifact/l…
',> 'testenv-hlr-pyhss-osmocom-nightly-20260818-0855-66e692bb-1', 'sh', '-c', 'ulimit -c unlimited; cd ../pyhss_gsup && ./run_in_venv.sh pyhss_hss 2>&1 | tee <
https://jenkins.osmocom.org/jenkins/job/ttcn3-hlr-test-pyhss/287/artifact/l…
'][0m> [1;34m[testenv][pyhss] Running pyhss_gsup[0m [0;94m[testenv][pyhss] + ['podman', 'exec', '-e', 'CCACHE_DIR=/home/osmocom-build/ccache/testenv', '-e', 'TESTENV_CACHE_DIR=<
https://jenkins.osmocom.org/jenkins/job/ttcn3-hlr-test-pyhss/ws/_cache
',> '-e', 'TESTENV_SRC_DIR=/home/osmocom-build/jenkins/workspace', '-e', 'TESTENV_INSTALL_DIR=/', '-e', 'TERM=dumb', '-e', 'PATH=<
https://jenkins.osmocom.org/jenkins/job/ttcn3-hlr-test-pyhss/ws/_testenv/da…
>:<
https://jenkins.osmocom.org/jenkins/job/ttcn3-hlr-test-pyhss/ws/_testenv/da…
>:<
https://jenkins.osmocom.org/jenkins/job/ttcn3-hlr-test-pyhss/ws/hlr
>:/usr/local/bin:/usr/sbin:/usr/bin:/sbin:/bin', '-e', 'HOME=/home/osmocom-build', '-e', 'PYTHONUNBUFFERED=1', '-w', '<
https://jenkins.osmocom.org/jenkins/job/ttcn3-hlr-test-pyhss/287/artifact/l…
',> 'testenv-hlr-pyhss-osmocom-nightly-20260818-0855-66e692bb-1', 'sh', '-c', 'ulimit -c unlimited; ./run_in_venv.sh pyhss_gsup 2>&1 | tee <
https://jenkins.osmocom.org/jenkins/job/ttcn3-hlr-test-pyhss/287/artifact/l…
'][0m> ./run_in_venv.sh: 12: pyhss_hss: not found [1;34m[testenv][pyhss] Running pyhss_gsup setup script[0m [0;94m[testenv][pyhss] + ['podman', 'exec', '-e', 'CCACHE_DIR=/home/osmocom-build/ccache/testenv', '-e', 'TESTENV_CACHE_DIR=<
https://jenkins.osmocom.org/jenkins/job/ttcn3-hlr-test-pyhss/ws/_cache
',> '-e', 'TESTENV_SRC_DIR=/home/osmocom-build/jenkins/workspace', '-e', 'TESTENV_INSTALL_DIR=/', '-e', 'TERM=dumb', '-e', 'PATH=<
https://jenkins.osmocom.org/jenkins/job/ttcn3-hlr-test-pyhss/ws/_testenv/da…
>:<
https://jenkins.osmocom.org/jenkins/job/ttcn3-hlr-test-pyhss/ws/_testenv/da…
>:<
https://jenkins.osmocom.org/jenkins/job/ttcn3-hlr-test-pyhss/ws/hlr
>:/usr/local/bin:/usr/sbin:/usr/bin:/sbin:/bin', '-e', 'HOME=/home/osmocom-build', '-e', 'PYTHONUNBUFFERED=1', '-t', '-w', '<
https://jenkins.osmocom.org/jenkins/job/ttcn3-hlr-test-pyhss/287/artifact/l…
',> 'testenv-hlr-pyhss-osmocom-nightly-20260818-0855-66e692bb-1', 'sh', '-c', 'wait_for_port.py -p 4222'][0m ./run_in_venv.sh: 12: pyhss_gsup: not found ERROR: 127.0.0.1:4222 did not become available within 5s! [1;91m[testenv][pyhss] pyhss_gsup: setup script failed[0m [1;34m[testenv][pyhss] Stopping podman container[0m [0;94m[testenv][pyhss] + ['podman', 'kill', 'testenv-hlr-pyhss-osmocom-nightly-20260818-0855-66e692bb-1'][0m testenv-hlr-pyhss-osmocom-nightly-20260818-0855-66e692bb-1 [0;94m[testenv][pyhss] feed_watchdog_loop: podman container has stopped[0m [1;34m[testenv][pyhss] Logs saved to:
https://jenkins.osmocom.org/jenkins/job/ttcn3-hlr-test-pyhss/287/artifact/l…
[0m + RC=1 + [ 1 = 0 ] + uptime + grep --color=always -o load.* [01;31m[Kload average: 12.87, 5.67, 3.01[m[K + exit 1 Build step 'Execute shell' marked build as failure Recording test results ERROR: Step ‘Publish JUnit test result report’ failed: No test report files were found. Configuration error?
1
0
0
0
Build failed in Jenkins: ttcn3-bts-test-io_uring #828
by jenkins@lists.osmocom.org
18 Aug '26
18 Aug '26
See <
https://jenkins.osmocom.org/jenkins/job/ttcn3-bts-test-io_uring/828/display…
> Changes: ------------------------------------------ [...truncated 12.51 MiB...] <failure type='fail-verdict'>"BTS_Tests.ttcn:732 : Tguard timeout" BTS_Tests.ttcn:9557 BTS_Tests control part BTS_Tests.ttcn:7525 TC_rll_rel_req testcase </failure> </testcase> <testcase classname='BTS_Tests:hopping' name='TC_rll_unit_data_req_DCCH' time='2.132440'/> <testcase classname='BTS_Tests:hopping' name='TC_rll_unit_data_req_ACCH' time='4.891605'/> <testcase classname='BTS_Tests:hopping' name='TC_rll_unit_data_ind_DCCH' time='2.956857'/> <testcase classname='BTS_Tests:hopping' name='TC_rll_unit_data_ind_ACCH' time='10.602816'/> <testcase classname='BTS_Tests:hopping' name='TC_chan_act_a51' time='2.660357'/> <testcase classname='BTS_Tests:hopping' name='TC_chan_act_a52' time='2.734199'/> <testcase classname='BTS_Tests:hopping' name='TC_chan_act_a53' time='5.588452'/> <testcase classname='BTS_Tests:hopping' name='TC_chan_act_a54' time='2.734556'/> <testcase classname='BTS_Tests:hopping' name='TC_encr_cmd_a51' time='5.283234'/> <testcase classname='BTS_Tests:hopping' name='TC_encr_cmd_a52' time='5.251233'/> <testcase classname='BTS_Tests:hopping' name='TC_encr_cmd_a53' time='5.212290'/> <testcase classname='BTS_Tests:hopping' name='TC_encr_cmd_a54' time='5.306663'/> <testcase classname='BTS_Tests:hopping' name='TC_err_rep_wrong_mdisc' time='1.170153'/> <testcase classname='BTS_Tests:hopping' name='TC_err_rep_wrong_msg_type' time='1.312323'/> <testcase classname='BTS_Tests:hopping' name='TC_err_rep_wrong_sequence' time='1.244272'/> <testcase classname='BTS_Tests:hopping' name='TC_lapdm_selftest' time='0.001967'/> <testcase classname='BTS_Tests:hopping' name='TC_tch_sign_l2_fill_frame' time='18.322060'/> <testcase classname='BTS_Tests:hopping' name='TC_tch_sign_l2_fill_frame_dtxd' time='2.148833'> <failure type='fail-verdict'>Received DTX TCH fill frame with bad frame number: 175 (mod 104: 71) (mod 26: 19) BTS_Tests.ttcn:9579 BTS_Tests control part BTS_Tests.ttcn:8110 TC_tch_sign_l2_fill_frame_dtxd testcase </failure> </testcase> <testcase classname='BTS_Tests:hopping' name='TC_chopped_ipa_ping' time='24.729030'/> <testcase classname='BTS_Tests:hopping' name='TC_chopped_ipa_payload' time='42.510389'/> <testcase classname='BTS_Tests:hopping' name='TC_ms_pwr_ctrl_constant' time='16.463622'/> <testcase classname='BTS_Tests:hopping' name='TC_ms_pwr_ctrl_pf_ewma' time='32.040877'/> <testcase classname='BTS_Tests:hopping' name='TC_speech_no_rtp_tchf' time='7.446948'/> <testcase classname='BTS_Tests:hopping' name='TC_speech_no_rtp_tchh' time='5.519426'/> <testcase classname='BTS_Tests:hopping' name='TC_speech_rtp_tchf' time='7.705081'/> <testcase classname='BTS_Tests:hopping' name='TC_speech_rtp_tchh' time='5.525558'/> <testcase classname='BTS_Tests:hopping' name='TC_speech_osmux_tchf' time='3.448545'/> <testcase classname='BTS_Tests:hopping' name='TC_speech_osmux_tchh' time='3.513907'/> <testcase classname='BTS_Tests:hopping' name='TC_data_rtp_tchf144' time='2.219480'/> <testcase classname='BTS_Tests:hopping' name='TC_data_rtp_tchf96' time='2.156509'/> <testcase classname='BTS_Tests:hopping' name='TC_data_rtp_tchf48' time='2.191826'/> <testcase classname='BTS_Tests:hopping' name='TC_data_rtp_tchh48' time='5.314330'> <failure type='fail-verdict'>Timeout waiting for matching Downlink data frame BTS_Tests.ttcn:9597 BTS_Tests control part BTS_Tests.ttcn:8880 TC_data_rtp_tchh48 testcase </failure> </testcase> <testcase classname='BTS_Tests:hopping' name='TC_data_rtp_tchf24' time='1.830034'/> <testcase classname='BTS_Tests:hopping' name='TC_data_rtp_tchh24' time='5.350993'> <failure type='fail-verdict'>Timeout waiting for matching Downlink data frame BTS_Tests.ttcn:9599 BTS_Tests control part BTS_Tests.ttcn:8949 TC_data_rtp_tchh24 testcase </failure> </testcase> <testcase classname='BTS_Tests:hopping' name='TC_data_facch_tchf144' time='2.006915'/> <testcase classname='BTS_Tests:hopping' name='TC_data_facch_tchf96' time='2.031585'/> <testcase classname='BTS_Tests:hopping' name='TC_data_facch_tchf48' time='1.977954'/> <testcase classname='BTS_Tests:hopping' name='TC_data_facch_tchh48' time='2.208056'/> <testcase classname='BTS_Tests:hopping' name='TC_data_facch_tchf24' time='1.995485'/> <testcase classname='BTS_Tests:hopping' name='TC_data_facch_tchh24' time='2.171332'/> <testcase classname='BTS_Tests:hopping' name='TC_early_immediate_assignment' time='3.559261'/> <testcase classname='BTS_Tests:hopping' name='TC_acch_overpower_rxqual_thresh' time='9.074149'> <failure type='fail-verdict'>Timeout waiting for L1CTL DATA.ind BTS_Tests.ttcn:9610 BTS_Tests control part BTS_Tests.ttcn:9244 TC_acch_overpower_rxqual_thresh testcase </failure> </testcase> <testcase classname='BTS_Tests:hopping' name='TC_acch_overpower_rxqual_thresh_dtx' time='9.013842'> <failure type='fail-verdict'>Timeout waiting for L1CTL DATA.ind BTS_Tests.ttcn:9611 BTS_Tests control part BTS_Tests.ttcn:9285 TC_acch_overpower_rxqual_thresh_dtx testcase </failure> </testcase> <testcase classname='BTS_Tests:hopping' name='TC_acch_overpower_always_on_facch' time='9.023071'> <failure type='fail-verdict'>Timeout waiting for L1CTL DATA.ind BTS_Tests.ttcn:9612 BTS_Tests control part BTS_Tests.ttcn:9317 TC_acch_overpower_always_on_facch testcase </failure> </testcase> <testcase classname='BTS_Tests:hopping' name='TC_acch_overpower_always_on_sacch' time='9.039275'> <failure type='fail-verdict'>Timeout waiting for L1CTL DATA.ind BTS_Tests.ttcn:9613 BTS_Tests control part BTS_Tests.ttcn:9349 TC_acch_overpower_always_on_sacch testcase </failure> </testcase> <testcase classname='BTS_Tests:hopping' name='TC_acch_overpower_limit' time='9.024883'> <failure type='fail-verdict'>Timeout waiting for L1CTL DATA.ind BTS_Tests.ttcn:9614 BTS_Tests control part BTS_Tests.ttcn:9380 TC_acch_overpower_limit testcase </failure> </testcase> <testcase classname='BTS_Tests_SMSCB:hopping' name='TC_cbch_load_idle_no_cbch' time='11.176812'/> <testcase classname='BTS_Tests_SMSCB:hopping' name='TC_sms_cb_cmd_sdcch4_1block' time='14.260886'/> <testcase classname='BTS_Tests_SMSCB:hopping' name='TC_sms_cb_cmd_sdcch4_2block' time='14.215597'/> <testcase classname='BTS_Tests_SMSCB:hopping' name='TC_sms_cb_cmd_sdcch4_3block' time='14.215682'/> <testcase classname='BTS_Tests_SMSCB:hopping' name='TC_sms_cb_cmd_sdcch4_4block' time='14.209017'/> <testcase classname='BTS_Tests_SMSCB:hopping' name='TC_sms_cb_cmd_sdcch4_multi' time='20.223918'/> <testcase classname='BTS_Tests_SMSCB:hopping' name='TC_sms_cb_cmd_sdcch4_schedule' time='14.170201'/> <testcase classname='BTS_Tests_SMSCB:hopping' name='TC_sms_cb_cmd_sdcch4_default_only' time='16.228413'/> <testcase classname='BTS_Tests_SMSCB:hopping' name='TC_sms_cb_cmd_sdcch4_default_and_normal' time='17.194689'/> <testcase classname='BTS_Tests_SMSCB:hopping' name='TC_sms_cb_cmd_sdcch4_default_then_null' time='26.135170'/> <testcase classname='BTS_Tests_SMSCB:hopping' name='TC_cbc_sdcch4_load_idle' time='16.036285'/> <testcase classname='BTS_Tests_SMSCB:hopping' name='TC_cbc_sdcch4_load_overload' time='18.226792'/> <testcase classname='BTS_Tests_SMSCB:hopping' name='TC_sms_cb_cmd_sdcch8_1block' time='14.219289'/> <testcase classname='BTS_Tests_SMSCB:hopping' name='TC_sms_cb_cmd_sdcch8_2block' time='14.233537'/> <testcase classname='BTS_Tests_SMSCB:hopping' name='TC_sms_cb_cmd_sdcch8_3block' time='14.224904'/> <testcase classname='BTS_Tests_SMSCB:hopping' name='TC_sms_cb_cmd_sdcch8_4block' time='14.243998'/> <testcase classname='BTS_Tests_SMSCB:hopping' name='TC_sms_cb_cmd_sdcch8_multi' time='20.193326'/> <testcase classname='BTS_Tests_SMSCB:hopping' name='TC_sms_cb_cmd_sdcch8_schedule' time='14.230514'/> <testcase classname='BTS_Tests_SMSCB:hopping' name='TC_sms_cb_cmd_sdcch8_default_only' time='16.205245'/> <testcase classname='BTS_Tests_SMSCB:hopping' name='TC_sms_cb_cmd_sdcch8_default_and_normal' time='21.052678'/> <testcase classname='BTS_Tests_SMSCB:hopping' name='TC_cbc_sdcch8_load_idle' time='16.172942'/> <testcase classname='BTS_Tests_SMSCB:hopping' name='TC_cbc_sdcch8_load_overload' time='18.202383'/> <testcase classname='BTS_Tests_SMSCB:hopping' name='TC_etws_p1ro' time='12.159650'/> <testcase classname='BTS_Tests_SMSCB:hopping' name='TC_etws_p1ro_end' time='16.144876'/> <testcase classname='BTS_Tests_SMSCB:hopping' name='TC_etws_pcu' time='1.130064'/> <testcase classname='BTS_Tests_LAPDm:hopping' name='TC_sabm_ua_dcch_sapi0' time='2.903071'/> <testcase classname='BTS_Tests_LAPDm:hopping' name='TC_sabm_ua_dcch_sapi0_nopayload' time='21.523031'/> <testcase classname='BTS_Tests_LAPDm:hopping' name='TC_sabm_ua_dcch_sapi3' time='21.344080'/> <testcase classname='BTS_Tests_LAPDm:hopping' name='TC_sabm_ua_dcch_sapi4' time='21.248720'/> <testcase classname='BTS_Tests_LAPDm:hopping' name='TC_sabm_contention' time='21.342543'/> <testcase classname='BTS_Tests_LAPDm:hopping' name='TC_sabm_retransmit' time='3.152014'/> <testcase classname='BTS_Tests_LAPDm:hopping' name='TC_sabm_retransmit_bts' time='81.463118'/> <testcase classname='BTS_Tests_LAPDm:hopping' name='TC_sabm_invalid_resp' time='23.326013'/> <testcase classname='BTS_Tests_LAPDm:hopping' name='TC_sabm_dm' time='14.037466'/> <testcase classname='BTS_Tests_LAPDm:hopping' name='TC_establish_ign_first_sabm' time='7.982868'/> <testcase classname='BTS_Tests_LAPDm:hopping' name='TC_iframe_seq_and_ack' time='29.599759'> <failure type='fail-verdict'>Received RSL ERROR IND { msg_disc := { msg_group := RSL_MDISC_RLL (1), transparent := false }, msg_type := RSL_MT_ERROR_IND (3), ies := { { iei := RSL_IE_CHAN_NR (1), body := { chan_nr := { u := { sdcch8 := { tag := '01'B, sub_chan := 4 } }, tn := 6 } } }, { iei := RSL_IE_LINK_IDENT (2), body := { link_id := { c := FACCH_SDCCH (0), na := false, prio := SAPI0_PRIO_NORMAL (0), sapi := 0 } } }, { iei := RSL_IE_RLM_CAUSE (22), body := { rlm_cause := { len := 1, payload := '01'O } } } } } BTS_Tests_LAPDm.ttcn:1484 BTS_Tests_LAPDm control part BTS_Tests_LAPDm.ttcn:579 TC_iframe_seq_and_ack testcase </failure> </testcase> <testcase classname='BTS_Tests_LAPDm:hopping' name='TC_iframe_timer_recovery' time='24.614528'> <failure type='fail-verdict'>Received RSL ERROR IND { msg_disc := { msg_group := RSL_MDISC_RLL (1), transparent := false }, msg_type := RSL_MT_ERROR_IND (3), ies := { { iei := RSL_IE_CHAN_NR (1), body := { chan_nr := { u := { sdcch8 := { tag := '01'B, sub_chan := 4 } }, tn := 6 } } }, { iei := RSL_IE_LINK_IDENT (2), body := { link_id := { c := FACCH_SDCCH (0), na := false, prio := SAPI0_PRIO_NORMAL (0), sapi := 0 } } }, { iei := RSL_IE_RLM_CAUSE (22), body := { rlm_cause := { len := 1, payload := '01'O } } } } } BTS_Tests_LAPDm.ttcn:1485 BTS_Tests_LAPDm control part BTS_Tests_LAPDm.ttcn:685 TC_iframe_timer_recovery testcase </failure> </testcase> <testcase classname='BTS_Tests_LAPDm:hopping' name='TC_ns_seq_error' time='29.592391'> <failure type='fail-verdict'>"BTS_Tests.ttcn:732 : Tguard timeout" BTS_Tests_LAPDm.ttcn:1486 BTS_Tests_LAPDm control part BTS_Tests_LAPDm.ttcn:768 TC_ns_seq_error testcase </failure> </testcase> <testcase classname='BTS_Tests_LAPDm:hopping' name='TC_nr_seq_error' time='2.863504'/> <testcase classname='BTS_Tests_LAPDm:hopping' name='TC_rec_invalid_frame' time='119.143721'> <failure type='fail-verdict'>"BTS_Tests_LAPDm.ttcn:909 : Missing LAPDm_RR RSP" BTS_Tests_LAPDm.ttcn:1488 BTS_Tests_LAPDm control part BTS_Tests_LAPDm.ttcn:961 TC_rec_invalid_frame testcase </failure> </testcase> <testcase classname='BTS_Tests_LAPDm:hopping' name='TC_segm_concat_dcch' time='13.517702'> <failure type='fail-verdict'>"BTS_Tests_LAPDm.ttcn:1023 : received unexpected LAPDm { sacch := false, sapi := 0, lapdm := { ab := { addr := { spare := '0'B, lpd := 0, sapi := 0, c_r := false, ea := true }, ctrl := { s := { n_r := 1, p_f := false, s := '10'B, spare := '01'B } }, len := 0, m := false, el := 1, payload := ''O, padding := '2B2B2B2B2B2B2B2B2B2B2B2B2B2B2B2B2B2B2B2B'O (\"++++++++++++++++++++\") } } }" BTS_Tests_LAPDm.ttcn:1489 BTS_Tests_LAPDm control part BTS_Tests_LAPDm.ttcn:1088 TC_segm_concat_dcch testcase </failure> </testcase> <testcase classname='BTS_Tests_LAPDm:hopping' name='TC_segm_concat_sacch' time='48.532957'> <failure type='fail-verdict'>"BTS_Tests_LAPDm.ttcn:1023 : received unexpected LAPDm { sacch := true, sapi := 0, lapdm := { ab := { addr := { spare := '0'B, lpd := 0, sapi := 0, c_r := false, ea := true }, ctrl := { u := { u := '011'B, p_f := true, u2 := '00'B, spare := '11'B } }, len := 0, m := false, el := 1, payload := ''O, padding := '2B2B2B2B2B2B2B2B2B2B2B2B2B2B2B2B2B2B'O (\"++++++++++++++++++\") } } }" BTS_Tests_LAPDm.ttcn:1490 BTS_Tests_LAPDm control part BTS_Tests_LAPDm.ttcn:1093 TC_segm_concat_sacch testcase </failure> </testcase> <testcase classname='BTS_Tests_LAPDm:hopping' name='TC_t200_n200' time='39.844484'> <failure type='fail-verdict'>Missing RSL RLL ERROR INDICATION BTS_Tests_LAPDm.ttcn:1491 BTS_Tests_LAPDm control part BTS_Tests_LAPDm.ttcn:1182 TC_t200_n200 testcase </failure> </testcase> <testcase classname='BTS_Tests_LAPDm:hopping' name='TC_rr_response_frame_loss' time='6.692758'> <failure type='fail-verdict'>Timeout waiting for RR or REJ BTS_Tests_LAPDm.ttcn:1492 BTS_Tests_LAPDm control part BTS_Tests_LAPDm.ttcn:1239 TC_rr_response_frame_loss testcase </failure> </testcase> <testcase classname='BTS_Tests_LAPDm:hopping' name='TC_incorrect_cr' time='15.801214'/> <testcase classname='BTS_Tests_LAPDm:hopping' name='TC_sabm_incorrect_c' time='23.301706'> <failure type='fail-verdict'>"BTS_Tests.ttcn:732 : Tguard timeout" BTS_Tests_LAPDm.ttcn:1494 BTS_Tests_LAPDm control part BTS_Tests_LAPDm.ttcn:1341 TC_sabm_incorrect_c testcase </failure> </testcase> <testcase classname='BTS_Tests_LAPDm:hopping' name='TC_normal_reestablishment' time='16.116415'> <failure type='fail-verdict'>"BTS_Tests_LAPDm.ttcn:1023 : received unexpected LAPDm { sacch := false, sapi := 0, lapdm := { ab := { addr := { spare := '0'B, lpd := 0, sapi := 0, c_r := false, ea := true }, ctrl := { u := { u := '011'B, p_f := true, u2 := '00'B, spare := '11'B } }, len := 5, m := false, el := 1, payload := '4411BD14ED'O, padding := '2B2B2B2B2B2B2B2B2B2B2B2B2B2B2B'O (\"+++++++++++++++\") } } }" BTS_Tests_LAPDm.ttcn:1495 BTS_Tests_LAPDm control part BTS_Tests_LAPDm.ttcn:1403 TC_normal_reestablishment testcase </failure> </testcase> <testcase classname='BTS_Tests_LAPDm:hopping' name='TC_normal_reestablishment_state_unacked' time='12.386356'> <failure type='fail-verdict'>"BTS_Tests_LAPDm.ttcn:1023 : received unexpected LAPDm { sacch := false, sapi := 0, lapdm := { ab := { addr := { spare := '0'B, lpd := 0, sapi := 0, c_r := false, ea := true }, ctrl := { s := { n_r := 1, p_f := false, s := '10'B, spare := '01'B } }, len := 0, m := false, el := 1, payload := ''O, padding := '2B2B2B2B2B2B2B2B2B2B2B2B2B2B2B2B2B2B2B2B'O (\"++++++++++++++++++++\") } } }" BTS_Tests_LAPDm.ttcn:1496 BTS_Tests_LAPDm control part BTS_Tests_LAPDm.ttcn:1470 TC_normal_reestablishment_state_unacked testcase </failure> </testcase> <testcase classname='BTS_Tests_VAMOS:hopping' name='TC_vamos_chan_act_vff' time='2.438630'/> <testcase classname='BTS_Tests_VAMOS:hopping' name='TC_vamos_chan_act_vhh' time='2.577547'/> <testcase classname='BTS_Tests_VAMOS:hopping' name='TC_vamos_chan_act_hvhh' time='2.575218'/> <testcase classname='BTS_Tests_VAMOS:hopping' name='TC_vamos_chan_act_dyn_ipa_vff' time='2.560080'/> <testcase classname='BTS_Tests_VAMOS:hopping' name='TC_vamos_chan_act_dyn_osmo_vff' time='2.556160'/> <testcase classname='BTS_Tests_VAMOS:hopping' name='TC_vamos_chan_act_dyn_osmo_vhh' time='2.587615'/> <testcase classname='BTS_Tests_VAMOS:hopping' name='TC_vamos_chan_act_dyn_osmo_hvhh' time='2.556706'/> <testcase classname='BTS_Tests_VAMOS:hopping' name='TC_vamos_chan_mode_modify_vff' time='1.332870'/> <testcase classname='BTS_Tests_VAMOS:hopping' name='TC_vamos_chan_mode_modify_vhh' time='1.374119'/> <testcase classname='BTS_Tests_VAMOS:hopping' name='TC_vamos_chan_mode_modify_hvhh' time='1.380458'/> <testcase classname='BTS_Tests_VAMOS:hopping' name='TC_vamos_chan_mode_modify_dyn_ipa_vff' time='1.338890'/> <testcase classname='BTS_Tests_VAMOS:hopping' name='TC_vamos_chan_mode_modify_dyn_osmo_vff' time='1.341380'/> <testcase classname='BTS_Tests_VAMOS:hopping' name='TC_vamos_chan_mode_modify_dyn_osmo_vhh' time='1.376042'/> <testcase classname='BTS_Tests_VAMOS:hopping' name='TC_vamos_chan_mode_modify_dyn_osmo_hvhh' time='1.364460'/> <testcase classname='BTS_Tests_ASCI:hopping' name='TC_vbs_notification' time='4.675764'/> <testcase classname='BTS_Tests_ASCI:hopping' name='TC_vgcs_uplink_free_and_busy' time='1.815376'/> <testcase classname='BTS_Tests_ASCI:hopping' name='TC_vgcs_talker_fail' time='17.014904'/> <testcase classname='BTS_Tests_ASCI:hopping' name='TC_vgcs_talker_est_rel' time='1.451915'/> <testcase classname='BTS_Tests_ASCI:hopping' name='TC_vgcs_listener_det' time='3.357004'/> </testsuite> <?xml version="1.0"?> <testsuite name='Titan' tests='17' failures='0' errors='0' skipped='0' inconc='0' time='96.00'> <testcase classname='BTS_Tests_OML' name='TC_wrong_mdisc' time='10.837768'/> <testcase classname='BTS_Tests_OML' name='TC_wrong_msgtype' time='0.739462'/> <testcase classname='BTS_Tests_OML' name='TC_short_length' time='0.725926'/> <testcase classname='BTS_Tests_OML' name='TC_long_length' time='0.680133'/> <testcase classname='BTS_Tests_OML' name='TC_wrong_placement' time='0.688474'/> <testcase classname='BTS_Tests_OML' name='TC_wrong_seq' time='0.676188'/> <testcase classname='BTS_Tests_OML' name='TC_wrong_obj_class' time='0.681729'/> <testcase classname='BTS_Tests_OML' name='TC_wrong_bts_nr' time='0.688879'/> <testcase classname='BTS_Tests_OML' name='TC_wrong_trx_nr' time='0.687845'/> <testcase classname='BTS_Tests_OML' name='TC_radio_carrier_opstart_noattr' time='0.676673'/> <testcase classname='BTS_Tests_OML' name='TC_bts_opstart' time='0.665177'/> <testcase classname='BTS_Tests_OML' name='TC_bts_opstart_noattr' time='0.687113'/> <testcase classname='BTS_Tests_OML' name='TC_ts_opstart' time='0.679379'/> <testcase classname='BTS_Tests_OML' name='TC_ts_opstart_noattr' time='0.695975'/> <testcase classname='BTS_Tests_OML' name='TC_initial_state_reports' time='0.671026'/> <testcase classname='BTS_Tests_OML' name='TC_ipa_osmo_pcu_anr_fwd' time='0.674368'/> <testcase classname='BTS_Tests_OML' name='TC_ipa_rsl_connect_nack' time='0.671999'/> </testsuite> + check_respawn_count + set +x [0;31m ================================================================ WARNING: osmo-bts was respawned 4 times (expected: 3)! (OS#6794) ================================================================ [0m+ RC=1 + uptime + grep --color=always -o load.* [01;31m[Kload average: 0.64, 0.92, 2.09[m[K + exit 1 Build step 'Execute shell' marked build as failure Recording test results [Checks API] No suitable checks publisher found.
1
0
0
0
Build failed in Jenkins: ttcn3-5gc-test-ogs-latest #277
by jenkins@lists.osmocom.org
17 Aug '26
17 Aug '26
See <
https://jenkins.osmocom.org/jenkins/job/ttcn3-5gc-test-ogs-latest/277/displ…
> Changes: ------------------------------------------ [...truncated 113.96 KiB...] Selecting previously unselected package open5gs-udm-dbgsym:amd64. Preparing to unpack .../34-open5gs-udm-dbgsym_2.8.0_amd64.deb ... Unpacking open5gs-udm-dbgsym:amd64 (2.8.0) ... Selecting previously unselected package open5gs-udr:amd64. Preparing to unpack .../35-open5gs-udr_2.8.0_amd64.deb ... Unpacking open5gs-udr:amd64 (2.8.0) ... Selecting previously unselected package open5gs-udr-dbgsym:amd64. Preparing to unpack .../36-open5gs-udr-dbgsym_2.8.0_amd64.deb ... Unpacking open5gs-udr-dbgsym:amd64 (2.8.0) ... Selecting previously unselected package open5gs-upf:amd64. Preparing to unpack .../37-open5gs-upf_2.8.0_amd64.deb ... Unpacking open5gs-upf:amd64 (2.8.0) ... Selecting previously unselected package open5gs-upf-dbgsym:amd64. Preparing to unpack .../38-open5gs-upf-dbgsym_2.8.0_amd64.deb ... Unpacking open5gs-upf-dbgsym:amd64 (2.8.0) ... Selecting previously unselected package osmo-uecups. Preparing to unpack .../39-osmo-uecups_0.3.0_amd64.deb ... Unpacking osmo-uecups (0.3.0) ... Selecting previously unselected package osmo-uecups-dbgsym. Preparing to unpack .../40-osmo-uecups-dbgsym_0.3.0_amd64.deb ... Unpacking osmo-uecups-dbgsym (0.3.0) ... Selecting previously unselected package libosmocore-dbg:amd64. Preparing to unpack .../41-libosmocore-dbg_1.14.1_amd64.deb ... Unpacking libosmocore-dbg:amd64 (1.14.1) ... Setting up open5gs-common:amd64 (2.8.0) ... Setting up open5gs-amf:amd64 (2.8.0) ... Created symlink '/etc/systemd/system/multi-user.target.wants/open5gs-amfd.service' → '/usr/lib/systemd/system/open5gs-amfd.service'. Setting up open5gs-pcf:amd64 (2.8.0) ... Created symlink '/etc/systemd/system/multi-user.target.wants/open5gs-pcfd.service' → '/usr/lib/systemd/system/open5gs-pcfd.service'. Setting up libc6-dbg:amd64 (2.41-12+deb13u3) ... Setting up open5gs-common-dbgsym:amd64 (2.8.0) ... Setting up open5gs-nrf:amd64 (2.8.0) ... Created symlink '/etc/systemd/system/multi-user.target.wants/open5gs-nrfd.service' → '/usr/lib/systemd/system/open5gs-nrfd.service'. Setting up open5gs-pcf-dbgsym:amd64 (2.8.0) ... Setting up open5gs-upf:amd64 (2.8.0) ... Created symlink '/etc/systemd/system/dbus-org.freedesktop.network1.service' → '/usr/lib/systemd/system/systemd-networkd.service'. Created symlink '/etc/systemd/system/multi-user.target.wants/systemd-networkd.service' → '/usr/lib/systemd/system/systemd-networkd.service'. Created symlink '/etc/systemd/system/sockets.target.wants/systemd-networkd.socket' → '/usr/lib/systemd/system/systemd-networkd.socket'. Created symlink '/etc/systemd/system/sysinit.target.wants/systemd-network-generator.service' → '/usr/lib/systemd/system/systemd-network-generator.service'. Created symlink '/etc/systemd/system/network-online.target.wants/systemd-networkd-wait-online.service' → '/usr/lib/systemd/system/systemd-networkd-wait-online.service'. /usr/sbin/policy-rc.d returned 101, not running 'restart systemd-networkd' Created symlink '/etc/systemd/system/multi-user.target.wants/open5gs-upfd.service' → '/usr/lib/systemd/system/open5gs-upfd.service'. Setting up open5gs-nrf-dbgsym:amd64 (2.8.0) ... Setting up open5gs-udr:amd64 (2.8.0) ... Created symlink '/etc/systemd/system/multi-user.target.wants/open5gs-udrd.service' → '/usr/lib/systemd/system/open5gs-udrd.service'. Setting up osmocom-keyring (1.1.1) ... Setting up open5gs-bsf:amd64 (2.8.0) ... Created symlink '/etc/systemd/system/multi-user.target.wants/open5gs-bsfd.service' → '/usr/lib/systemd/system/open5gs-bsfd.service'. Setting up open5gs-scp:amd64 (2.8.0) ... Created symlink '/etc/systemd/system/multi-user.target.wants/open5gs-scpd.service' → '/usr/lib/systemd/system/open5gs-scpd.service'. Setting up open5gs-smf:amd64 (2.8.0) ... Created symlink '/etc/systemd/system/multi-user.target.wants/open5gs-smfd.service' → '/usr/lib/systemd/system/open5gs-smfd.service'. Setting up open5gs-scp-dbgsym:amd64 (2.8.0) ... Setting up open5gs-sepp:amd64 (2.8.0) ... Created symlink '/etc/systemd/system/multi-user.target.wants/open5gs-seppd.service' → '/usr/lib/systemd/system/open5gs-seppd.service'. Setting up open5gs-bsf-dbgsym:amd64 (2.8.0) ... Setting up open5gs-upf-dbgsym:amd64 (2.8.0) ... Setting up open5gs-ausf:amd64 (2.8.0) ... Created symlink '/etc/systemd/system/multi-user.target.wants/open5gs-ausfd.service' → '/usr/lib/systemd/system/open5gs-ausfd.service'. Setting up osmocom-latest (1.1.0) ... Setting up open5gs-amf-dbgsym:amd64 (2.8.0) ... Setting up open5gs-udm:amd64 (2.8.0) ... Created symlink '/etc/systemd/system/multi-user.target.wants/open5gs-udmd.service' → '/usr/lib/systemd/system/open5gs-udmd.service'. Setting up open5gs-ausf-dbgsym:amd64 (2.8.0) ... Setting up open5gs-udr-dbgsym:amd64 (2.8.0) ... Setting up open5gs-sepp-dbgsym:amd64 (2.8.0) ... Setting up open5gs-udm-dbgsym:amd64 (2.8.0) ... Setting up open5gs-smf-dbgsym:amd64 (2.8.0) ... Setting up libosmocore22:amd64 (1.14.1) ... Setting up libosmocodec4:amd64 (1.14.1) ... Setting up libosmovty13:amd64 (1.14.1) ... Setting up libosmoisdn0:amd64 (1.14.1) ... Setting up libosmousb0:amd64 (1.14.1) ... Setting up libosmogsm20:amd64 (1.14.1) ... Setting up libosmoctrl0:amd64 (1.14.1) ... Setting up libosmogb14:amd64 (1.14.1) ... Setting up libosmonetif11:amd64 (1.7.0) ... Setting up osmo-uecups (0.3.0) ... Setting up libosmocoding0:amd64 (1.14.1) ... Setting up libosmosim2:amd64 (1.14.1) ... Setting up libosmocore (1.14.1) ... Setting up osmo-uecups-dbgsym (0.3.0) ... Setting up libosmocore-dbg:amd64 (1.14.1) ... Processing triggers for libc-bin (2.41-12+deb13u3) ... [1;34m[testenv] Preparing testdir: <
https://jenkins.osmocom.org/jenkins/job/ttcn3-5gc-test-ogs-latest/ws/logs[…
> [0;94m[testenv] + ['podman', 'exec', '-e', 'CCACHE_DIR=/home/osmocom-build/ccache/testenv', '-e', 'TESTENV_CACHE_DIR=<
https://jenkins.osmocom.org/jenkins/job/ttcn3-5gc-test-ogs-latest/ws/_cache
',> '-e', 'TESTENV_SRC_DIR=/home/osmocom-build/jenkins/workspace', '-e', 'TESTENV_INSTALL_DIR=/', '-e', 'TERM=dumb', '-e', 'PATH=<
https://jenkins.osmocom.org/jenkins/job/ttcn3-5gc-test-ogs-latest/ws/_teste…
>:<
https://jenkins.osmocom.org/jenkins/job/ttcn3-5gc-test-ogs-latest/ws/_teste…
>:<
https://jenkins.osmocom.org/jenkins/job/ttcn3-5gc-test-ogs-latest/ws/5gc
>:/usr/local/bin:/usr/sbin:/usr/bin:/sbin:/bin', '-e', 'HOME=/home/osmocom-build', '-e', 'PYTHONUNBUFFERED=1', '-t', 'testenv-5gc-osmocom-latest-20260817-1343-8379c475-1', 'install', '-Dm644', '<
https://jenkins.osmocom.org/jenkins/job/ttcn3-5gc-test-ogs-latest/ws/5gc/C5…
',> '<
https://jenkins.osmocom.org/jenkins/job/ttcn3-5gc-test-ogs-latest/277/artif…
'][0m> [0;94m[testenv] + ['cp', '-a', 'testsuite_prepare.sh', '<
https://jenkins.osmocom.org/jenkins/job/ttcn3-5gc-test-ogs-latest/277/artif…
'][0m> [0;94m[testenv] + ['cp', '-a', 'mongod.conf', '<
https://jenkins.osmocom.org/jenkins/job/ttcn3-5gc-test-ogs-latest/277/artif…
'][0m> [0;94m[testenv] + ['cp', '-a', 'open5gs/open5gs-nrf.yaml', '<
https://jenkins.osmocom.org/jenkins/job/ttcn3-5gc-test-ogs-latest/277/artif…
'][0m> [0;94m[testenv] + ['cp', '-a', 'open5gs/open5gs-scp.yaml', '<
https://jenkins.osmocom.org/jenkins/job/ttcn3-5gc-test-ogs-latest/277/artif…
'][0m> [0;94m[testenv] + ['cp', '-a', 'open5gs/open5gs-sepp1.yaml', 'open5gs/open5gs_prepare.sh', '<
https://jenkins.osmocom.org/jenkins/job/ttcn3-5gc-test-ogs-latest/277/artif…
'][0m> [0;94m[testenv] + ['cp', '-a', 'open5gs/open5gs-sepp2.yaml', 'open5gs/open5gs_prepare.sh', '<
https://jenkins.osmocom.org/jenkins/job/ttcn3-5gc-test-ogs-latest/277/artif…
'][0m> [0;94m[testenv] + ['cp', '-a', 'open5gs/open5gs-bsf.yaml', '<
https://jenkins.osmocom.org/jenkins/job/ttcn3-5gc-test-ogs-latest/277/artif…
'][0m> [0;94m[testenv] + ['cp', '-a', 'open5gs/open5gs-smf.yaml', 'open5gs/open5gs-smf-freediameter.conf', '<
https://jenkins.osmocom.org/jenkins/job/ttcn3-5gc-test-ogs-latest/277/artif…
'][0m> [0;94m[testenv] + ['cp', '-a', 'open5gs/open5gs-upf.yaml', '<
https://jenkins.osmocom.org/jenkins/job/ttcn3-5gc-test-ogs-latest/277/artif…
'][0m> [0;94m[testenv] + ['cp', '-a', 'open5gs/open5gs-ausf.yaml', '<
https://jenkins.osmocom.org/jenkins/job/ttcn3-5gc-test-ogs-latest/277/artif…
'][0m> [0;94m[testenv] + ['cp', '-a', 'open5gs/open5gs-udm.yaml', 'open5gs/open5gs_prepare.sh', '<
https://jenkins.osmocom.org/jenkins/job/ttcn3-5gc-test-ogs-latest/277/artif…
'][0m> [0;94m[testenv] + ['cp', '-a', 'open5gs/open5gs-udr.yaml', '<
https://jenkins.osmocom.org/jenkins/job/ttcn3-5gc-test-ogs-latest/277/artif…
'][0m> [0;94m[testenv] + ['cp', '-a', 'open5gs/open5gs-pcf.yaml', '<
https://jenkins.osmocom.org/jenkins/job/ttcn3-5gc-test-ogs-latest/277/artif…
'][0m> [0;94m[testenv] + ['cp', '-a', 'open5gs/open5gs-amf.yaml', '<
https://jenkins.osmocom.org/jenkins/job/ttcn3-5gc-test-ogs-latest/277/artif…
'][0m> [0;94m[testenv] + ['cp', '-a', 'osmo-uecups-daemon.cfg', '<
https://jenkins.osmocom.org/jenkins/job/ttcn3-5gc-test-ogs-latest/277/artif…
'][0m> [0;94m[testenv] + ['podman', 'exec', '-e', 'CCACHE_DIR=/home/osmocom-build/ccache/testenv', '-e', 'TESTENV_CACHE_DIR=<
https://jenkins.osmocom.org/jenkins/job/ttcn3-5gc-test-ogs-latest/ws/_cache
',> '-e', 'TESTENV_SRC_DIR=/home/osmocom-build/jenkins/workspace', '-e', 'TESTENV_INSTALL_DIR=/', '-e', 'TERM=dumb', '-e', 'PATH=<
https://jenkins.osmocom.org/jenkins/job/ttcn3-5gc-test-ogs-latest/ws/_teste…
>:<
https://jenkins.osmocom.org/jenkins/job/ttcn3-5gc-test-ogs-latest/ws/_teste…
>:<
https://jenkins.osmocom.org/jenkins/job/ttcn3-5gc-test-ogs-latest/ws/5gc
>:/usr/local/bin:/usr/sbin:/usr/bin:/sbin:/bin', '-e', 'HOME=/home/osmocom-build', '-e', 'PYTHONUNBUFFERED=1', '-t', 'testenv-5gc-osmocom-latest-20260817-1343-8379c475-1', 'install', '-Dm644', '<
https://jenkins.osmocom.org/jenkins/job/ttcn3-5gc-test-ogs-latest/ws/5gc/C5…
',> '<
https://jenkins.osmocom.org/jenkins/job/ttcn3-5gc-test-ogs-latest/277/artif…
'][0m> [0;94m[testenv] + ['podman', 'exec', '-e', 'CCACHE_DIR=/home/osmocom-build/ccache/testenv', '-e', 'TESTENV_CACHE_DIR=<
https://jenkins.osmocom.org/jenkins/job/ttcn3-5gc-test-ogs-latest/ws/_cache
',> '-e', 'TESTENV_SRC_DIR=/home/osmocom-build/jenkins/workspace', '-e', 'TESTENV_INSTALL_DIR=/', '-e', 'TERM=dumb', '-e', 'PATH=<
https://jenkins.osmocom.org/jenkins/job/ttcn3-5gc-test-ogs-latest/ws/_teste…
>:<
https://jenkins.osmocom.org/jenkins/job/ttcn3-5gc-test-ogs-latest/ws/_teste…
>:<
https://jenkins.osmocom.org/jenkins/job/ttcn3-5gc-test-ogs-latest/ws/5gc
>:/usr/local/bin:/usr/sbin:/usr/bin:/sbin:/bin', '-e', 'HOME=/home/osmocom-build', '-e', 'PYTHONUNBUFFERED=1', '-t', 'testenv-5gc-osmocom-latest-20260817-1343-8379c475-1', 'install', '-Dm644', '<
https://jenkins.osmocom.org/jenkins/job/ttcn3-5gc-test-ogs-latest/ws/Common…
',> '<
https://jenkins.osmocom.org/jenkins/job/ttcn3-5gc-test-ogs-latest/277/artif…
'][0m> [0;94m[testenv] + ['podman', 'exec', '-e', 'CCACHE_DIR=/home/osmocom-build/ccache/testenv', '-e', 'TESTENV_CACHE_DIR=<
https://jenkins.osmocom.org/jenkins/job/ttcn3-5gc-test-ogs-latest/ws/_cache
',> '-e', 'TESTENV_SRC_DIR=/home/osmocom-build/jenkins/workspace', '-e', 'TESTENV_INSTALL_DIR=/', '-e', 'TERM=dumb', '-e', 'PATH=<
https://jenkins.osmocom.org/jenkins/job/ttcn3-5gc-test-ogs-latest/ws/_teste…
>:<
https://jenkins.osmocom.org/jenkins/job/ttcn3-5gc-test-ogs-latest/ws/_teste…
>:<
https://jenkins.osmocom.org/jenkins/job/ttcn3-5gc-test-ogs-latest/ws/5gc
>:/usr/local/bin:/usr/sbin:/usr/bin:/sbin:/bin', '-e', 'HOME=/home/osmocom-build', '-e', 'PYTHONUNBUFFERED=1', '-t', 'testenv-5gc-osmocom-latest-20260817-1343-8379c475-1', 'sed', '-i', 's#TTCN3_HACKS_PATH := .*#TTCN3_HACKS_PATH := "<
https://jenkins.osmocom.org/jenkins/job/ttcn3-5gc-test-ogs-latest/ws/
">#', '<
https://jenkins.osmocom.org/jenkins/job/ttcn3-5gc-test-ogs-latest/277/artif…
'][0m> [0;94m[testenv] Adjusting testsuite config: <
https://jenkins.osmocom.org/jenkins/job/ttcn3-5gc-test-ogs-latest/277/artif…
> [0;94m[testenv] + ['podman', 'exec', '-e', 'CCACHE_DIR=/home/osmocom-build/ccache/testenv', '-e', 'TESTENV_CACHE_DIR=<
https://jenkins.osmocom.org/jenkins/job/ttcn3-5gc-test-ogs-latest/ws/_cache
',> '-e', 'TESTENV_SRC_DIR=/home/osmocom-build/jenkins/workspace', '-e', 'TESTENV_INSTALL_DIR=/', '-e', 'TERM=dumb', '-e', 'PATH=<
https://jenkins.osmocom.org/jenkins/job/ttcn3-5gc-test-ogs-latest/ws/_teste…
>:<
https://jenkins.osmocom.org/jenkins/job/ttcn3-5gc-test-ogs-latest/ws/_teste…
>:<
https://jenkins.osmocom.org/jenkins/job/ttcn3-5gc-test-ogs-latest/ws/5gc
>:/usr/local/bin:/usr/sbin:/usr/bin:/sbin:/bin', '-e', 'HOME=/home/osmocom-build', '-e', 'PYTHONUNBUFFERED=1', '-t', 'testenv-5gc-osmocom-latest-20260817-1343-8379c475-1', 'sed', '-i', '-e', 's/\\[MODULE_PARAMETERS\\]/\\[MODULE_PARAMETERS\\]\\nMisc_Helpers.mp_osmo_repo := "latest"/g', '-e', 's#../Common.cfg#Common.cfg#', '<
https://jenkins.osmocom.org/jenkins/job/ttcn3-5gc-test-ogs-latest/277/artif…
'][0m> [0;94m[testenv] Adjusting testsuite config: <
https://jenkins.osmocom.org/jenkins/job/ttcn3-5gc-test-ogs-latest/277/artif…
> [0;94m[testenv] + ['podman', 'exec', '-e', 'CCACHE_DIR=/home/osmocom-build/ccache/testenv', '-e', 'TESTENV_CACHE_DIR=<
https://jenkins.osmocom.org/jenkins/job/ttcn3-5gc-test-ogs-latest/ws/_cache
',> '-e', 'TESTENV_SRC_DIR=/home/osmocom-build/jenkins/workspace', '-e', 'TESTENV_INSTALL_DIR=/', '-e', 'TERM=dumb', '-e', 'PATH=<
https://jenkins.osmocom.org/jenkins/job/ttcn3-5gc-test-ogs-latest/ws/_teste…
>:<
https://jenkins.osmocom.org/jenkins/job/ttcn3-5gc-test-ogs-latest/ws/_teste…
>:<
https://jenkins.osmocom.org/jenkins/job/ttcn3-5gc-test-ogs-latest/ws/5gc
>:/usr/local/bin:/usr/sbin:/usr/bin:/sbin:/bin', '-e', 'HOME=/home/osmocom-build', '-e', 'PYTHONUNBUFFERED=1', '-t', 'testenv-5gc-osmocom-latest-20260817-1343-8379c475-1', 'sed', '-i', '-e', 's/\\[MODULE_PARAMETERS\\]/\\[MODULE_PARAMETERS\\]\\nMisc_Helpers.mp_osmo_repo := "latest"/g', '-e', 's#../Common.cfg#Common.cfg#', '<
https://jenkins.osmocom.org/jenkins/job/ttcn3-5gc-test-ogs-latest/277/artif…
'][0m> [0;94m[testenv] Adjusting testsuite config: <
https://jenkins.osmocom.org/jenkins/job/ttcn3-5gc-test-ogs-latest/277/artif…
> [0;94m[testenv] + ['podman', 'exec', '-e', 'CCACHE_DIR=/home/osmocom-build/ccache/testenv', '-e', 'TESTENV_CACHE_DIR=<
https://jenkins.osmocom.org/jenkins/job/ttcn3-5gc-test-ogs-latest/ws/_cache
',> '-e', 'TESTENV_SRC_DIR=/home/osmocom-build/jenkins/workspace', '-e', 'TESTENV_INSTALL_DIR=/', '-e', 'TERM=dumb', '-e', 'PATH=<
https://jenkins.osmocom.org/jenkins/job/ttcn3-5gc-test-ogs-latest/ws/_teste…
>:<
https://jenkins.osmocom.org/jenkins/job/ttcn3-5gc-test-ogs-latest/ws/_teste…
>:<
https://jenkins.osmocom.org/jenkins/job/ttcn3-5gc-test-ogs-latest/ws/5gc
>:/usr/local/bin:/usr/sbin:/usr/bin:/sbin:/bin', '-e', 'HOME=/home/osmocom-build', '-e', 'PYTHONUNBUFFERED=1', '-t', 'testenv-5gc-osmocom-latest-20260817-1343-8379c475-1', 'sed', '-i', '-e', 's/\\[MODULE_PARAMETERS\\]/\\[MODULE_PARAMETERS\\]\\nMisc_Helpers.mp_osmo_repo := "latest"/g', '-e', 's#../Common.cfg#Common.cfg#', '<
https://jenkins.osmocom.org/jenkins/job/ttcn3-5gc-test-ogs-latest/277/artif…
'][0m> [1;34m[testenv] Running testsuite clean script (reason: prepare)[0m [0;94m[testenv] + ['podman', 'exec', '-e', 'CCACHE_DIR=/home/osmocom-build/ccache/testenv', '-e', 'TESTENV_CACHE_DIR=<
https://jenkins.osmocom.org/jenkins/job/ttcn3-5gc-test-ogs-latest/ws/_cache
',> '-e', 'TESTENV_SRC_DIR=/home/osmocom-build/jenkins/workspace', '-e', 'TESTENV_INSTALL_DIR=/', '-e', 'TERM=dumb', '-e', 'PATH=<
https://jenkins.osmocom.org/jenkins/job/ttcn3-5gc-test-ogs-latest/ws/_teste…
>:<
https://jenkins.osmocom.org/jenkins/job/ttcn3-5gc-test-ogs-latest/ws/_teste…
>:<
https://jenkins.osmocom.org/jenkins/job/ttcn3-5gc-test-ogs-latest/ws/5gc
>:/usr/local/bin:/usr/sbin:/usr/bin:/sbin:/bin', '-e', 'HOME=/home/osmocom-build', '-e', 'PYTHONUNBUFFERED=1', '-e', 'TESTENV_CLEAN_REASON=prepare', '-t', '-w', '<
https://jenkins.osmocom.org/jenkins/job/ttcn3-5gc-test-ogs-latest/277/artif…
',> 'testenv-5gc-osmocom-latest-20260817-1343-8379c475-1', 'sh', '-c', 'testenv.sh'][0m + check_usage + [ -z prepare ] + setcap_open5gs_upfd + which open5gs-upfd + sudo setcap CAP_NET_RAW=+eip /usr/bin/open5gs-upfd + del_tun_all + del_tun ogstun4 + local name=ogstun4 + ip link ls dev ogstun4 + del_tun ogstun6 + local name=ogstun6 + ip link ls dev ogstun6 + del_tun ogstun46 + local name=ogstun46 + ip link ls dev ogstun46 + add_tun_all + add_tun ogstun4 + local name=ogstun4 + grep ogstun4 /proc/net/dev + sudo ip tuntap add name ogstun4 mode tun + add_tun ogstun6 + local name=ogstun6 + grep ogstun6 /proc/net/dev + sudo ip tuntap add name ogstun6 mode tun + add_tun ogstun46 + local name=ogstun46 + grep ogstun46 /proc/net/dev + sudo ip tuntap add name ogstun46 mode tun + add_addr ogstun46 10.45.0.1/16 + local name=ogstun46 + local addr=10.45.0.1/16 + sudo ip addr add 10.45.0.1/16 dev ogstun46 + add_addr ogstun46 cafe::1/64 + local name=ogstun46 + local addr=cafe::1/64 + sudo ip addr add cafe::1/64 dev ogstun46 + sudo ip link set ogstun4 up + sudo ip link set ogstun6 up + sudo ip link set ogstun46 up + sudo ip route add 10.45.0.0/16 dev ogstun46 RTNETLINK answers: File exists + true + sudo ip -6 route add 2001:db8:cafe::/48 dev ogstun46 [1;34m[testenv] Running testsuite prepare script[0m [0;94m[testenv] + ['podman', 'exec', '-e', 'CCACHE_DIR=/home/osmocom-build/ccache/testenv', '-e', 'TESTENV_CACHE_DIR=<
https://jenkins.osmocom.org/jenkins/job/ttcn3-5gc-test-ogs-latest/ws/_cache
',> '-e', 'TESTENV_SRC_DIR=/home/osmocom-build/jenkins/workspace', '-e', 'TESTENV_INSTALL_DIR=/', '-e', 'TERM=dumb', '-e', 'PATH=<
https://jenkins.osmocom.org/jenkins/job/ttcn3-5gc-test-ogs-latest/ws/_teste…
>:<
https://jenkins.osmocom.org/jenkins/job/ttcn3-5gc-test-ogs-latest/ws/_teste…
>:<
https://jenkins.osmocom.org/jenkins/job/ttcn3-5gc-test-ogs-latest/ws/5gc
>:/usr/local/bin:/usr/sbin:/usr/bin:/sbin:/bin', '-e', 'HOME=/home/osmocom-build', '-e', 'PYTHONUNBUFFERED=1', '-t', '-w', '<
https://jenkins.osmocom.org/jenkins/job/ttcn3-5gc-test-ogs-latest/277/artif…
',> 'testenv-5gc-osmocom-latest-20260817-1343-8379c475-1', 'sh', '-c', './testsuite_prepare.sh'][0m + adjust_ttcn3_config + local as_user=root + sed -i s/^C5G_Tests.mp_run_prog_as_user := .*/C5G_Tests.mp_run_prog_as_user := "root"/ C5G_Tests.cfg [1;34m[testenv] Running db prepare script[0m [0;94m[testenv] + ['podman', 'exec', '-e', 'CCACHE_DIR=/home/osmocom-build/ccache/testenv', '-e', 'TESTENV_CACHE_DIR=<
https://jenkins.osmocom.org/jenkins/job/ttcn3-5gc-test-ogs-latest/ws/_cache
',> '-e', 'TESTENV_SRC_DIR=/home/osmocom-build/jenkins/workspace', '-e', 'TESTENV_INSTALL_DIR=/', '-e', 'TERM=dumb', '-e', 'PATH=<
https://jenkins.osmocom.org/jenkins/job/ttcn3-5gc-test-ogs-latest/ws/_teste…
>:<
https://jenkins.osmocom.org/jenkins/job/ttcn3-5gc-test-ogs-latest/ws/_teste…
>:<
https://jenkins.osmocom.org/jenkins/job/ttcn3-5gc-test-ogs-latest/ws/5gc
>:/usr/local/bin:/usr/sbin:/usr/bin:/sbin:/bin', '-e', 'HOME=/home/osmocom-build', '-e', 'PYTHONUNBUFFERED=1', '-t', '-w', '<
https://jenkins.osmocom.org/jenkins/job/ttcn3-5gc-test-ogs-latest/277/artif…
',> 'testenv-5gc-osmocom-latest-20260817-1343-8379c475-1', 'sh', '-c', 'mkdir db'][0m [1;34m[testenv] Running sepp1 prepare script[0m [0;94m[testenv] + ['podman', 'exec', '-e', 'CCACHE_DIR=/home/osmocom-build/ccache/testenv', '-e', 'TESTENV_CACHE_DIR=<
https://jenkins.osmocom.org/jenkins/job/ttcn3-5gc-test-ogs-latest/ws/_cache
',> '-e', 'TESTENV_SRC_DIR=/home/osmocom-build/jenkins/workspace', '-e', 'TESTENV_INSTALL_DIR=/', '-e', 'TERM=dumb', '-e', 'PATH=<
https://jenkins.osmocom.org/jenkins/job/ttcn3-5gc-test-ogs-latest/ws/_teste…
>:<
https://jenkins.osmocom.org/jenkins/job/ttcn3-5gc-test-ogs-latest/ws/_teste…
>:<
https://jenkins.osmocom.org/jenkins/job/ttcn3-5gc-test-ogs-latest/ws/5gc
>:/usr/local/bin:/usr/sbin:/usr/bin:/sbin:/bin', '-e', 'HOME=/home/osmocom-build', '-e', 'PYTHONUNBUFFERED=1', '-t', '-w', '<
https://jenkins.osmocom.org/jenkins/job/ttcn3-5gc-test-ogs-latest/277/artif…
',> 'testenv-5gc-osmocom-latest-20260817-1343-8379c475-1', 'sh', '-c', './open5gs_prepare.sh'][0m + adjust_sysconfdir_config ./open5gs-sepp1.yaml + sed -i s~@sysconfdir@~//etc/~g ./open5gs-sepp1.yaml [1;34m[testenv] Running sepp2 prepare script[0m [0;94m[testenv] + ['podman', 'exec', '-e', 'CCACHE_DIR=/home/osmocom-build/ccache/testenv', '-e', 'TESTENV_CACHE_DIR=<
https://jenkins.osmocom.org/jenkins/job/ttcn3-5gc-test-ogs-latest/ws/_cache
',> '-e', 'TESTENV_SRC_DIR=/home/osmocom-build/jenkins/workspace', '-e', 'TESTENV_INSTALL_DIR=/', '-e', 'TERM=dumb', '-e', 'PATH=<
https://jenkins.osmocom.org/jenkins/job/ttcn3-5gc-test-ogs-latest/ws/_teste…
>:<
https://jenkins.osmocom.org/jenkins/job/ttcn3-5gc-test-ogs-latest/ws/_teste…
>:<
https://jenkins.osmocom.org/jenkins/job/ttcn3-5gc-test-ogs-latest/ws/5gc
>:/usr/local/bin:/usr/sbin:/usr/bin:/sbin:/bin', '-e', 'HOME=/home/osmocom-build', '-e', 'PYTHONUNBUFFERED=1', '-t', '-w', '<
https://jenkins.osmocom.org/jenkins/job/ttcn3-5gc-test-ogs-latest/277/artif…
',> 'testenv-5gc-osmocom-latest-20260817-1343-8379c475-1', 'sh', '-c', './open5gs_prepare.sh'][0m + adjust_sysconfdir_config ./open5gs-sepp2.yaml + sed -i s~@sysconfdir@~//etc/~g ./open5gs-sepp2.yaml [1;34m[testenv] Running udm prepare script[0m [0;94m[testenv] + ['podman', 'exec', '-e', 'CCACHE_DIR=/home/osmocom-build/ccache/testenv', '-e', 'TESTENV_CACHE_DIR=<
https://jenkins.osmocom.org/jenkins/job/ttcn3-5gc-test-ogs-latest/ws/_cache
',> '-e', 'TESTENV_SRC_DIR=/home/osmocom-build/jenkins/workspace', '-e', 'TESTENV_INSTALL_DIR=/', '-e', 'TERM=dumb', '-e', 'PATH=<
https://jenkins.osmocom.org/jenkins/job/ttcn3-5gc-test-ogs-latest/ws/_teste…
>:<
https://jenkins.osmocom.org/jenkins/job/ttcn3-5gc-test-ogs-latest/ws/_teste…
>:<
https://jenkins.osmocom.org/jenkins/job/ttcn3-5gc-test-ogs-latest/ws/5gc
>:/usr/local/bin:/usr/sbin:/usr/bin:/sbin:/bin', '-e', 'HOME=/home/osmocom-build', '-e', 'PYTHONUNBUFFERED=1', '-t', '-w', '<
https://jenkins.osmocom.org/jenkins/job/ttcn3-5gc-test-ogs-latest/277/artif…
',> 'testenv-5gc-osmocom-latest-20260817-1343-8379c475-1', 'sh', '-c', './open5gs_prepare.sh'][0m + adjust_sysconfdir_config ./open5gs-udm.yaml + sed -i s~@sysconfdir@~//etc/~g ./open5gs-udm.yaml [1;34m[testenv] Running uecups-daemon prepare script[0m [0;94m[testenv] + ['podman', 'exec', '-e', 'CCACHE_DIR=/home/osmocom-build/ccache/testenv', '-e', 'TESTENV_CACHE_DIR=<
https://jenkins.osmocom.org/jenkins/job/ttcn3-5gc-test-ogs-latest/ws/_cache
',> '-e', 'TESTENV_SRC_DIR=/home/osmocom-build/jenkins/workspace', '-e', 'TESTENV_INSTALL_DIR=/', '-e', 'TERM=dumb', '-e', 'PATH=<
https://jenkins.osmocom.org/jenkins/job/ttcn3-5gc-test-ogs-latest/ws/_teste…
>:<
https://jenkins.osmocom.org/jenkins/job/ttcn3-5gc-test-ogs-latest/ws/_teste…
>:<
https://jenkins.osmocom.org/jenkins/job/ttcn3-5gc-test-ogs-latest/ws/5gc
>:/usr/local/bin:/usr/sbin:/usr/bin:/sbin:/bin', '-e', 'HOME=/home/osmocom-build', '-e', 'PYTHONUNBUFFERED=1', '-t', '-w', '<
https://jenkins.osmocom.org/jenkins/job/ttcn3-5gc-test-ogs-latest/277/artif…
',> 'testenv-5gc-osmocom-latest-20260817-1343-8379c475-1', 'sh', '-c', 'mkdir run_prog'][0m [1;34m[testenv] Running db[0m [0;94m[testenv] + ['podman', 'exec', '-e', 'CCACHE_DIR=/home/osmocom-build/ccache/testenv', '-e', 'TESTENV_CACHE_DIR=<
https://jenkins.osmocom.org/jenkins/job/ttcn3-5gc-test-ogs-latest/ws/_cache
',> '-e', 'TESTENV_SRC_DIR=/home/osmocom-build/jenkins/workspace', '-e', 'TESTENV_INSTALL_DIR=/', '-e', 'TERM=dumb', '-e', 'PATH=<
https://jenkins.osmocom.org/jenkins/job/ttcn3-5gc-test-ogs-latest/ws/_teste…
>:<
https://jenkins.osmocom.org/jenkins/job/ttcn3-5gc-test-ogs-latest/ws/_teste…
>:<
https://jenkins.osmocom.org/jenkins/job/ttcn3-5gc-test-ogs-latest/ws/5gc
>:/usr/local/bin:/usr/sbin:/usr/bin:/sbin:/bin', '-e', 'HOME=/home/osmocom-build', '-e', 'PYTHONUNBUFFERED=1', '-w', '<
https://jenkins.osmocom.org/jenkins/job/ttcn3-5gc-test-ogs-latest/277/artif…
',> 'testenv-5gc-osmocom-latest-20260817-1343-8379c475-1', 'sh', '-c', 'ulimit -c unlimited; mongod --config mongod.conf 2>&1 | tee <
https://jenkins.osmocom.org/jenkins/job/ttcn3-5gc-test-ogs-latest/277/artif…
'][0m> [1;34m[testenv] Running db setup script[0m [0;94m[testenv] + ['podman', 'exec', '-e', 'CCACHE_DIR=/home/osmocom-build/ccache/testenv', '-e', 'TESTENV_CACHE_DIR=<
https://jenkins.osmocom.org/jenkins/job/ttcn3-5gc-test-ogs-latest/ws/_cache
',> '-e', 'TESTENV_SRC_DIR=/home/osmocom-build/jenkins/workspace', '-e', 'TESTENV_INSTALL_DIR=/', '-e', 'TERM=dumb', '-e', 'PATH=<
https://jenkins.osmocom.org/jenkins/job/ttcn3-5gc-test-ogs-latest/ws/_teste…
>:<
https://jenkins.osmocom.org/jenkins/job/ttcn3-5gc-test-ogs-latest/ws/_teste…
>:<
https://jenkins.osmocom.org/jenkins/job/ttcn3-5gc-test-ogs-latest/ws/5gc
>:/usr/local/bin:/usr/sbin:/usr/bin:/sbin:/bin', '-e', 'HOME=/home/osmocom-build', '-e', 'PYTHONUNBUFFERED=1', '-t', '-w', '<
https://jenkins.osmocom.org/jenkins/job/ttcn3-5gc-test-ogs-latest/277/artif…
',> 'testenv-5gc-osmocom-latest-20260817-1343-8379c475-1', 'sh', '-c', 'create_test_subscribers.sh'][0m {"t":{"$date":"2026-08-17T13:43:31.055+00:00"},"s":"I", "c":"NETWORK", "id":4915701, "ctx":"-","msg":"Initialized wire specification","attr":{"spec":{"incomingExternalClient":{"minWireVersion":0,"maxWireVersion":13},"incomingInternalClient":{"minWireVersion":0,"maxWireVersion":13},"outgoing":{"minWireVersion":0,"maxWireVersion":13},"isInternalClient":true}}} {"t":{"$date":"2026-08-17T13:43:31.055+00:00"},"s":"I", "c":"CONTROL", "id":23285, "ctx":"-","msg":"Automatically disabling TLS 1.0, to force-enable TLS 1.0 specify --sslDisabledProtocols 'none'"} {"t":{"$date":"2026-08-17T13:43:31.059+00:00"},"s":"W", "c":"ASIO", "id":22601, "ctx":"main","msg":"No TransportLayer configured during NetworkInterface startup"} {"t":{"$date":"2026-08-17T13:43:31.059+00:00"},"s":"I", "c":"NETWORK", "id":4648601, "ctx":"main","msg":"Implicit TCP FastOpen unavailable. If TCP FastOpen is required, set tcpFastOpenServer, tcpFastOpenClient, and tcpFastOpenQueueSize."} {"t":{"$date":"2026-08-17T13:43:31.101+00:00"},"s":"W", "c":"ASIO", "id":22601, "ctx":"main","msg":"No TransportLayer configured during NetworkInterface startup"} {"t":{"$date":"2026-08-17T13:43:31.101+00:00"},"s":"I", "c":"REPL", "id":5123008, "ctx":"main","msg":"Successfully registered PrimaryOnlyService","attr":{"service":"TenantMigrationDonorService","ns":"config.tenantMigrationDonors"}} {"t":{"$date":"2026-08-17T13:43:31.101+00:00"},"s":"I", "c":"REPL", "id":5123008, "ctx":"main","msg":"Successfully registered PrimaryOnlyService","attr":{"service":"TenantMigrationRecipientService","ns":"config.tenantMigrationRecipients"}} {"t":{"$date":"2026-08-17T13:43:31.101+00:00"},"s":"I", "c":"CONTROL", "id":5945603, "ctx":"main","msg":"Multi threading initialized"} {"t":{"$date":"2026-08-17T13:43:31.101+00:00"},"s":"I", "c":"CONTROL", "id":4615611, "ctx":"initandlisten","msg":"MongoDB starting","attr":{"pid":720,"port":27017,"dbPath":"db","architecture":"64-bit","host":"8ba2f2684482"}} {"t":{"$date":"2026-08-17T13:43:31.101+00:00"},"s":"I", "c":"CONTROL", "id":23403, "ctx":"initandlisten","msg":"Build Info","attr":{"buildInfo":{"version":"5.0.34","gitVersion":"3ed0d39e497e5876dab3a0b825f2e504806d0afd","openSSLVersion":"OpenSSL 1.1.1n 15 Mar 2022","modules":[],"allocator":"tcmalloc","environment":{"distmod":"debian11","distarch":"x86_64","target_arch":"x86_64"}}}} {"t":{"$date":"2026-08-17T13:43:31.101+00:00"},"s":"I", "c":"CONTROL", "id":51765, "ctx":"initandlisten","msg":"Operating System","attr":{"os":{"name":"PRETTY_NAME=\"Debian GNU/Linux 13 (trixie)\"","version":"Kernel 6.12.101+deb13-amd64"}}} {"t":{"$date":"2026-08-17T13:43:31.101+00:00"},"s":"I", "c":"CONTROL", "id":21951, "ctx":"initandlisten","msg":"Options set by command line","attr":{"options":{"config":"mongod.conf","net":{"bindIp":"127.0.0.103","port":27017},"processManagement":{"timeZoneInfo":"/usr/share/zoneinfo"},"storage":{"dbPath":"db"}}}} {"t":{"$date":"2026-08-17T13:43:31.102+00:00"},"s":"I", "c":"STORAGE", "id":22297, "ctx":"initandlisten","msg":"Using the XFS filesystem is strongly recommended with the WiredTiger storage engine. See
http://dochub.mongodb.org/core/prodnotes-filesystem
","tags":["startupWarnings"]} {"t":{"$date":"2026-08-17T13:43:31.102+00:00"},"s":"I", "c":"STORAGE", "id":22315, "ctx":"initandlisten","msg":"Opening WiredTiger","attr":{"config":"create,cache_size=31543M,session_max=33000,eviction=(threads_min=4,threads_max=4),config_base=false,statistics=(fast),log=(enabled=true,archive=true,path=journal,compressor=snappy),builtin_extension_config=(zstd=(compression_level=6)),file_manager=(close_idle_time=600,close_scan_interval=10,close_handle_minimum=2000),statistics_log=(wait=0),verbose=[recovery_progress,checkpoint_progress,compact_progress],"}} {"t":{"$date":"2026-08-17T13:43:31.239+00:00"},"s":"I", "c":"STORAGE", "id":22430, "ctx":"initandlisten","msg":"WiredTiger message","attr":{"message":"[1786974211:239512][720:0x7f45dc421c80], txn-recover: [WT_VERB_RECOVERY_PROGRESS] recovery log replay has successfully finished and ran for 0 milliseconds"}} {"t":{"$date":"2026-08-17T13:43:31.239+00:00"},"s":"I", "c":"STORAGE", "id":22430, "ctx":"initandlisten","msg":"WiredTiger message","attr":{"message":"[1786974211:239585][720:0x7f45dc421c80], txn-recover: [WT_VERB_RECOVERY_ALL] Set global recovery timestamp: (0, 0)"}} {"t":{"$date":"2026-08-17T13:43:31.239+00:00"},"s":"I", "c":"STORAGE", "id":22430, "ctx":"initandlisten","msg":"WiredTiger message","attr":{"message":"[1786974211:239599][720:0x7f45dc421c80], txn-recover: [WT_VERB_RECOVERY_ALL] Set global oldest timestamp: (0, 0)"}} {"t":{"$date":"2026-08-17T13:43:31.239+00:00"},"s":"I", "c":"STORAGE", "id":22430, "ctx":"initandlisten","msg":"WiredTiger message","attr":{"message":"[1786974211:239627][720:0x7f45dc421c80], txn-recover: [WT_VERB_RECOVERY_PROGRESS] recovery was completed successfully and took 0ms, including 0ms for the log replay, 0ms for the rollback to stable, and 0ms for the checkpoint."}} {"t":{"$date":"2026-08-17T13:43:31.272+00:00"},"s":"I", "c":"STORAGE", "id":4795906, "ctx":"initandlisten","msg":"WiredTiger opened","attr":{"durationMillis":170}} {"t":{"$date":"2026-08-17T13:43:31.272+00:00"},"s":"I", "c":"RECOVERY", "id":23987, "ctx":"initandlisten","msg":"WiredTiger recoveryTimestamp","attr":{"recoveryTimestamp":{"$timestamp":{"t":0,"i":0}}}} + DB_URI=mongodb://127.0.0.103/open5gs + DBCTL=<
https://jenkins.osmocom.org/jenkins/job/ttcn3-5gc-test-ogs-latest/ws/_cache…
> + DBCTL_CMD=<
https://jenkins.osmocom.org/jenkins/job/ttcn3-5gc-test-ogs-latest/ws/_cache…
> --db_uri=mongodb://127.0.0.103/open5gs + [ -e <
https://jenkins.osmocom.org/jenkins/job/ttcn3-5gc-test-ogs-latest/ws/_cache…
> ] + wget
https://raw.githubusercontent.com/open5gs/open5gs/v2.7.1/misc/db/open5gs-db…
-O <
https://jenkins.osmocom.org/jenkins/job/ttcn3-5gc-test-ogs-latest/ws/_cache…
> --2026-08-17 13:43:31--
https://raw.githubusercontent.com/open5gs/open5gs/v2.7.1/misc/db/open5gs-db…
Resolving
raw.githubusercontent.com
(
raw.githubusercontent.com
)... 185.199.111.133, 185.199.110.133, 185.199.109.133, ... Connecting to
raw.githubusercontent.com
(raw.githubusercontent.com)|185.199.111.133|:443... connected. HTTP request sent, awaiting response... {"t":{"$date":"2026-08-17T13:43:31.340+00:00"},"s":"I", "c":"STORAGE", "id":22262, "ctx":"initandlisten","msg":"Timestamp monitor starting"} {"t":{"$date":"2026-08-17T13:43:31.358+00:00"},"s":"W", "c":"CONTROL", "id":22120, "ctx":"initandlisten","msg":"Access control is not enabled for the database. Read and write access to data and configuration is unrestricted","tags":["startupWarnings"]} {"t":{"$date":"2026-08-17T13:43:31.358+00:00"},"s":"W", "c":"CONTROL", "id":22138, "ctx":"initandlisten","msg":"You are running this process as the root user, which is not recommended","tags":["startupWarnings"]} {"t":{"$date":"2026-08-17T13:43:31.359+00:00"},"s":"W", "c":"CONTROL", "id":22178, "ctx":"initandlisten","msg":"/sys/kernel/mm/transparent_hugepage/enabled is 'always'. We suggest setting it to 'never' in this binary version","tags":["startupWarnings"]} {"t":{"$date":"2026-08-17T13:43:31.362+00:00"},"s":"I", "c":"STORAGE", "id":20320, "ctx":"initandlisten","msg":"createCollection","attr":{"namespace":"admin.system.version","uuidDisposition":"provided","uuid":{"uuid":{"$uuid":"68127537-6a1f-403c-8c6a-2b5b70da986f"}},"options":{"uuid":{"$uuid":"68127537-6a1f-403c-8c6a-2b5b70da986f"}}}} {"t":{"$date":"2026-08-17T13:43:31.405+00:00"},"s":"I", "c":"INDEX", "id":20345, "ctx":"initandlisten","msg":"Index build: done building","attr":{"buildUUID":null,"namespace":"admin.system.version","index":"_id_","commitTimestamp":null}} {"t":{"$date":"2026-08-17T13:43:31.406+00:00"},"s":"I", "c":"REPL", "id":20459, "ctx":"initandlisten","msg":"Setting featureCompatibilityVersion","attr":{"newVersion":"5.0"}} {"t":{"$date":"2026-08-17T13:43:31.406+00:00"},"s":"I", "c":"NETWORK", "id":4915702, "ctx":"initandlisten","msg":"Updated wire specification","attr":{"oldSpec":{"incomingExternalClient":{"minWireVersion":0,"maxWireVersion":13},"incomingInternalClient":{"minWireVersion":0,"maxWireVersion":13},"outgoing":{"minWireVersion":0,"maxWireVersion":13},"isInternalClient":true},"newSpec":{"incomingExternalClient":{"minWireVersion":0,"maxWireVersion":13},"incomingInternalClient":{"minWireVersion":13,"maxWireVersion":13},"outgoing":{"minWireVersion":13,"maxWireVersion":13},"isInternalClient":true}}} {"t":{"$date":"2026-08-17T13:43:31.407+00:00"},"s":"I", "c":"NETWORK", "id":4915702, "ctx":"initandlisten","msg":"Updated wire specification","attr":{"oldSpec":{"incomingExternalClient":{"minWireVersion":0,"maxWireVersion":13},"incomingInternalClient":{"minWireVersion":13,"maxWireVersion":13},"outgoing":{"minWireVersion":13,"maxWireVersion":13},"isInternalClient":true},"newSpec":{"incomingExternalClient":{"minWireVersion":0,"maxWireVersion":13},"incomingInternalClient":{"minWireVersion":13,"maxWireVersion":13},"outgoing":{"minWireVersion":13,"maxWireVersion":13},"isInternalClient":true}}} {"t":{"$date":"2026-08-17T13:43:31.407+00:00"},"s":"I", "c":"STORAGE", "id":5071100, "ctx":"initandlisten","msg":"Clearing temp directory"} {"t":{"$date":"2026-08-17T13:43:31.407+00:00"},"s":"I", "c":"CONTROL", "id":20536, "ctx":"initandlisten","msg":"Flow Control is enabled on this deployment"} {"t":{"$date":"2026-08-17T13:43:31.410+00:00"},"s":"I", "c":"FTDC", "id":20625, "ctx":"initandlisten","msg":"Initializing full-time diagnostic data capture","attr":{"dataDirectory":"db/diagnostic.data"}} {"t":{"$date":"2026-08-17T13:43:31.410+00:00"},"s":"I", "c":"STORAGE", "id":20320, "ctx":"initandlisten","msg":"createCollection","attr":{"namespace":"local.startup_log","uuidDisposition":"generated","uuid":{"uuid":{"$uuid":"a6312a0c-23c2-483f-97fb-738f81d1a7a0"}},"options":{"capped":true,"size":10485760}}} {"t":{"$date":"2026-08-17T13:43:31.447+00:00"},"s":"I", "c":"INDEX", "id":20345, "ctx":"initandlisten","msg":"Index build: done building","attr":{"buildUUID":null,"namespace":"local.startup_log","index":"_id_","commitTimestamp":null}} {"t":{"$date":"2026-08-17T13:43:31.447+00:00"},"s":"I", "c":"REPL", "id":6015317, "ctx":"initandlisten","msg":"Setting new configuration state","attr":{"newState":"ConfigReplicationDisabled","oldState":"ConfigPreStart"}} {"t":{"$date":"2026-08-17T13:43:31.449+00:00"},"s":"I", "c":"NETWORK", "id":23015, "ctx":"listener","msg":"Listening on","attr":{"address":"/tmp/mongodb-27017.sock"}} {"t":{"$date":"2026-08-17T13:43:31.449+00:00"},"s":"I", "c":"NETWORK", "id":23015, "ctx":"listener","msg":"Listening on","attr":{"address":"127.0.0.103"}} {"t":{"$date":"2026-08-17T13:43:31.449+00:00"},"s":"I", "c":"NETWORK", "id":23016, "ctx":"listener","msg":"Waiting for connections","attr":{"port":27017,"ssl":"off"}} {"t":{"$date":"2026-08-17T13:43:31.451+00:00"},"s":"I", "c":"STORAGE", "id":20320, "ctx":"LogicalSessionCacheRefresh","msg":"createCollection","attr":{"namespace":"config.system.sessions","uuidDisposition":"generated","uuid":{"uuid":{"$uuid":"88e01c1d-2d2c-4dec-afc4-4f23d460b6f4"}},"options":{}}} {"t":{"$date":"2026-08-17T13:43:31.451+00:00"},"s":"I", "c":"CONTROL", "id":20712, "ctx":"LogicalSessionCacheReap","msg":"Sessions collection is not set up; waiting until next sessions reap interval","attr":{"error":"NamespaceNotFound: config.system.sessions does not exist"}} {"t":{"$date":"2026-08-17T13:43:31.515+00:00"},"s":"I", "c":"INDEX", "id":20345, "ctx":"LogicalSessionCacheRefresh","msg":"Index build: done building","attr":{"buildUUID":null,"namespace":"config.system.sessions","index":"_id_","commitTimestamp":null}} {"t":{"$date":"2026-08-17T13:43:31.515+00:00"},"s":"I", "c":"INDEX", "id":20345, "ctx":"LogicalSessionCacheRefresh","msg":"Index build: done building","attr":{"buildUUID":null,"namespace":"config.system.sessions","index":"lsidTTLIndex","commitTimestamp":null}} 429 Too Many Requests 2026-08-17 13:43:34 ERROR 429: Too Many Requests. [1;91m[testenv] db: setup script failed[0m [1;34m[testenv] Stopping podman container[0m [0;94m[testenv] + ['podman', 'kill', 'testenv-5gc-osmocom-latest-20260817-1343-8379c475-1'][0m testenv-5gc-osmocom-latest-20260817-1343-8379c475-1 [0;94m[testenv] Skipping clean up scripts, podman container has already stopped[0m [0;94m[testenv] feed_watchdog_loop: podman container has stopped[0m [1;34m[testenv] Logs saved to:
https://jenkins.osmocom.org/jenkins/job/ttcn3-5gc-test-ogs-latest/277/artif…
[0m + RC=1 + [ 1 = 0 ] + + uptime grep --color=always -o load.* [01;31m[Kload average: 1.41, 1.48, 2.20[m[K + exit 1 Build step 'Execute shell' marked build as failure Recording test results ERROR: Step ‘Publish JUnit test result report’ failed: No test report files were found. Configuration error?
1
0
0
0
Build failed in Jenkins: ttcn3-5gc-test-ogs #451
by jenkins@lists.osmocom.org
17 Aug '26
17 Aug '26
See <
https://jenkins.osmocom.org/jenkins/job/ttcn3-5gc-test-ogs/451/display/redi…
> Changes: ------------------------------------------ [...truncated 243.92 MiB...] [32m08/17 09:32:59.771[0m: [[33mnrf[0m] [1;37mDEBUG[0m: nrf_nf_state_registered(): OGS_EVENT_NAME_SBI_SERVER (../src/nrf/nf-sm.c:201) [32m08/17 09:32:59.771[0m: [[33msbi[0m] [1;37mDEBUG[0m: STATUS [204] (../lib/sbi/nghttp2-server.c:702) [32m08/17 09:32:59.771[0m: [[33msbi[0m] [1;37mDEBUG[0m: STREAM closed [601] (../lib/sbi/nghttp2-server.c:1431) 0000: 00000301 05000002 5989fbbe ........Y... [32m08/17 09:32:59.772[0m: [[33msbi[0m] [1;37mDEBUG[0m: [204:PATCH]
http://127.0.0.10:7777/nnrf-nfm/v1/nf-instances/31946a38-9a1e-41f1-b98a-894…
(../lib/sbi/client.c:744) [32m08/17 09:32:59.772[0m: [[33msbi[0m] [1;37mDEBUG[0m: RECEIVED[0] (../lib/sbi/client.c:755) [32m08/17 09:32:59.772[0m: [[33msbi[0m] [1;37mDEBUG[0m: STATUS [204] (../lib/sbi/nghttp2-server.c:702) [32m08/17 09:32:59.772[0m: [[33msbi[0m] [1;37mDEBUG[0m: STREAM closed [4721] (../lib/sbi/nghttp2-server.c:1431) 0000: 00001a01 05000012 7189c261 96d07abe ........q..a..z. 0010: 940baa43 6cca0802 71403f71 915c6df5 ...Cl...q(a)?q.\m. 0020: 3168df 1h. [32m08/17 09:32:59.772[0m: [[33msbi[0m] [1;37mDEBUG[0m: [204:PATCH]
http://127.0.0.200:7777/nnrf-nfm/v1/nf-instances/31946a38-9a1e-41f1-b98a-89…
(../lib/sbi/client.c:744) [32m08/17 09:32:59.772[0m: [[33msbi[0m] [1;37mDEBUG[0m: RECEIVED[0] (../lib/sbi/client.c:755) [32m08/17 09:32:59.772[0m: [[33mausf[0m] [1;37mDEBUG[0m: ausf_state_operational(): OGS_EVENT_NAME_SBI_CLIENT (../src/ausf/ausf-sm.c:56) [32m08/17 09:32:59.772[0m: [[33msbi[0m] [1;37mDEBUG[0m: ogs_sbi_nf_state_registered(): OGS_EVENT_NAME_SBI_CLIENT (../lib/sbi/nf-sm.c:312) [32m08/17 09:32:59.866[0m: [[33mudm[0m] [1;37mDEBUG[0m: udm_state_operational(): OGS_EVENT_NAME_SBI_TIMER (../src/udm/udm-sm.c:61) [32m08/17 09:32:59.866[0m: [[33msbi[0m] [1;37mDEBUG[0m: ogs_sbi_nf_state_registered(): OGS_EVENT_NAME_SBI_TIMER (../lib/sbi/nf-sm.c:312) [32m08/17 09:32:59.866[0m: [[33msbi[0m] [1;37mDEBUG[0m: [PATCH]
http://127.0.0.200:7777/nnrf-nfm/v1/nf-instances/31a5541a-9a1e-41f1-a8c4-c7…
(../lib/sbi/client.c:797) [32m08/17 09:32:59.866[0m: [[33msbi[0m] [1;37mDEBUG[0m: SENDING...[101] (../lib/sbi/client.c:546) [32m08/17 09:32:59.866[0m: [[33msbi[0m] [1;37mDEBUG[0m: [{"op":"replace","path":"/nfStatus","value":"REGISTERED"},{"op":"replace","path":"/load","value":25}] (../lib/sbi/client.c:548) [32m08/17 09:32:59.866[0m: [[33msbi[0m] [1;37mDEBUG[0m: STREAM added [13013] (../lib/sbi/nghttp2-server.c:1749) [32m08/17 09:32:59.866[0m: [[33msbi[0m] [1;37mDEBUG[0m: [PATCH] /nnrf-nfm/v1/nf-instances/31a5541a-9a1e-41f1-a8c4-c717b67f0f9f (../lib/sbi/nghttp2-server.c:1308) [32m08/17 09:32:59.866[0m: [[33msbi[0m] [1;37mDEBUG[0m: RECEIVED: 101 (../lib/sbi/nghttp2-server.c:1312) [32m08/17 09:32:59.866[0m: [[33msbi[0m] [1;37mDEBUG[0m: [{"op":"replace","path":"/nfStatus","value":"REGISTERED"},{"op":"replace","path":"/load","value":25}] (../lib/sbi/nghttp2-server.c:1314) [32m08/17 09:32:59.866[0m: [[33msbi[0m] [1;37mDEBUG[0m: [PATCH]
http://127.0.0.10:7777/nnrf-nfm/v1/nf-instances/31a5541a-9a1e-41f1-a8c4-c71…
(../lib/sbi/client.c:797) [32m08/17 09:32:59.866[0m: [[33msbi[0m] [1;37mDEBUG[0m: SENDING...[101] (../lib/sbi/client.c:546) [32m08/17 09:32:59.866[0m: [[33msbi[0m] [1;37mDEBUG[0m: [{"op":"replace","path":"/nfStatus","value":"REGISTERED"},{"op":"replace","path":"/load","value":25}] (../lib/sbi/client.c:548) [32m08/17 09:32:59.867[0m: [[33msbi[0m] [1;37mDEBUG[0m: STREAM added [603] (../lib/sbi/nghttp2-server.c:1749) [32m08/17 09:32:59.867[0m: [[33msbi[0m] [1;37mDEBUG[0m: [PATCH] /nnrf-nfm/v1/nf-instances/31a5541a-9a1e-41f1-a8c4-c717b67f0f9f (../lib/sbi/nghttp2-server.c:1308) [32m08/17 09:32:59.867[0m: [[33msbi[0m] [1;37mDEBUG[0m: RECEIVED: 101 (../lib/sbi/nghttp2-server.c:1312) [32m08/17 09:32:59.867[0m: [[33msbi[0m] [1;37mDEBUG[0m: [{"op":"replace","path":"/nfStatus","value":"REGISTERED"},{"op":"replace","path":"/load","value":25}] (../lib/sbi/nghttp2-server.c:1314) [32m08/17 09:32:59.867[0m: [[33mnrf[0m] [1;37mDEBUG[0m: nrf_state_operational(): OGS_EVENT_NAME_SBI_SERVER (../src/nrf/nrf-sm.c:54) [32m08/17 09:32:59.867[0m: [[33mnrf[0m] [1;37mDEBUG[0m: nrf_nf_state_registered(): OGS_EVENT_NAME_SBI_SERVER (../src/nrf/nf-sm.c:201) [32m08/17 09:32:59.867[0m: [[33msbi[0m] [1;37mDEBUG[0m: STATUS [204] (../lib/sbi/nghttp2-server.c:702) [32m08/17 09:32:59.867[0m: [[33msbi[0m] [1;37mDEBUG[0m: STREAM closed [603] (../lib/sbi/nghttp2-server.c:1431) 0000: 00000301 05000002 5b89fbbe ........[... [32m08/17 09:32:59.867[0m: [[33msbi[0m] [1;37mDEBUG[0m: [204:PATCH]
http://127.0.0.10:7777/nnrf-nfm/v1/nf-instances/31a5541a-9a1e-41f1-a8c4-c71…
(../lib/sbi/client.c:744) [32m08/17 09:32:59.867[0m: [[33msbi[0m] [1;37mDEBUG[0m: RECEIVED[0] (../lib/sbi/client.c:755) [32m08/17 09:32:59.867[0m: [[33msbi[0m] [1;37mDEBUG[0m: STATUS [204] (../lib/sbi/nghttp2-server.c:702) [32m08/17 09:32:59.867[0m: [[33msbi[0m] [1;37mDEBUG[0m: STREAM closed [13013] (../lib/sbi/nghttp2-server.c:1431) 0000: 00001a01 05000032 d589c761 96d07abe .......2...a..z. 0010: 940baa43 6cca0802 71403f71 915c6df5 ...Cl...q(a)?q.\m. 0020: 3168df 1h. [32m08/17 09:32:59.867[0m: [[33msbi[0m] [1;37mDEBUG[0m: [204:PATCH]
http://127.0.0.200:7777/nnrf-nfm/v1/nf-instances/31a5541a-9a1e-41f1-a8c4-c7…
(../lib/sbi/client.c:744) [32m08/17 09:32:59.867[0m: [[33msbi[0m] [1;37mDEBUG[0m: RECEIVED[0] (../lib/sbi/client.c:755) [32m08/17 09:32:59.867[0m: [[33mudm[0m] [1;37mDEBUG[0m: udm_state_operational(): OGS_EVENT_NAME_SBI_CLIENT (../src/udm/udm-sm.c:61) [32m08/17 09:32:59.867[0m: [[33msbi[0m] [1;37mDEBUG[0m: ogs_sbi_nf_state_registered(): OGS_EVENT_NAME_SBI_CLIENT (../lib/sbi/nf-sm.c:312) [32m08/17 09:33:00.048[0m: [[33mudr[0m] [1;37mDEBUG[0m: udr_state_operational(): OGS_EVENT_NAME_SBI_TIMER (../src/udr/udr-sm.c:53) [32m08/17 09:33:00.048[0m: [[33msbi[0m] [1;37mDEBUG[0m: ogs_sbi_nf_state_registered(): OGS_EVENT_NAME_SBI_TIMER (../lib/sbi/nf-sm.c:312) [32m08/17 09:33:00.048[0m: [[33msbi[0m] [1;37mDEBUG[0m: [PATCH]
http://127.0.0.200:7777/nnrf-nfm/v1/nf-instances/31bfc656-9a1e-41f1-8850-f7…
(../lib/sbi/client.c:797) [32m08/17 09:33:00.048[0m: [[33msbi[0m] [1;37mDEBUG[0m: SENDING...[100] (../lib/sbi/client.c:546) [32m08/17 09:33:00.048[0m: [[33msbi[0m] [1;37mDEBUG[0m: [{"op":"replace","path":"/nfStatus","value":"REGISTERED"},{"op":"replace","path":"/load","value":0}] (../lib/sbi/client.c:548) [32m08/17 09:33:00.049[0m: [[33msbi[0m] [1;37mDEBUG[0m: STREAM added [61] (../lib/sbi/nghttp2-server.c:1749) [32m08/17 09:33:00.049[0m: [[33msbi[0m] [1;37mDEBUG[0m: [PATCH] /nnrf-nfm/v1/nf-instances/31bfc656-9a1e-41f1-8850-f73724448999 (../lib/sbi/nghttp2-server.c:1308) [32m08/17 09:33:00.049[0m: [[33msbi[0m] [1;37mDEBUG[0m: RECEIVED: 100 (../lib/sbi/nghttp2-server.c:1312) [32m08/17 09:33:00.049[0m: [[33msbi[0m] [1;37mDEBUG[0m: [{"op":"replace","path":"/nfStatus","value":"REGISTERED"},{"op":"replace","path":"/load","value":0}] (../lib/sbi/nghttp2-server.c:1314) [32m08/17 09:33:00.049[0m: [[33msbi[0m] [1;37mDEBUG[0m: [PATCH]
http://127.0.0.10:7777/nnrf-nfm/v1/nf-instances/31bfc656-9a1e-41f1-8850-f73…
(../lib/sbi/client.c:797) [32m08/17 09:33:00.049[0m: [[33msbi[0m] [1;37mDEBUG[0m: SENDING...[100] (../lib/sbi/client.c:546) [32m08/17 09:33:00.049[0m: [[33msbi[0m] [1;37mDEBUG[0m: [{"op":"replace","path":"/nfStatus","value":"REGISTERED"},{"op":"replace","path":"/load","value":0}] (../lib/sbi/client.c:548) [32m08/17 09:33:00.049[0m: [[33msbi[0m] [1;37mDEBUG[0m: STREAM added [605] (../lib/sbi/nghttp2-server.c:1749) [32m08/17 09:33:00.050[0m: [[33msbi[0m] [1;37mDEBUG[0m: [PATCH] /nnrf-nfm/v1/nf-instances/31bfc656-9a1e-41f1-8850-f73724448999 (../lib/sbi/nghttp2-server.c:1308) [32m08/17 09:33:00.050[0m: [[33msbi[0m] [1;37mDEBUG[0m: RECEIVED: 100 (../lib/sbi/nghttp2-server.c:1312) [32m08/17 09:33:00.050[0m: [[33msbi[0m] [1;37mDEBUG[0m: [{"op":"replace","path":"/nfStatus","value":"REGISTERED"},{"op":"replace","path":"/load","value":0}] (../lib/sbi/nghttp2-server.c:1314) [32m08/17 09:33:00.050[0m: [[33mnrf[0m] [1;37mDEBUG[0m: nrf_state_operational(): OGS_EVENT_NAME_SBI_SERVER (../src/nrf/nrf-sm.c:54) [32m08/17 09:33:00.050[0m: [[33mnrf[0m] [1;37mDEBUG[0m: nrf_nf_state_registered(): OGS_EVENT_NAME_SBI_SERVER (../src/nrf/nf-sm.c:201) [32m08/17 09:33:00.050[0m: [[33msbi[0m] [1;37mDEBUG[0m: STATUS [204] (../lib/sbi/nghttp2-server.c:702) [32m08/17 09:33:00.050[0m: [[33msbi[0m] [1;37mDEBUG[0m: STREAM closed [605] (../lib/sbi/nghttp2-server.c:1431) 0000: 00001a01 05000002 5d89fb61 96d07abe ........]..a..z. 0010: 940baa43 6cca0802 71403f71 966e000a ...Cl...q(a)?q.n.. 0020: 62d1bf b.. [32m08/17 09:33:00.050[0m: [[33msbi[0m] [1;37mDEBUG[0m: [204:PATCH]
http://127.0.0.10:7777/nnrf-nfm/v1/nf-instances/31bfc656-9a1e-41f1-8850-f73…
(../lib/sbi/client.c:744) [32m08/17 09:33:00.050[0m: [[33msbi[0m] [1;37mDEBUG[0m: RECEIVED[0] (../lib/sbi/client.c:755) [32m08/17 09:33:00.050[0m: [[33msbi[0m] [1;37mDEBUG[0m: STATUS [204] (../lib/sbi/nghttp2-server.c:702) [32m08/17 09:33:00.050[0m: [[33msbi[0m] [1;37mDEBUG[0m: STREAM closed [61] (../lib/sbi/nghttp2-server.c:1431) 0000: 00001a01 05000000 3d89d361 96d07abe ........=..a..z. 0010: 940baa43 6cca0802 71403f71 966e000a ...Cl...q(a)?q.n.. 0020: 62d1bf b.. [32m08/17 09:33:00.050[0m: [[33msbi[0m] [1;37mDEBUG[0m: [204:PATCH]
http://127.0.0.200:7777/nnrf-nfm/v1/nf-instances/31bfc656-9a1e-41f1-8850-f7…
(../lib/sbi/client.c:744) [32m08/17 09:33:00.051[0m: [[33msbi[0m] [1;37mDEBUG[0m: RECEIVED[0] (../lib/sbi/client.c:755) [32m08/17 09:33:00.051[0m: [[33mudr[0m] [1;37mDEBUG[0m: udr_state_operational(): OGS_EVENT_NAME_SBI_CLIENT (../src/udr/udr-sm.c:53) [32m08/17 09:33:00.051[0m: [[33msbi[0m] [1;37mDEBUG[0m: ogs_sbi_nf_state_registered(): OGS_EVENT_NAME_SBI_CLIENT (../lib/sbi/nf-sm.c:312) [32m08/17 09:33:00.279[0m: [[33mpcf[0m] [1;37mDEBUG[0m: pcf_state_operational(): OGS_EVENT_NAME_SBI_TIMER (../src/pcf/pcf-sm.c:64) [32m08/17 09:33:00.279[0m: [[33msbi[0m] [1;37mDEBUG[0m: ogs_sbi_nf_state_registered(): OGS_EVENT_NAME_SBI_TIMER (../lib/sbi/nf-sm.c:312) [32m08/17 09:33:00.280[0m: [[33msbi[0m] [1;37mDEBUG[0m: [PATCH]
http://127.0.0.200:7777/nnrf-nfm/v1/nf-instances/31e1cfc6-9a1e-41f1-ba81-03…
(../lib/sbi/client.c:797) [32m08/17 09:33:00.280[0m: [[33msbi[0m] [1;37mDEBUG[0m: SENDING...[101] (../lib/sbi/client.c:546) [32m08/17 09:33:00.280[0m: [[33msbi[0m] [1;37mDEBUG[0m: [{"op":"replace","path":"/nfStatus","value":"REGISTERED"},{"op":"replace","path":"/load","value":25}] (../lib/sbi/client.c:548) [32m08/17 09:33:00.280[0m: [[33msbi[0m] [1;37mDEBUG[0m: STREAM added [5761] (../lib/sbi/nghttp2-server.c:1749) [32m08/17 09:33:00.280[0m: [[33msbi[0m] [1;37mDEBUG[0m: [PATCH] /nnrf-nfm/v1/nf-instances/31e1cfc6-9a1e-41f1-ba81-0359781f4549 (../lib/sbi/nghttp2-server.c:1308) [32m08/17 09:33:00.280[0m: [[33msbi[0m] [1;37mDEBUG[0m: RECEIVED: 101 (../lib/sbi/nghttp2-server.c:1312) [32m08/17 09:33:00.280[0m: [[33msbi[0m] [1;37mDEBUG[0m: [{"op":"replace","path":"/nfStatus","value":"REGISTERED"},{"op":"replace","path":"/load","value":25}] (../lib/sbi/nghttp2-server.c:1314) [32m08/17 09:33:00.280[0m: [[33msbi[0m] [1;37mDEBUG[0m: [PATCH]
http://127.0.0.10:7777/nnrf-nfm/v1/nf-instances/31e1cfc6-9a1e-41f1-ba81-035…
(../lib/sbi/client.c:797) [32m08/17 09:33:00.280[0m: [[33msbi[0m] [1;37mDEBUG[0m: SENDING...[101] (../lib/sbi/client.c:546) [32m08/17 09:33:00.280[0m: [[33msbi[0m] [1;37mDEBUG[0m: [{"op":"replace","path":"/nfStatus","value":"REGISTERED"},{"op":"replace","path":"/load","value":25}] (../lib/sbi/client.c:548) [32m08/17 09:33:00.281[0m: [[33msbi[0m] [1;37mDEBUG[0m: STREAM added [607] (../lib/sbi/nghttp2-server.c:1749) [32m08/17 09:33:00.281[0m: [[33msbi[0m] [1;37mDEBUG[0m: [PATCH] /nnrf-nfm/v1/nf-instances/31e1cfc6-9a1e-41f1-ba81-0359781f4549 (../lib/sbi/nghttp2-server.c:1308) [32m08/17 09:33:00.281[0m: [[33msbi[0m] [1;37mDEBUG[0m: RECEIVED: 101 (../lib/sbi/nghttp2-server.c:1312) [32m08/17 09:33:00.281[0m: [[33msbi[0m] [1;37mDEBUG[0m: [{"op":"replace","path":"/nfStatus","value":"REGISTERED"},{"op":"replace","path":"/load","value":25}] (../lib/sbi/nghttp2-server.c:1314) [32m08/17 09:33:00.281[0m: [[33mnrf[0m] [1;37mDEBUG[0m: nrf_state_operational(): OGS_EVENT_NAME_SBI_SERVER (../src/nrf/nrf-sm.c:54) [32m08/17 09:33:00.281[0m: [[33mnrf[0m] [1;37mDEBUG[0m: nrf_nf_state_registered(): OGS_EVENT_NAME_SBI_SERVER (../src/nrf/nf-sm.c:201) [32m08/17 09:33:00.281[0m: [[33msbi[0m] [1;37mDEBUG[0m: STATUS [204] (../lib/sbi/nghttp2-server.c:702) [32m08/17 09:33:00.281[0m: [[33msbi[0m] [1;37mDEBUG[0m: STREAM closed [607] (../lib/sbi/nghttp2-server.c:1431) 0000: 00000301 05000002 5f89fcbe ........_... [32m08/17 09:33:00.281[0m: [[33msbi[0m] [1;37mDEBUG[0m: [204:PATCH]
http://127.0.0.10:7777/nnrf-nfm/v1/nf-instances/31e1cfc6-9a1e-41f1-ba81-035…
(../lib/sbi/client.c:744) [32m08/17 09:33:00.281[0m: [[33msbi[0m] [1;37mDEBUG[0m: RECEIVED[0] (../lib/sbi/client.c:755) [32m08/17 09:33:00.281[0m: [[33msbi[0m] [1;37mDEBUG[0m: STATUS [204] (../lib/sbi/nghttp2-server.c:702) [32m08/17 09:33:00.281[0m: [[33msbi[0m] [1;37mDEBUG[0m: STREAM closed [5761] (../lib/sbi/nghttp2-server.c:1431) 0000: 00001a01 05000016 8189fc61 96d07abe ...........a..z. 0010: 940baa43 6cca0802 71403f71 966e000a ...Cl...q(a)?q.n.. 0020: 62d1bf b.. [32m08/17 09:33:00.282[0m: [[33msbi[0m] [1;37mDEBUG[0m: [204:PATCH]
http://127.0.0.200:7777/nnrf-nfm/v1/nf-instances/31e1cfc6-9a1e-41f1-ba81-03…
(../lib/sbi/client.c:744) [32m08/17 09:33:00.282[0m: [[33msbi[0m] [1;37mDEBUG[0m: RECEIVED[0] (../lib/sbi/client.c:755) [32m08/17 09:33:00.282[0m: [[33mpcf[0m] [1;37mDEBUG[0m: pcf_state_operational(): OGS_EVENT_NAME_SBI_CLIENT (../src/pcf/pcf-sm.c:64) [32m08/17 09:33:00.282[0m: [[33msbi[0m] [1;37mDEBUG[0m: ogs_sbi_nf_state_registered(): OGS_EVENT_NAME_SBI_CLIENT (../lib/sbi/nf-sm.c:312) MTC@3c2c57eb410d: External command `<
https://jenkins.osmocom.org/jenkins/job/ttcn3-5gc-test-ogs/ws/ttcn3-tcpdump…
> C5G_Tests.TC_emergency_registration' was executed successfully (exit status: 0). MTC@3c2c57eb410d: Test case TC_emergency_registration started. GTP1U_EM(865)@3c2c57eb410d: Warning: sizes of 'struct sctp_event_subscribe': compile-time 14, kernel: 14 GTP1U_EM(865)@3c2c57eb410d: setverdict(fail): none -> fail reason: "Could not connect UECUPS socket, check your configuration", new component reason: "Could not connect UECUPS socket, check your configuration" GTP1U_EM(865)@3c2c57eb410d: Dynamic test case error: testcase.stop GTP1U_EM(865)@3c2c57eb410d: setverdict(error): fail -> error GTP1U_EM(865)@3c2c57eb410d: Final verdict of PTC: error [32m08/17 09:33:00.432[0m: [[33mamf[0m] [1;32mINFO[0m: gNB-N2 accepted[127.0.0.202]:50000 in ng-path module (../src/amf/ngap-sctp.c:113) [32m08/17 09:33:00.432[0m: [[33mamf[0m] [1;37mDEBUG[0m: amf_state_operational(): AMF_EVENT_NGAP_LO_ACCEPT (../src/amf/amf-sm.c:84) [32m08/17 09:33:00.432[0m: [[33mamf[0m] [1;32mINFO[0m: gNB-N2 accepted[127.0.0.202] in master_sm module (../src/amf/amf-sm.c:822) TC_emergency_registration-NGAP0(866)@3c2c57eb410d: Warning: sizes of 'struct sctp_event_subscribe': compile-time 14, kernel: 14 [32m08/17 09:33:00.437[0m: [[33mamf[0m] [1;37mDEBUG[0m: ngap_state_initial(): ENTRY (../src/amf/ngap-sm.c:28) [32m08/17 09:33:00.437[0m: [[33mamf[0m] [1;37mDEBUG[0m: ngap_state_operational(): ENTRY (../src/amf/ngap-sm.c:55) [32m08/17 09:33:00.437[0m: [[33mamf[0m] [1;32mINFO[0m: [Added] Number of gNBs is now 1 (../src/amf/context.c:1277) [32m08/17 09:33:00.437[0m: [[33mamf[0m] [1;37mDEBUG[0m: SCTP_ASSOC_CHANGE:[T:32769, F:0x0, S:0, I/O:64/30] (../src/amf/ngap-sctp.c:152) [32m08/17 09:33:00.437[0m: [[33mamf[0m] [1;37mDEBUG[0m: SCTP_COMM_UP (../src/amf/ngap-sctp.c:161) [32m08/17 09:33:00.437[0m: [[33mamf[0m] [1;37mDEBUG[0m: amf_state_operational(): AMF_EVENT_NGAP_LO_SCTP_COMM_UP (../src/amf/amf-sm.c:84) [32m08/17 09:33:00.437[0m: [[33mamf[0m] [1;32mINFO[0m: gNB-N2[127.0.0.202] max_num_of_ostreams : 30 (../src/amf/amf-sm.c:869) [32m08/17 09:33:00.439[0m: [[33mamf[0m] [1;32mINFO[0m: gNB-N2 accepted[127.0.0.202]:50001 in ng-path module (../src/amf/ngap-sctp.c:113) [32m08/17 09:33:00.439[0m: [[33mamf[0m] [1;37mDEBUG[0m: amf_state_operational(): AMF_EVENT_NGAP_LO_ACCEPT (../src/amf/amf-sm.c:84) [32m08/17 09:33:00.439[0m: [[33mamf[0m] [1;32mINFO[0m: gNB-N2 accepted[127.0.0.202] in master_sm module (../src/amf/amf-sm.c:822) TC_emergency_registration-NGAP1(867)@3c2c57eb410d: Warning: sizes of 'struct sctp_event_subscribe': compile-time 14, kernel: 14 [32m08/17 09:33:00.442[0m: [[33mamf[0m] [1;37mDEBUG[0m: ngap_state_initial(): ENTRY (../src/amf/ngap-sm.c:28) [32m08/17 09:33:00.442[0m: [[33mamf[0m] [1;37mDEBUG[0m: ngap_state_operational(): ENTRY (../src/amf/ngap-sm.c:55) [32m08/17 09:33:00.442[0m: [[33mamf[0m] [1;32mINFO[0m: [Added] Number of gNBs is now 2 (../src/amf/context.c:1277) [32m08/17 09:33:00.442[0m: [[33mamf[0m] [1;37mDEBUG[0m: SCTP_ASSOC_CHANGE:[T:32769, F:0x0, S:0, I/O:64/30] (../src/amf/ngap-sctp.c:152) [32m08/17 09:33:00.442[0m: [[33mamf[0m] [1;37mDEBUG[0m: SCTP_COMM_UP (../src/amf/ngap-sctp.c:161) [32m08/17 09:33:00.442[0m: [[33mamf[0m] [1;37mDEBUG[0m: amf_state_operational(): AMF_EVENT_NGAP_LO_SCTP_COMM_UP (../src/amf/amf-sm.c:84) [32m08/17 09:33:00.442[0m: [[33mamf[0m] [1;32mINFO[0m: gNB-N2[127.0.0.202] max_num_of_ostreams : 30 (../src/amf/amf-sm.c:869) [32m08/17 09:33:00.443[0m: [[33mamf[0m] [1;37mDEBUG[0m: amf_state_operational(): AMF_EVENT_NGAP_MESSAGE (../src/amf/amf-sm.c:84) [32m08/17 09:33:00.443[0m: [[33mamf[0m] [1;37mDEBUG[0m: ngap_state_operational(): AMF_EVENT_NGAP_MESSAGE (../src/amf/ngap-sm.c:55) [32m08/17 09:33:00.443[0m: [[33mamf[0m] [1;37mDEBUG[0m: NGSetupRequest (../src/amf/ngap-handler.c:288) [32m08/17 09:33:00.443[0m: [[33mamf[0m] [1;37mDEBUG[0m: IP[127.0.0.202] GNB_ID[0x0] GNB_ID_LENGTH[22] (../src/amf/ngap-handler.c:386) [32m08/17 09:33:00.443[0m: [[33mamf[0m] [1;37mDEBUG[0m: PLMN_ID[MCC:999 MNC:70] (../src/amf/ngap-handler.c:391) [32m08/17 09:33:00.443[0m: [[33mamf[0m] [1;37mDEBUG[0m: PagingDRX[0] (../src/amf/ngap-handler.c:395) [32m08/17 09:33:00.443[0m: [[33mamf[0m] [1;37mDEBUG[0m: TAC[1] (../src/amf/ngap-handler.c:439) [32m08/17 09:33:00.443[0m: [[33mamf[0m] [1;37mDEBUG[0m: PLMN_ID[MCC:999 MNC:70] (../src/amf/ngap-handler.c:501) [32m08/17 09:33:00.443[0m: [[33mamf[0m] [1;37mDEBUG[0m: S_NSSAI[SST:1 SD:0xffffff] (../src/amf/ngap-handler.c:562) [32m08/17 09:33:00.443[0m: [[33mamf[0m] [1;37mDEBUG[0m: TAC[1] (../src/amf/ngap-handler.c:72) [32m08/17 09:33:00.443[0m: [[33mamf[0m] [1;37mDEBUG[0m: PLMN_ID[MCC:999 MNC:70] (../src/amf/ngap-handler.c:73) [32m08/17 09:33:00.443[0m: [[33mamf[0m] [1;37mDEBUG[0m: SERVED_TAI_INDEX[0] (../src/amf/ngap-handler.c:78) [32m08/17 09:33:00.443[0m: [[33mamf[0m] [1;37mDEBUG[0m: PLMN_ID[MCC:999 MNC:70] (../src/amf/ngap-handler.c:100) [32m08/17 09:33:00.443[0m: [[33mamf[0m] [1;37mDEBUG[0m: S_NSSAI[SST:1 SD:0xffffff] (../src/amf/ngap-handler.c:105) [32m08/17 09:33:00.443[0m: [[33mamf[0m] [1;37mDEBUG[0m: NG-Setup response (../src/amf/ngap-path.c:356) [32m08/17 09:33:00.443[0m: [[33mamf[0m] [1;37mDEBUG[0m: NGSetupResponse (../src/amf/ngap-build.c:91) [32m08/17 09:33:00.443[0m: [[33mamf[0m] [1;37mDEBUG[0m: IP[127.0.0.202] RAN_ID[0] (../src/amf/ngap-path.c:64) MTC@3c2c57eb410d: setverdict(pass): none -> pass MTC@3c2c57eb410d: Dynamic test case error: Error message was received from MC: The connect operation refers to test component with component reference 865, which has already terminated. MTC@3c2c57eb410d: setverdict(error): pass -> error TC_emergency_registration0(868)@3c2c57eb410d: Final verdict of PTC: none [32m08/17 09:33:00.450[0m: [[33mamf[0m] [1;37mDEBUG[0m: SCTP_SHUTDOWN_EVENT:[T:32773, F:0x0, L:12] (../src/amf/ngap-sctp.c:193) [32m08/17 09:33:00.450[0m: [[33mamf[0m] [1;37mDEBUG[0m: SCTP_SHUTDOWN_EVENT:[T:32773, F:0x0, L:12] (../src/amf/ngap-sctp.c:193) [32m08/17 09:33:00.450[0m: [[33mamf[0m] [1;37mDEBUG[0m: amf_state_operational(): AMF_EVENT_NGAP_LO_CONNREFUSED (../src/amf/amf-sm.c:84) [32m08/17 09:33:00.450[0m: [[33mamf[0m] [1;32mINFO[0m: gNB-N2[127.0.0.202] connection refused!!! (../src/amf/amf-sm.c:882) [32m08/17 09:33:00.450[0m: [[33mamf[0m] [1;37mDEBUG[0m: ngap_state_operational(): EXIT (../src/amf/ngap-sm.c:55) [32m08/17 09:33:00.450[0m: [[33mamf[0m] [1;37mDEBUG[0m: ngap_state_final(): EXIT (../src/amf/ngap-sm.c:37) [32m08/17 09:33:00.450[0m: [[33mamf[0m] [1;32mINFO[0m: [Removed] Number of gNBs is now 1 (../src/amf/context.c:1305) [32m08/17 09:33:00.450[0m: [[33mamf[0m] [1;37mDEBUG[0m: amf_state_operational(): AMF_EVENT_NGAP_LO_CONNREFUSED (../src/amf/amf-sm.c:84) [32m08/17 09:33:00.450[0m: [[33mamf[0m] [1;32mINFO[0m: gNB-N2[127.0.0.202] connection refused!!! (../src/amf/amf-sm.c:882) [32m08/17 09:33:00.450[0m: [[33mamf[0m] [1;37mDEBUG[0m: ngap_state_operational(): EXIT (../src/amf/ngap-sm.c:55) [32m08/17 09:33:00.450[0m: [[33mamf[0m] [1;37mDEBUG[0m: ngap_state_final(): EXIT (../src/amf/ngap-sm.c:37) [32m08/17 09:33:00.450[0m: [[33mamf[0m] [1;32mINFO[0m: [Removed] Number of gNBs is now 0 (../src/amf/context.c:1305) TC_emergency_registration-NGAP1(867)@3c2c57eb410d: Final verdict of PTC: none TC_emergency_registration-NGAP0(866)@3c2c57eb410d: Final verdict of PTC: none MTC@3c2c57eb410d: Setting final verdict of the test case. MTC@3c2c57eb410d: Local verdict of MTC: error MTC@3c2c57eb410d: Local verdict of PTC GTP1U_EM(865): error (error -> error) MTC@3c2c57eb410d: Local verdict of PTC TC_emergency_registration-NGAP0(866): none (error -> error) MTC@3c2c57eb410d: Local verdict of PTC TC_emergency_registration-NGAP1(867): none (error -> error) MTC@3c2c57eb410d: Local verdict of PTC TC_emergency_registration0(868): none (error -> error) MTC@3c2c57eb410d: Test case TC_emergency_registration finished. Verdict: error MTC@3c2c57eb410d: Starting external command `<
https://jenkins.osmocom.org/jenkins/job/ttcn3-5gc-test-ogs/ws/ttcn3-tcpdump…
> C5G_Tests.TC_emergency_registration error'. (09:33:00) load average: 11.52, 5.23, 3.16 [1;31m------ C5G_Tests.TC_emergency_registration error ------[0m Waiting for packet dumper to finish... 0 (prev_count=-1, count=3448) [32m08/17 09:33:00.520[0m: [[33mamf[0m] [1;37mDEBUG[0m: amf_state_operational(): OGS_EVENT_NAME_SBI_TIMER (../src/amf/amf-sm.c:84) [32m08/17 09:33:00.520[0m: [[33msbi[0m] [1;37mDEBUG[0m: ogs_sbi_nf_state_registered(): OGS_EVENT_NAME_SBI_TIMER (../lib/sbi/nf-sm.c:312) [32m08/17 09:33:00.520[0m: [[33msbi[0m] [1;37mDEBUG[0m: [PATCH]
http://127.0.0.200:7777/nnrf-nfm/v1/nf-instances/320dbae6-9a1e-41f1-bcba-61…
(../lib/sbi/client.c:797) [32m08/17 09:33:00.520[0m: [[33msbi[0m] [1;37mDEBUG[0m: SENDING...[100] (../lib/sbi/client.c:546) [32m08/17 09:33:00.520[0m: [[33msbi[0m] [1;37mDEBUG[0m: [{"op":"replace","path":"/nfStatus","value":"REGISTERED"},{"op":"replace","path":"/load","value":0}] (../lib/sbi/client.c:548) [32m08/17 09:33:00.521[0m: [[33msbi[0m] [1;37mDEBUG[0m: STREAM added [22355] (../lib/sbi/nghttp2-server.c:1749) [32m08/17 09:33:00.521[0m: [[33msbi[0m] [1;37mDEBUG[0m: [PATCH] /nnrf-nfm/v1/nf-instances/320dbae6-9a1e-41f1-bcba-6184004e2974 (../lib/sbi/nghttp2-server.c:1308) [32m08/17 09:33:00.521[0m: [[33msbi[0m] [1;37mDEBUG[0m: RECEIVED: 100 (../lib/sbi/nghttp2-server.c:1312) [32m08/17 09:33:00.521[0m: [[33msbi[0m] [1;37mDEBUG[0m: [{"op":"replace","path":"/nfStatus","value":"REGISTERED"},{"op":"replace","path":"/load","value":0}] (../lib/sbi/nghttp2-server.c:1314) [32m08/17 09:33:00.521[0m: [[33msbi[0m] [1;37mDEBUG[0m: [PATCH]
http://127.0.0.10:7777/nnrf-nfm/v1/nf-instances/320dbae6-9a1e-41f1-bcba-618…
(../lib/sbi/client.c:797) [32m08/17 09:33:00.521[0m: [[33msbi[0m] [1;37mDEBUG[0m: SENDING...[100] (../lib/sbi/client.c:546) [32m08/17 09:33:00.521[0m: [[33msbi[0m] [1;37mDEBUG[0m: [{"op":"replace","path":"/nfStatus","value":"REGISTERED"},{"op":"replace","path":"/load","value":0}] (../lib/sbi/client.c:548) [32m08/17 09:33:00.521[0m: [[33msbi[0m] [1;37mDEBUG[0m: STREAM added [609] (../lib/sbi/nghttp2-server.c:1749) [32m08/17 09:33:00.521[0m: [[33msbi[0m] [1;37mDEBUG[0m: [PATCH] /nnrf-nfm/v1/nf-instances/320dbae6-9a1e-41f1-bcba-6184004e2974 (../lib/sbi/nghttp2-server.c:1308) [32m08/17 09:33:00.521[0m: [[33msbi[0m] [1;37mDEBUG[0m: RECEIVED: 100 (../lib/sbi/nghttp2-server.c:1312) [32m08/17 09:33:00.521[0m: [[33msbi[0m] [1;37mDEBUG[0m: [{"op":"replace","path":"/nfStatus","value":"REGISTERED"},{"op":"replace","path":"/load","value":0}] (../lib/sbi/nghttp2-server.c:1314) [32m08/17 09:33:00.521[0m: [[33mnrf[0m] [1;37mDEBUG[0m: nrf_state_operational(): OGS_EVENT_NAME_SBI_SERVER (../src/nrf/nrf-sm.c:54) [32m08/17 09:33:00.521[0m: [[33mnrf[0m] [1;37mDEBUG[0m: nrf_nf_state_registered(): OGS_EVENT_NAME_SBI_SERVER (../src/nrf/nf-sm.c:201) [32m08/17 09:33:00.521[0m: [[33msbi[0m] [1;37mDEBUG[0m: STATUS [204] (../lib/sbi/nghttp2-server.c:702) [32m08/17 09:33:00.521[0m: [[33msbi[0m] [1;37mDEBUG[0m: STREAM closed [609] (../lib/sbi/nghttp2-server.c:1431) 0000: 00000301 05000002 6189fcbe ........a... [32m08/17 09:33:00.522[0m: [[33msbi[0m] [1;37mDEBUG[0m: [204:PATCH]
http://127.0.0.10:7777/nnrf-nfm/v1/nf-instances/320dbae6-9a1e-41f1-bcba-618…
(../lib/sbi/client.c:744) [32m08/17 09:33:00.522[0m: [[33msbi[0m] [1;37mDEBUG[0m: RECEIVED[0] (../lib/sbi/client.c:755) [32m08/17 09:33:00.522[0m: [[33msbi[0m] [1;37mDEBUG[0m: STATUS [204] (../lib/sbi/nghttp2-server.c:702) [32m08/17 09:33:00.522[0m: [[33msbi[0m] [1;37mDEBUG[0m: STREAM closed [22355] (../lib/sbi/nghttp2-server.c:1431) 0000: 00001a01 05000057 5389c861 96d07abe .......WS..a..z. 0010: 940baa43 6cca0802 71403f71 966e000a ...Cl...q(a)?q.n.. 0020: 62d1bf b.. [32m08/17 09:33:00.522[0m: [[33msbi[0m] [1;37mDEBUG[0m: [204:PATCH]
http://127.0.0.200:7777/nnrf-nfm/v1/nf-instances/320dbae6-9a1e-41f1-bcba-61…
(../lib/sbi/client.c:744) [32m08/17 09:33:00.522[0m: [[33msbi[0m] [1;37mDEBUG[0m: RECEIVED[0] (../lib/sbi/client.c:755) [32m08/17 09:33:00.522[0m: [[33mamf[0m] [1;37mDEBUG[0m: amf_state_operational(): OGS_EVENT_NAME_SBI_CLIENT (../src/amf/amf-sm.c:84) [32m08/17 09:33:00.522[0m: [[33msbi[0m] [1;37mDEBUG[0m: ogs_sbi_nf_state_registered(): OGS_EVENT_NAME_SBI_CLIENT (../lib/sbi/nf-sm.c:312) Waiting for packet dumper to finish... 1 (prev_count=3448, count=10024) MTC@3c2c57eb410d: External command `<
https://jenkins.osmocom.org/jenkins/job/ttcn3-5gc-test-ogs/ws/ttcn3-tcpdump…
> C5G_Tests.TC_emergency_registration error' was executed successfully (exit status: 0). MTC@3c2c57eb410d: Starting external command `<
https://jenkins.osmocom.org/jenkins/job/ttcn3-5gc-test-ogs/ws/ttcn3-tcpdump…
> C5G_Tests.TC_handover_inter_ngran_xn'. ------ C5G_Tests.TC_handover_inter_ngran_xn ------ (09:33:02) load average: 11.52, 5.23, 3.16 /usr/bin/dumpcap -q -s 1520 -n -i any -w "<
https://jenkins.osmocom.org/jenkins/job/ttcn3-5gc-test-ogs/451/artifact/log…
"> ><
https://jenkins.osmocom.org/jenkins/job/ttcn3-5gc-test-ogs/451/artifact/log…
> 2>/tmp/cmderr & Waiting for packet dumper to start... 0 [1;34m[testenv] Stopping podman container[0m [0;94m[testenv] + ['podman', 'kill', 'testenv-5gc-osmocom-nightly-20260817-0929-95852505-1'][0m testenv-5gc-osmocom-nightly-20260817-0929-95852505-1 [0;94m[testenv] Skipping clean up scripts, podman container has already stopped[0m [1;34m[testenv] Stopping testsuite (2401258)[0m Error: container has already been removed Error: container has already been removed Error: container has already been removed Error: container has already been removed Error: container has already been removed [0;94m[testenv] feed_watchdog_loop: podman container has stopped[0m [1;34m[testenv] Logs saved to:
https://jenkins.osmocom.org/jenkins/job/ttcn3-5gc-test-ogs/451/artifact/log…
[0m + RC=1 + [ 1 = 0 ] + + uptime grep --color=always -o load.* [01;31m[Kload average: 10.60, 5.14, 3.14[m[K + exit 1 Build step 'Execute shell' marked build as failure Recording test results [Checks API] No suitable checks publisher found.
1
0
0
0
Build failed in Jenkins: ttcn3-bts-test-asan #796
by jenkins@lists.osmocom.org
16 Aug '26
16 Aug '26
See <
https://jenkins.osmocom.org/jenkins/job/ttcn3-bts-test-asan/796/display/red…
> Changes: ------------------------------------------ [...truncated 12.38 MiB...] <testcase classname='BTS_Tests:hopping' name='TC_rll_unit_data_req_DCCH' time='2.381814'/> <testcase classname='BTS_Tests:hopping' name='TC_rll_unit_data_req_ACCH' time='5.329250'/> <testcase classname='BTS_Tests:hopping' name='TC_rll_unit_data_ind_DCCH' time='2.939964'/> <testcase classname='BTS_Tests:hopping' name='TC_rll_unit_data_ind_ACCH' time='10.561134'/> <testcase classname='BTS_Tests:hopping' name='TC_chan_act_a51' time='2.643469'/> <testcase classname='BTS_Tests:hopping' name='TC_chan_act_a52' time='2.739861'/> <testcase classname='BTS_Tests:hopping' name='TC_chan_act_a53' time='2.714965'/> <testcase classname='BTS_Tests:hopping' name='TC_chan_act_a54' time='2.703610'/> <testcase classname='BTS_Tests:hopping' name='TC_encr_cmd_a51' time='5.248636'/> <testcase classname='BTS_Tests:hopping' name='TC_encr_cmd_a52' time='5.227890'/> <testcase classname='BTS_Tests:hopping' name='TC_encr_cmd_a53' time='5.232318'/> <testcase classname='BTS_Tests:hopping' name='TC_encr_cmd_a54' time='5.221405'/> <testcase classname='BTS_Tests:hopping' name='TC_err_rep_wrong_mdisc' time='1.277533'/> <testcase classname='BTS_Tests:hopping' name='TC_err_rep_wrong_msg_type' time='1.330941'/> <testcase classname='BTS_Tests:hopping' name='TC_err_rep_wrong_sequence' time='1.270460'/> <testcase classname='BTS_Tests:hopping' name='TC_lapdm_selftest' time='0.006234'/> <testcase classname='BTS_Tests:hopping' name='TC_tch_sign_l2_fill_frame' time='18.446723'/> <testcase classname='BTS_Tests:hopping' name='TC_tch_sign_l2_fill_frame_dtxd' time='2.125059'> <failure type='fail-verdict'>Received DTX TCH fill frame with bad frame number: 175 (mod 104: 71) (mod 26: 19) BTS_Tests.ttcn:9579 BTS_Tests control part BTS_Tests.ttcn:8110 TC_tch_sign_l2_fill_frame_dtxd testcase </failure> </testcase> <testcase classname='BTS_Tests:hopping' name='TC_chopped_ipa_ping' time='24.701357'/> <testcase classname='BTS_Tests:hopping' name='TC_chopped_ipa_payload' time='42.640138'/> <testcase classname='BTS_Tests:hopping' name='TC_ms_pwr_ctrl_constant' time='16.447076'/> <testcase classname='BTS_Tests:hopping' name='TC_ms_pwr_ctrl_pf_ewma' time='32.020376'/> <testcase classname='BTS_Tests:hopping' name='TC_speech_no_rtp_tchf' time='7.374893'/> <testcase classname='BTS_Tests:hopping' name='TC_speech_no_rtp_tchh' time='5.508902'/> <testcase classname='BTS_Tests:hopping' name='TC_speech_rtp_tchf' time='7.680128'/> <testcase classname='BTS_Tests:hopping' name='TC_speech_rtp_tchh' time='5.547086'/> <testcase classname='BTS_Tests:hopping' name='TC_speech_osmux_tchf' time='3.383187'/> <testcase classname='BTS_Tests:hopping' name='TC_speech_osmux_tchh' time='3.460397'/> <testcase classname='BTS_Tests:hopping' name='TC_data_rtp_tchf144' time='2.105916'/> <testcase classname='BTS_Tests:hopping' name='TC_data_rtp_tchf96' time='2.215335'/> <testcase classname='BTS_Tests:hopping' name='TC_data_rtp_tchf48' time='2.186998'/> <testcase classname='BTS_Tests:hopping' name='TC_data_rtp_tchh48' time='5.334781'> <failure type='fail-verdict'>Timeout waiting for matching Downlink data frame BTS_Tests.ttcn:9597 BTS_Tests control part BTS_Tests.ttcn:8880 TC_data_rtp_tchh48 testcase </failure> </testcase> <testcase classname='BTS_Tests:hopping' name='TC_data_rtp_tchf24' time='1.760096'/> <testcase classname='BTS_Tests:hopping' name='TC_data_rtp_tchh24' time='5.323046'> <failure type='fail-verdict'>Timeout waiting for matching Downlink data frame BTS_Tests.ttcn:9599 BTS_Tests control part BTS_Tests.ttcn:8949 TC_data_rtp_tchh24 testcase </failure> </testcase> <testcase classname='BTS_Tests:hopping' name='TC_data_facch_tchf144' time='1.990995'/> <testcase classname='BTS_Tests:hopping' name='TC_data_facch_tchf96' time='2.044578'/> <testcase classname='BTS_Tests:hopping' name='TC_data_facch_tchf48' time='2.021017'/> <testcase classname='BTS_Tests:hopping' name='TC_data_facch_tchh48' time='2.117362'/> <testcase classname='BTS_Tests:hopping' name='TC_data_facch_tchf24' time='2.030002'/> <testcase classname='BTS_Tests:hopping' name='TC_data_facch_tchh24' time='2.158354'/> <testcase classname='BTS_Tests:hopping' name='TC_early_immediate_assignment' time='3.551534'/> <testcase classname='BTS_Tests:hopping' name='TC_acch_overpower_rxqual_thresh' time='9.085089'> <failure type='fail-verdict'>Timeout waiting for L1CTL DATA.ind BTS_Tests.ttcn:9610 BTS_Tests control part BTS_Tests.ttcn:9244 TC_acch_overpower_rxqual_thresh testcase </failure> </testcase> <testcase classname='BTS_Tests:hopping' name='TC_acch_overpower_rxqual_thresh_dtx' time='9.030386'> <failure type='fail-verdict'>Timeout waiting for L1CTL DATA.ind BTS_Tests.ttcn:9611 BTS_Tests control part BTS_Tests.ttcn:9285 TC_acch_overpower_rxqual_thresh_dtx testcase </failure> </testcase> <testcase classname='BTS_Tests:hopping' name='TC_acch_overpower_always_on_facch' time='9.056659'> <failure type='fail-verdict'>Timeout waiting for L1CTL DATA.ind BTS_Tests.ttcn:9612 BTS_Tests control part BTS_Tests.ttcn:9317 TC_acch_overpower_always_on_facch testcase </failure> </testcase> <testcase classname='BTS_Tests:hopping' name='TC_acch_overpower_always_on_sacch' time='9.060111'> <failure type='fail-verdict'>Timeout waiting for L1CTL DATA.ind BTS_Tests.ttcn:9613 BTS_Tests control part BTS_Tests.ttcn:9349 TC_acch_overpower_always_on_sacch testcase </failure> </testcase> <testcase classname='BTS_Tests:hopping' name='TC_acch_overpower_limit' time='9.039848'> <failure type='fail-verdict'>Timeout waiting for L1CTL DATA.ind BTS_Tests.ttcn:9614 BTS_Tests control part BTS_Tests.ttcn:9380 TC_acch_overpower_limit testcase </failure> </testcase> <testcase classname='BTS_Tests_SMSCB:hopping' name='TC_cbch_load_idle_no_cbch' time='11.176070'/> <testcase classname='BTS_Tests_SMSCB:hopping' name='TC_sms_cb_cmd_sdcch4_1block' time='14.265115'/> <testcase classname='BTS_Tests_SMSCB:hopping' name='TC_sms_cb_cmd_sdcch4_2block' time='14.230663'/> <testcase classname='BTS_Tests_SMSCB:hopping' name='TC_sms_cb_cmd_sdcch4_3block' time='14.273863'/> <testcase classname='BTS_Tests_SMSCB:hopping' name='TC_sms_cb_cmd_sdcch4_4block' time='14.183646'/> <testcase classname='BTS_Tests_SMSCB:hopping' name='TC_sms_cb_cmd_sdcch4_multi' time='20.215590'/> <testcase classname='BTS_Tests_SMSCB:hopping' name='TC_sms_cb_cmd_sdcch4_schedule' time='14.203202'/> <testcase classname='BTS_Tests_SMSCB:hopping' name='TC_sms_cb_cmd_sdcch4_default_only' time='16.246885'/> <testcase classname='BTS_Tests_SMSCB:hopping' name='TC_sms_cb_cmd_sdcch4_default_and_normal' time='17.251815'/> <testcase classname='BTS_Tests_SMSCB:hopping' name='TC_sms_cb_cmd_sdcch4_default_then_null' time='26.274261'/> <testcase classname='BTS_Tests_SMSCB:hopping' name='TC_cbc_sdcch4_load_idle' time='16.109719'/> <testcase classname='BTS_Tests_SMSCB:hopping' name='TC_cbc_sdcch4_load_overload' time='18.247552'/> <testcase classname='BTS_Tests_SMSCB:hopping' name='TC_sms_cb_cmd_sdcch8_1block' time='14.235542'/> <testcase classname='BTS_Tests_SMSCB:hopping' name='TC_sms_cb_cmd_sdcch8_2block' time='14.218024'/> <testcase classname='BTS_Tests_SMSCB:hopping' name='TC_sms_cb_cmd_sdcch8_3block' time='14.234076'/> <testcase classname='BTS_Tests_SMSCB:hopping' name='TC_sms_cb_cmd_sdcch8_4block' time='14.234352'/> <testcase classname='BTS_Tests_SMSCB:hopping' name='TC_sms_cb_cmd_sdcch8_multi' time='20.256354'/> <testcase classname='BTS_Tests_SMSCB:hopping' name='TC_sms_cb_cmd_sdcch8_schedule' time='14.181582'/> <testcase classname='BTS_Tests_SMSCB:hopping' name='TC_sms_cb_cmd_sdcch8_default_only' time='16.242321'/> <testcase classname='BTS_Tests_SMSCB:hopping' name='TC_sms_cb_cmd_sdcch8_default_and_normal' time='17.214197'/> <testcase classname='BTS_Tests_SMSCB:hopping' name='TC_cbc_sdcch8_load_idle' time='16.186880'/> <testcase classname='BTS_Tests_SMSCB:hopping' name='TC_cbc_sdcch8_load_overload' time='18.223470'/> <testcase classname='BTS_Tests_SMSCB:hopping' name='TC_etws_p1ro' time='12.193289'/> <testcase classname='BTS_Tests_SMSCB:hopping' name='TC_etws_p1ro_end' time='16.147135'/> <testcase classname='BTS_Tests_SMSCB:hopping' name='TC_etws_pcu' time='1.139215'/> <testcase classname='BTS_Tests_LAPDm:hopping' name='TC_sabm_ua_dcch_sapi0' time='2.908530'/> <testcase classname='BTS_Tests_LAPDm:hopping' name='TC_sabm_ua_dcch_sapi0_nopayload' time='21.576356'/> <testcase classname='BTS_Tests_LAPDm:hopping' name='TC_sabm_ua_dcch_sapi3' time='21.383238'/> <testcase classname='BTS_Tests_LAPDm:hopping' name='TC_sabm_ua_dcch_sapi4' time='21.330949'/> <testcase classname='BTS_Tests_LAPDm:hopping' name='TC_sabm_contention' time='21.351429'/> <testcase classname='BTS_Tests_LAPDm:hopping' name='TC_sabm_retransmit' time='3.187551'/> <testcase classname='BTS_Tests_LAPDm:hopping' name='TC_sabm_retransmit_bts' time='81.488013'> <failure type='fail-verdict'>Incorrect number of SABM re-transmissions of observed: 5 BTS_Tests_LAPDm.ttcn:1480 BTS_Tests_LAPDm control part BTS_Tests_LAPDm.ttcn:315 TC_sabm_retransmit_bts testcase </failure> </testcase> <testcase classname='BTS_Tests_LAPDm:hopping' name='TC_sabm_invalid_resp' time='23.396202'/> <testcase classname='BTS_Tests_LAPDm:hopping' name='TC_sabm_dm' time='14.060604'/> <testcase classname='BTS_Tests_LAPDm:hopping' name='TC_establish_ign_first_sabm' time='8.221280'/> <testcase classname='BTS_Tests_LAPDm:hopping' name='TC_iframe_seq_and_ack' time='29.619852'> <failure type='fail-verdict'>Received RSL ERROR IND { msg_disc := { msg_group := RSL_MDISC_RLL (1), transparent := false }, msg_type := RSL_MT_ERROR_IND (3), ies := { { iei := RSL_IE_CHAN_NR (1), body := { chan_nr := { u := { sdcch8 := { tag := '01'B, sub_chan := 4 } }, tn := 6 } } }, { iei := RSL_IE_LINK_IDENT (2), body := { link_id := { c := FACCH_SDCCH (0), na := false, prio := SAPI0_PRIO_NORMAL (0), sapi := 0 } } }, { iei := RSL_IE_RLM_CAUSE (22), body := { rlm_cause := { len := 1, payload := '01'O } } } } } BTS_Tests_LAPDm.ttcn:1484 BTS_Tests_LAPDm control part BTS_Tests_LAPDm.ttcn:579 TC_iframe_seq_and_ack testcase </failure> </testcase> <testcase classname='BTS_Tests_LAPDm:hopping' name='TC_iframe_timer_recovery' time='24.640058'> <failure type='fail-verdict'>Received RSL ERROR IND { msg_disc := { msg_group := RSL_MDISC_RLL (1), transparent := false }, msg_type := RSL_MT_ERROR_IND (3), ies := { { iei := RSL_IE_CHAN_NR (1), body := { chan_nr := { u := { sdcch8 := { tag := '01'B, sub_chan := 4 } }, tn := 6 } } }, { iei := RSL_IE_LINK_IDENT (2), body := { link_id := { c := FACCH_SDCCH (0), na := false, prio := SAPI0_PRIO_NORMAL (0), sapi := 0 } } }, { iei := RSL_IE_RLM_CAUSE (22), body := { rlm_cause := { len := 1, payload := '01'O } } } } } BTS_Tests_LAPDm.ttcn:1485 BTS_Tests_LAPDm control part BTS_Tests_LAPDm.ttcn:685 TC_iframe_timer_recovery testcase </failure> </testcase> <testcase classname='BTS_Tests_LAPDm:hopping' name='TC_ns_seq_error' time='29.623889'> <failure type='fail-verdict'>"BTS_Tests.ttcn:732 : Tguard timeout" BTS_Tests_LAPDm.ttcn:1486 BTS_Tests_LAPDm control part BTS_Tests_LAPDm.ttcn:768 TC_ns_seq_error testcase </failure> </testcase> <testcase classname='BTS_Tests_LAPDm:hopping' name='TC_nr_seq_error' time='2.893219'/> <testcase classname='BTS_Tests_LAPDm:hopping' name='TC_rec_invalid_frame' time='119.183363'> <failure type='fail-verdict'>"BTS_Tests_LAPDm.ttcn:909 : Missing LAPDm_RR RSP" BTS_Tests_LAPDm.ttcn:1488 BTS_Tests_LAPDm control part BTS_Tests_LAPDm.ttcn:961 TC_rec_invalid_frame testcase </failure> </testcase> <testcase classname='BTS_Tests_LAPDm:hopping' name='TC_segm_concat_dcch' time='13.531562'> <failure type='fail-verdict'>"BTS_Tests_LAPDm.ttcn:1023 : received unexpected LAPDm { sacch := false, sapi := 0, lapdm := { ab := { addr := { spare := '0'B, lpd := 0, sapi := 0, c_r := false, ea := true }, ctrl := { s := { n_r := 1, p_f := false, s := '10'B, spare := '01'B } }, len := 0, m := false, el := 1, payload := ''O, padding := '2B2B2B2B2B2B2B2B2B2B2B2B2B2B2B2B2B2B2B2B'O (\"++++++++++++++++++++\") } } }" BTS_Tests_LAPDm.ttcn:1489 BTS_Tests_LAPDm control part BTS_Tests_LAPDm.ttcn:1088 TC_segm_concat_dcch testcase </failure> </testcase> <testcase classname='BTS_Tests_LAPDm:hopping' name='TC_segm_concat_sacch' time='48.536580'> <failure type='fail-verdict'>"BTS_Tests_LAPDm.ttcn:1023 : received unexpected LAPDm { sacch := true, sapi := 0, lapdm := { ab := { addr := { spare := '0'B, lpd := 0, sapi := 0, c_r := false, ea := true }, ctrl := { u := { u := '011'B, p_f := true, u2 := '00'B, spare := '11'B } }, len := 0, m := false, el := 1, payload := ''O, padding := '2B2B2B2B2B2B2B2B2B2B2B2B2B2B2B2B2B2B'O (\"++++++++++++++++++\") } } }" BTS_Tests_LAPDm.ttcn:1490 BTS_Tests_LAPDm control part BTS_Tests_LAPDm.ttcn:1093 TC_segm_concat_sacch testcase </failure> </testcase> <testcase classname='BTS_Tests_LAPDm:hopping' name='TC_t200_n200' time='39.848680'> <failure type='fail-verdict'>Missing RSL RLL ERROR INDICATION BTS_Tests_LAPDm.ttcn:1491 BTS_Tests_LAPDm control part BTS_Tests_LAPDm.ttcn:1182 TC_t200_n200 testcase </failure> </testcase> <testcase classname='BTS_Tests_LAPDm:hopping' name='TC_rr_response_frame_loss' time='6.709804'> <failure type='fail-verdict'>Timeout waiting for RR or REJ BTS_Tests_LAPDm.ttcn:1492 BTS_Tests_LAPDm control part BTS_Tests_LAPDm.ttcn:1239 TC_rr_response_frame_loss testcase </failure> </testcase> <testcase classname='BTS_Tests_LAPDm:hopping' name='TC_incorrect_cr' time='15.799061'/> <testcase classname='BTS_Tests_LAPDm:hopping' name='TC_sabm_incorrect_c' time='23.324033'> <failure type='fail-verdict'>"BTS_Tests.ttcn:732 : Tguard timeout" BTS_Tests_LAPDm.ttcn:1494 BTS_Tests_LAPDm control part BTS_Tests_LAPDm.ttcn:1341 TC_sabm_incorrect_c testcase </failure> </testcase> <testcase classname='BTS_Tests_LAPDm:hopping' name='TC_normal_reestablishment' time='16.109289'> <failure type='fail-verdict'>"BTS_Tests_LAPDm.ttcn:1023 : received unexpected LAPDm { sacch := false, sapi := 0, lapdm := { ab := { addr := { spare := '0'B, lpd := 0, sapi := 0, c_r := false, ea := true }, ctrl := { u := { u := '011'B, p_f := true, u2 := '00'B, spare := '11'B } }, len := 5, m := false, el := 1, payload := '75FA00B3F5'O, padding := '2B2B2B2B2B2B2B2B2B2B2B2B2B2B2B'O (\"+++++++++++++++\") } } }" BTS_Tests_LAPDm.ttcn:1495 BTS_Tests_LAPDm control part BTS_Tests_LAPDm.ttcn:1403 TC_normal_reestablishment testcase </failure> </testcase> <testcase classname='BTS_Tests_LAPDm:hopping' name='TC_normal_reestablishment_state_unacked' time='12.374104'> <failure type='fail-verdict'>"BTS_Tests_LAPDm.ttcn:1023 : received unexpected LAPDm { sacch := false, sapi := 0, lapdm := { ab := { addr := { spare := '0'B, lpd := 0, sapi := 0, c_r := false, ea := true }, ctrl := { s := { n_r := 1, p_f := false, s := '10'B, spare := '01'B } }, len := 0, m := false, el := 1, payload := ''O, padding := '2B2B2B2B2B2B2B2B2B2B2B2B2B2B2B2B2B2B2B2B'O (\"++++++++++++++++++++\") } } }" BTS_Tests_LAPDm.ttcn:1496 BTS_Tests_LAPDm control part BTS_Tests_LAPDm.ttcn:1470 TC_normal_reestablishment_state_unacked testcase </failure> </testcase> <testcase classname='BTS_Tests_VAMOS:hopping' name='TC_vamos_chan_act_vff' time='2.433712'/> <testcase classname='BTS_Tests_VAMOS:hopping' name='TC_vamos_chan_act_vhh' time='2.572124'/> <testcase classname='BTS_Tests_VAMOS:hopping' name='TC_vamos_chan_act_hvhh' time='2.564248'/> <testcase classname='BTS_Tests_VAMOS:hopping' name='TC_vamos_chan_act_dyn_ipa_vff' time='2.573044'/> <testcase classname='BTS_Tests_VAMOS:hopping' name='TC_vamos_chan_act_dyn_osmo_vff' time='2.561457'/> <testcase classname='BTS_Tests_VAMOS:hopping' name='TC_vamos_chan_act_dyn_osmo_vhh' time='2.584368'/> <testcase classname='BTS_Tests_VAMOS:hopping' name='TC_vamos_chan_act_dyn_osmo_hvhh' time='2.565198'/> <testcase classname='BTS_Tests_VAMOS:hopping' name='TC_vamos_chan_mode_modify_vff' time='1.346592'/> <testcase classname='BTS_Tests_VAMOS:hopping' name='TC_vamos_chan_mode_modify_vhh' time='1.358235'/> <testcase classname='BTS_Tests_VAMOS:hopping' name='TC_vamos_chan_mode_modify_hvhh' time='1.352611'/> <testcase classname='BTS_Tests_VAMOS:hopping' name='TC_vamos_chan_mode_modify_dyn_ipa_vff' time='1.340443'/> <testcase classname='BTS_Tests_VAMOS:hopping' name='TC_vamos_chan_mode_modify_dyn_osmo_vff' time='1.337570'/> <testcase classname='BTS_Tests_VAMOS:hopping' name='TC_vamos_chan_mode_modify_dyn_osmo_vhh' time='1.367821'/> <testcase classname='BTS_Tests_VAMOS:hopping' name='TC_vamos_chan_mode_modify_dyn_osmo_hvhh' time='1.348788'/> <testcase classname='BTS_Tests_ASCI:hopping' name='TC_vbs_notification' time='4.710199'/> <testcase classname='BTS_Tests_ASCI:hopping' name='TC_vgcs_uplink_free_and_busy' time='1.849958'/> <testcase classname='BTS_Tests_ASCI:hopping' name='TC_vgcs_talker_fail' time='17.086105'/> <testcase classname='BTS_Tests_ASCI:hopping' name='TC_vgcs_talker_est_rel' time='1.382953'/> <testcase classname='BTS_Tests_ASCI:hopping' name='TC_vgcs_listener_det' time='3.326984'/> </testsuite> <?xml version="1.0"?> <testsuite name='Titan' tests='17' failures='0' errors='0' skipped='0' inconc='0' time='95.00'> <testcase classname='BTS_Tests_OML' name='TC_wrong_mdisc' time='10.622933'/> <testcase classname='BTS_Tests_OML' name='TC_wrong_msgtype' time='0.668110'/> <testcase classname='BTS_Tests_OML' name='TC_short_length' time='0.678599'/> <testcase classname='BTS_Tests_OML' name='TC_long_length' time='0.687941'/> <testcase classname='BTS_Tests_OML' name='TC_wrong_placement' time='0.701581'/> <testcase classname='BTS_Tests_OML' name='TC_wrong_seq' time='0.669852'/> <testcase classname='BTS_Tests_OML' name='TC_wrong_obj_class' time='0.717789'/> <testcase classname='BTS_Tests_OML' name='TC_wrong_bts_nr' time='0.679019'/> <testcase classname='BTS_Tests_OML' name='TC_wrong_trx_nr' time='0.693785'/> <testcase classname='BTS_Tests_OML' name='TC_radio_carrier_opstart_noattr' time='0.699093'/> <testcase classname='BTS_Tests_OML' name='TC_bts_opstart' time='0.707467'/> <testcase classname='BTS_Tests_OML' name='TC_bts_opstart_noattr' time='0.696279'/> <testcase classname='BTS_Tests_OML' name='TC_ts_opstart' time='0.691380'/> <testcase classname='BTS_Tests_OML' name='TC_ts_opstart_noattr' time='0.684511'/> <testcase classname='BTS_Tests_OML' name='TC_initial_state_reports' time='0.676414'/> <testcase classname='BTS_Tests_OML' name='TC_ipa_osmo_pcu_anr_fwd' time='0.705760'/> <testcase classname='BTS_Tests_OML' name='TC_ipa_rsl_connect_nack' time='0.663497'/> </testsuite> + check_respawn_count + set +x [0;31m ================================================================ WARNING: osmo-bts was respawned 5 times (expected: 3)! (OS#6794) ================================================================ [0m+ RC=1 + uptime + grep --color=always -o load.* [01;31m[Kload average: 0.48, 0.53, 0.61[m[K + exit 1 Build step 'Execute shell' marked build as failure Recording test results [Checks API] No suitable checks publisher found.
1
0
0
0
Jenkins build became unstable: ttcn3-epdg-test-latest #776
by jenkins@lists.osmocom.org
15 Aug '26
15 Aug '26
See <
https://jenkins.osmocom.org/jenkins/job/ttcn3-epdg-test-latest/776/display/…
>
1
1
0
0
Build failed in Jenkins: ttcn3-pcrf-test-ogs-latest #274
by jenkins@lists.osmocom.org
15 Aug '26
15 Aug '26
See <
https://jenkins.osmocom.org/jenkins/job/ttcn3-pcrf-test-ogs-latest/274/disp…
> Changes: [pmaier(a)sysmocom.de] SGP32Definitions_Templates: fix tr/ts_getBoundProfilePackageRequestEsipa [pmaier(a)sysmocom.de] smdpp: update SGP.26 DPtls certificate [Oliver Smith] deps/Makefile: eclipse gitlab -> osmocom mirror ------------------------------------------ [...truncated 40.22 KiB...] CCLD IPL4asp_Functions_part_7.so CCLD IPL4asp_PortType_part_2.so CCLD IPL4asp_PortType_part_1.so CCLD IPL4asp_PortType_part_3.so CCLD IPL4asp_PortType_part_4.so CCLD IPL4asp_PortType_part_5.so CCLD IPL4asp_PortType_part_6.so CCLD IPL4asp_PortType_part_7.so CCLD IPL4asp_Types_part_1.so CCLD IPL4asp_Types_part_2.so CCLD IPL4asp_Types_part_3.so CCLD IPL4asp_Types_part_5.so CCLD IPL4asp_Types_part_4.so CCLD IPL4asp_Types_part_6.so CCLD Misc_Helpers_part_1.so CCLD IPL4asp_Types_part_7.so CCLD Misc_Helpers_part_2.so CCLD Misc_Helpers_part_3.so CCLD Misc_Helpers_part_4.so CCLD Misc_Helpers_part_5.so CCLD Misc_Helpers_part_6.so CCLD Misc_Helpers_part_7.so CCLD Native_Functions_part_1.so CCLD Native_Functions_part_2.so CCLD Native_Functions_part_4.so CCLD Native_Functions_part_3.so CCLD Native_Functions_part_5.so CCLD Native_Functions_part_6.so CCLD Native_Functions_part_7.so CCLD Osmocom_Types_part_1.so CCLD Osmocom_Types_part_2.so CCLD Osmocom_Types_part_3.so CCLD Osmocom_Types_part_4.so CCLD Osmocom_Types_part_5.so CCLD Osmocom_Types_part_6.so CCLD Osmocom_Types_part_7.so CCLD PCRF_Tests_part_1.so CCLD PCRF_Tests_part_2.so CCLD PCRF_Tests_part_3.so CCLD PCRF_Tests_part_4.so CCLD PCRF_Tests_part_5.so CCLD PCRF_Tests_part_6.so CCLD PCRF_Tests_part_7.so CCLD Prometheus_Checker_part_1.so CCLD Prometheus_Checker_part_2.so CCLD Prometheus_Checker_part_3.so CCLD Prometheus_Checker_part_4.so CCLD Prometheus_Checker_part_5.so CCLD Prometheus_Checker_part_6.so CCLD Prometheus_Checker_part_7.so CCLD SCTP_Templates_part_1.so CCLD SCTP_Templates_part_2.so CCLD SCTP_Templates_part_4.so CCLD SCTP_Templates_part_3.so CCLD SCTP_Templates_part_5.so CCLD SCTP_Templates_part_6.so CCLD SCTP_Templates_part_7.so CCLD Socket_API_Definitions_part_1.so CCLD Socket_API_Definitions_part_2.so CCLD Socket_API_Definitions_part_3.so CCLD Socket_API_Definitions_part_4.so CCLD Socket_API_Definitions_part_6.so CCLD Socket_API_Definitions_part_7.so CCLD Socket_API_Definitions_part_5.so CCLD TCCConversion_Functions_part_1.so CCLD TCCConversion_Functions_part_2.so CCLD TCCConversion_Functions_part_3.so CCLD TCCConversion_Functions_part_4.so CCLD TCCConversion_Functions_part_5.so CCLD TCCConversion_Functions_part_6.so CCLD TCCConversion_Functions_part_7.so CCLD TCCEncoding_Functions_part_1.so CCLD TCCEncoding_Functions_part_2.so CCLD TCCEncoding_Functions_part_3.so CCLD TCCEncoding_Functions_part_4.so CCLD TCCEncoding_Functions_part_5.so CCLD TCCEncoding_Functions_part_6.so CCLD TCCEncoding_Functions_part_7.so CCLD TCCInterface_Functions_part_1.so CCLD TCCInterface_Functions_part_2.so CCLD TCCInterface_Functions_part_3.so CCLD TCCInterface_Functions_part_4.so CCLD TCCInterface_Functions_part_5.so CCLD TCCInterface_Functions_part_7.so CCLD TCCInterface_Functions_part_6.so CCLD Abstract_Socket.so CCLD DIAMETER_CodecPort_CtrlFunctDef.so CCLD DIAMETER_EncDec.so CCLD HTTPmsg_MessageLen_Function.so CCLD HTTPmsg_PT.so CCLD IPL4asp_PT.so CCLD IPL4asp_discovery.so CCLD Native_FunctionDefs.so CCLD TCCConversion.so CCLD TCCEncoding.so CCLD TCCInterface.so CCLD PCRF_Tests make[1]: Leaving directory '<
https://jenkins.osmocom.org/jenkins/job/ttcn3-pcrf-test-ogs-latest/ws/_cach…
'> [1;34m[testenv] Stopping podman container (restart)[0m [0;94m[testenv] + ['podman', 'kill', 'testenv-pcrf-osmocom-latest-20260814-1354-223df3fb-0'][0m testenv-pcrf-osmocom-latest-20260814-1354-223df3fb-0 [0;94m[testenv] + ['podman', 'run', '--rm', '--name', 'testenv-pcrf-osmocom-latest-20260814-1354-223df3fb-1', '--log-driver', 'json-file', '--log-opt', 'path=<
https://jenkins.osmocom.org/jenkins/job/ttcn3-pcrf-test-ogs-latest/274/arti…
',> '--security-opt=seccomp=<
https://jenkins.osmocom.org/jenkins/job/ttcn3-pcrf-test-ogs-latest/ws/_test…
',> '--cap-add=NET_ADMIN', '--cap-add=NET_RAW', '--cap-add=SYS_ADMIN', '--device=/dev/net/tun', '--volume', '<
https://jenkins.osmocom.org/jenkins/job/ttcn3-pcrf-test-ogs-latest/ws/_cach…
>:/var/cache/apt', '--volume', '<
https://jenkins.osmocom.org/jenkins/job/ttcn3-pcrf-test-ogs-latest/ws/_cach…
>:/var/lib/apt', '--sysctl', 'net.ipv4.conf.all.send_redirects=0', '--sysctl', 'net.ipv4.conf.default.send_redirects=0', '-e', 'PODMAN=1', '-e', 'HOST_USER=osmocom-build', '-e', 'TESTENV_BINARY_REPO=1', '--volume', '<
https://jenkins.osmocom.org/jenkins/job/ttcn3-pcrf-test-ogs-latest/ws/logs
>:<
https://jenkins.osmocom.org/jenkins/job/ttcn3-pcrf-test-ogs-latest/ws/logs
',> '--volume', '<
https://jenkins.osmocom.org/jenkins/job/ttcn3-pcrf-test-ogs-latest/ws/_cache
>:<
https://jenkins.osmocom.org/jenkins/job/ttcn3-pcrf-test-ogs-latest/ws/_cache
',> '--volume', '/home/osmocom-build/ccache/testenv:/home/osmocom-build/ccache/testenv', '--volume', '/home/osmocom-build/jenkins/workspace:/home/osmocom-build/jenkins/workspace', 'debian-trixie-osmo-ttcn3-testenv', '<
https://jenkins.osmocom.org/jenkins/job/ttcn3-pcrf-test-ogs-latest/ws/_test…
'][0m> Running testenv-podman-main.sh [0;94m[testenv] + ['podman', 'exec', '-e', 'CCACHE_DIR=/home/osmocom-build/ccache/testenv', '-e', 'TESTENV_CACHE_DIR=<
https://jenkins.osmocom.org/jenkins/job/ttcn3-pcrf-test-ogs-latest/ws/_cache
',> '-e', 'TESTENV_SRC_DIR=/home/osmocom-build/jenkins/workspace', '-e', 'TESTENV_INSTALL_DIR=/', '-e', 'TERM=dumb', '-e', 'PATH=<
https://jenkins.osmocom.org/jenkins/job/ttcn3-pcrf-test-ogs-latest/ws/_test…
>:<
https://jenkins.osmocom.org/jenkins/job/ttcn3-pcrf-test-ogs-latest/ws/_test…
>:<
https://jenkins.osmocom.org/jenkins/job/ttcn3-pcrf-test-ogs-latest/ws/pcrf
>:/usr/local/bin:/usr/sbin:/usr/bin:/sbin:/bin', '-e', 'HOME=/home/osmocom-build', '-e', 'PYTHONUNBUFFERED=1', '-t', 'testenv-pcrf-osmocom-latest-20260814-1354-223df3fb-1', 'rm', '/etc/apt/apt.conf.d/docker-clean'][0m [0;94m[testenv] + ['podman', 'exec', '-e', 'CCACHE_DIR=/home/osmocom-build/ccache/testenv', '-e', 'TESTENV_CACHE_DIR=<
https://jenkins.osmocom.org/jenkins/job/ttcn3-pcrf-test-ogs-latest/ws/_cache
',> '-e', 'TESTENV_SRC_DIR=/home/osmocom-build/jenkins/workspace', '-e', 'TESTENV_INSTALL_DIR=/', '-e', 'TERM=dumb', '-e', 'PATH=<
https://jenkins.osmocom.org/jenkins/job/ttcn3-pcrf-test-ogs-latest/ws/_test…
>:<
https://jenkins.osmocom.org/jenkins/job/ttcn3-pcrf-test-ogs-latest/ws/_test…
>:<
https://jenkins.osmocom.org/jenkins/job/ttcn3-pcrf-test-ogs-latest/ws/pcrf
>:/usr/local/bin:/usr/sbin:/usr/bin:/sbin:/bin', '-e', 'HOME=/home/osmocom-build', '-e', 'PYTHONUNBUFFERED=1', '-t', 'testenv-pcrf-osmocom-latest-20260814-1354-223df3fb-1', 'sh', '-c', "echo 'deb [signed-by=/obs.key]
https://downloads.osmocom.org/packages/osmocom:/latest/Debian_13/
./' > /etc/apt/sources.list.d/osmocom.list"][0m [0;94m[testenv] + ['podman', 'exec', '-e', 'CCACHE_DIR=/home/osmocom-build/ccache/testenv', '-e', 'TESTENV_CACHE_DIR=<
https://jenkins.osmocom.org/jenkins/job/ttcn3-pcrf-test-ogs-latest/ws/_cache
',> '-e', 'TESTENV_SRC_DIR=/home/osmocom-build/jenkins/workspace', '-e', 'TESTENV_INSTALL_DIR=/', '-e', 'TERM=dumb', '-e', 'PATH=<
https://jenkins.osmocom.org/jenkins/job/ttcn3-pcrf-test-ogs-latest/ws/_test…
>:<
https://jenkins.osmocom.org/jenkins/job/ttcn3-pcrf-test-ogs-latest/ws/_test…
>:<
https://jenkins.osmocom.org/jenkins/job/ttcn3-pcrf-test-ogs-latest/ws/pcrf
>:/usr/local/bin:/usr/sbin:/usr/bin:/sbin:/bin', '-e', 'HOME=/home/osmocom-build', '-e', 'PYTHONUNBUFFERED=1', '-t', 'testenv-pcrf-osmocom-latest-20260814-1354-223df3fb-1', 'sh', '-c', 'echo \'Package: *\nPin: origin "
downloads.osmocom.org
"\nPin-Priority: 1100\n\' > /etc/apt/preferences.d/osmocom-apt-pin'][0m [0;94m[testenv] feed_watchdog_loop: podman container has stopped[0m [0;94m[testenv] + ['podman', 'exec', '-e', 'CCACHE_DIR=/home/osmocom-build/ccache/testenv', '-e', 'TESTENV_CACHE_DIR=<
https://jenkins.osmocom.org/jenkins/job/ttcn3-pcrf-test-ogs-latest/ws/_cache
',> '-e', 'TESTENV_SRC_DIR=/home/osmocom-build/jenkins/workspace', '-e', 'TESTENV_INSTALL_DIR=/', '-e', 'TERM=dumb', '-e', 'PATH=<
https://jenkins.osmocom.org/jenkins/job/ttcn3-pcrf-test-ogs-latest/ws/_test…
>:<
https://jenkins.osmocom.org/jenkins/job/ttcn3-pcrf-test-ogs-latest/ws/_test…
>:<
https://jenkins.osmocom.org/jenkins/job/ttcn3-pcrf-test-ogs-latest/ws/pcrf
>:/usr/local/bin:/usr/sbin:/usr/bin:/sbin:/bin', '-e', 'HOME=/home/osmocom-build', '-e', 'PYTHONUNBUFFERED=1', '-t', 'testenv-pcrf-osmocom-latest-20260814-1354-223df3fb-1', 'apt-get', '-q', 'update'][0m Hit:1
http://deb.debian.org/debian
trixie InRelease Hit:2
http://deb.debian.org/debian
trixie-updates InRelease Hit:3
http://deb.debian.org/debian-security
trixie-security InRelease Get:4
https://downloads.osmocom.org/packages/osmocom:/latest/Debian_13
./ InRelease [1621 B] Get:5
https://downloads.osmocom.org/packages/osmocom:/latest/Debian_13
./ Packages [198 kB] Fetched 200 kB in 0s (422 kB/s) Reading package lists... [0;94m[testenv] + ['podman', 'exec', '-e', 'CCACHE_DIR=/home/osmocom-build/ccache/testenv', '-e', 'TESTENV_CACHE_DIR=<
https://jenkins.osmocom.org/jenkins/job/ttcn3-pcrf-test-ogs-latest/ws/_cache
',> '-e', 'TESTENV_SRC_DIR=/home/osmocom-build/jenkins/workspace', '-e', 'TESTENV_INSTALL_DIR=/', '-e', 'TERM=dumb', '-e', 'PATH=<
https://jenkins.osmocom.org/jenkins/job/ttcn3-pcrf-test-ogs-latest/ws/_test…
>:<
https://jenkins.osmocom.org/jenkins/job/ttcn3-pcrf-test-ogs-latest/ws/_test…
>:<
https://jenkins.osmocom.org/jenkins/job/ttcn3-pcrf-test-ogs-latest/ws/pcrf
>:/usr/local/bin:/usr/sbin:/usr/bin:/sbin:/bin', '-e', 'HOME=/home/osmocom-build', '-e', 'PYTHONUNBUFFERED=1', '-t', 'testenv-pcrf-osmocom-latest-20260814-1354-223df3fb-1', 'sh', '-c', 'apt-cache pkgnames | grep -- -dbg > <
https://jenkins.osmocom.org/jenkins/job/ttcn3-pcrf-test-ogs-latest/ws/_cach…
'][0m> [0;94m[testenv] + ['podman', 'exec', '-e', 'CCACHE_DIR=/home/osmocom-build/ccache/testenv', '-e', 'TESTENV_CACHE_DIR=<
https://jenkins.osmocom.org/jenkins/job/ttcn3-pcrf-test-ogs-latest/ws/_cache
',> '-e', 'TESTENV_SRC_DIR=/home/osmocom-build/jenkins/workspace', '-e', 'TESTENV_INSTALL_DIR=/', '-e', 'TERM=dumb', '-e', 'PATH=<
https://jenkins.osmocom.org/jenkins/job/ttcn3-pcrf-test-ogs-latest/ws/_test…
>:<
https://jenkins.osmocom.org/jenkins/job/ttcn3-pcrf-test-ogs-latest/ws/_test…
>:<
https://jenkins.osmocom.org/jenkins/job/ttcn3-pcrf-test-ogs-latest/ws/pcrf
>:/usr/local/bin:/usr/sbin:/usr/bin:/sbin:/bin', '-e', 'HOME=/home/osmocom-build', '-e', 'PYTHONUNBUFFERED=1', '-t', 'testenv-pcrf-osmocom-latest-20260814-1354-223df3fb-1', 'apt-rdepends', 'open5gs-pcrf'][0m [0;94m[testenv] open5gs-pcrf -> open5gs-pcrf: installing open5gs-pcrf-dbgsym[0m [0;94m[testenv] open5gs-pcrf -> libc6: installing libc6-dbg[0m [0;94m[testenv] open5gs-pcrf -> open5gs-common: installing open5gs-common-dbgsym[0m [1;34m[testenv] Installing packages: open5gs-pcrf, open5gs-pcrf-dbgsym, libc6-dbg, open5gs-common-dbgsym[0m [0;94m[testenv] + ['podman', 'exec', '-e', 'CCACHE_DIR=/home/osmocom-build/ccache/testenv', '-e', 'TESTENV_CACHE_DIR=<
https://jenkins.osmocom.org/jenkins/job/ttcn3-pcrf-test-ogs-latest/ws/_cache
',> '-e', 'TESTENV_SRC_DIR=/home/osmocom-build/jenkins/workspace', '-e', 'TESTENV_INSTALL_DIR=/', '-e', 'TERM=dumb', '-e', 'PATH=<
https://jenkins.osmocom.org/jenkins/job/ttcn3-pcrf-test-ogs-latest/ws/_test…
>:<
https://jenkins.osmocom.org/jenkins/job/ttcn3-pcrf-test-ogs-latest/ws/_test…
>:<
https://jenkins.osmocom.org/jenkins/job/ttcn3-pcrf-test-ogs-latest/ws/pcrf
>:/usr/local/bin:/usr/sbin:/usr/bin:/sbin:/bin', '-e', 'HOME=/home/osmocom-build', '-e', 'PYTHONUNBUFFERED=1', '-t', 'testenv-pcrf-osmocom-latest-20260814-1354-223df3fb-1', 'apt-get', '-q', 'install', '-y', '--no-install-recommends', 'open5gs-pcrf', 'open5gs-pcrf-dbgsym', 'libc6-dbg', 'open5gs-common-dbgsym'][0m Reading package lists... Building dependency tree... The following additional packages will be installed: open5gs-common The following NEW packages will be installed: libc6-dbg open5gs-common open5gs-common-dbgsym open5gs-pcrf open5gs-pcrf-dbgsym 0 upgraded, 5 newly installed, 0 to remove and 23 not upgraded. Need to get 23.2 MB of archives. After this operation, 55.7 MB of additional disk space will be used. Get:1
http://deb.debian.org/debian
trixie/main amd64 libc6-dbg amd64 2.41-12+deb13u3 [7394 kB] Get:2
https://downloads.osmocom.org/packages/osmocom:/latest/Debian_13
./ open5gs-common 2.8.0 [3568 kB] Get:3
https://downloads.osmocom.org/packages/osmocom:/latest/Debian_13
./ open5gs-common-dbgsym 2.8.0 [12.1 MB] Get:4
https://downloads.osmocom.org/packages/osmocom:/latest/Debian_13
./ open5gs-pcrf 2.8.0 [44.6 kB] Get:5
https://downloads.osmocom.org/packages/osmocom:/latest/Debian_13
./ open5gs-pcrf-dbgsym 2.8.0 [75.2 kB] Fetched 23.2 MB in 0s (87.1 MB/s) Selecting previously unselected package libc6-dbg:amd64. (Reading database ... (Reading database ... 5%(Reading database ... 10%(Reading database ... 15%(Reading database ... 20%(Reading database ... 25%(Reading database ... 30%(Reading database ... 35%(Reading database ... 40%(Reading database ... 45%(Reading database ... 50%(Reading database ... 55%(Reading database ... 60%(Reading database ... 65%(Reading database ... 70%(Reading database ... 75%(Reading database ... 80%(Reading database ... 85%(Reading database ... 90%(Reading database ... 95%(Reading database ... 100%(Reading database ... 44387 files and directories currently installed.) Preparing to unpack .../libc6-dbg_2.41-12+deb13u3_amd64.deb ... Unpacking libc6-dbg:amd64 (2.41-12+deb13u3) ... Selecting previously unselected package open5gs-common:amd64. Preparing to unpack .../open5gs-common_2.8.0_amd64.deb ... Unpacking open5gs-common:amd64 (2.8.0) ... Selecting previously unselected package open5gs-common-dbgsym:amd64. Preparing to unpack .../open5gs-common-dbgsym_2.8.0_amd64.deb ... Unpacking open5gs-common-dbgsym:amd64 (2.8.0) ... Selecting previously unselected package open5gs-pcrf:amd64. Preparing to unpack .../open5gs-pcrf_2.8.0_amd64.deb ... Unpacking open5gs-pcrf:amd64 (2.8.0) ... Selecting previously unselected package open5gs-pcrf-dbgsym:amd64. Preparing to unpack .../open5gs-pcrf-dbgsym_2.8.0_amd64.deb ... Unpacking open5gs-pcrf-dbgsym:amd64 (2.8.0) ... Setting up open5gs-common:amd64 (2.8.0) ... Setting up open5gs-pcrf:amd64 (2.8.0) ... Created symlink '/etc/systemd/system/multi-user.target.wants/open5gs-pcrfd.service' → '/usr/lib/systemd/system/open5gs-pcrfd.service'. Setting up libc6-dbg:amd64 (2.41-12+deb13u3) ... Setting up open5gs-common-dbgsym:amd64 (2.8.0) ... Setting up open5gs-pcrf-dbgsym:amd64 (2.8.0) ... Processing triggers for libc-bin (2.41-12+deb13u3) ... [1;34m[testenv] Preparing testdir: <
https://jenkins.osmocom.org/jenkins/job/ttcn3-pcrf-test-ogs-latest/ws/logs…
> [0;94m[testenv] + ['podman', 'exec', '-e', 'CCACHE_DIR=/home/osmocom-build/ccache/testenv', '-e', 'TESTENV_CACHE_DIR=<
https://jenkins.osmocom.org/jenkins/job/ttcn3-pcrf-test-ogs-latest/ws/_cache
',> '-e', 'TESTENV_SRC_DIR=/home/osmocom-build/jenkins/workspace', '-e', 'TESTENV_INSTALL_DIR=/', '-e', 'TERM=dumb', '-e', 'PATH=<
https://jenkins.osmocom.org/jenkins/job/ttcn3-pcrf-test-ogs-latest/ws/_test…
>:<
https://jenkins.osmocom.org/jenkins/job/ttcn3-pcrf-test-ogs-latest/ws/_test…
>:<
https://jenkins.osmocom.org/jenkins/job/ttcn3-pcrf-test-ogs-latest/ws/pcrf
>:/usr/local/bin:/usr/sbin:/usr/bin:/sbin:/bin', '-e', 'HOME=/home/osmocom-build', '-e', 'PYTHONUNBUFFERED=1', '-t', 'testenv-pcrf-osmocom-latest-20260814-1354-223df3fb-1', 'install', '-Dm644', '<
https://jenkins.osmocom.org/jenkins/job/ttcn3-pcrf-test-ogs-latest/ws/pcrf/…
',> '<
https://jenkins.osmocom.org/jenkins/job/ttcn3-pcrf-test-ogs-latest/274/arti…
'][0m> [0;94m[testenv] + ['cp', '-a', 'mongod.conf', '<
https://jenkins.osmocom.org/jenkins/job/ttcn3-pcrf-test-ogs-latest/274/arti…
'][0m> [0;94m[testenv] + ['cp', '-a', 'open5gs-pcrf.yaml', 'freediameter.conf', '<
https://jenkins.osmocom.org/jenkins/job/ttcn3-pcrf-test-ogs-latest/274/arti…
'][0m> [0;94m[testenv] + ['podman', 'exec', '-e', 'CCACHE_DIR=/home/osmocom-build/ccache/testenv', '-e', 'TESTENV_CACHE_DIR=<
https://jenkins.osmocom.org/jenkins/job/ttcn3-pcrf-test-ogs-latest/ws/_cache
',> '-e', 'TESTENV_SRC_DIR=/home/osmocom-build/jenkins/workspace', '-e', 'TESTENV_INSTALL_DIR=/', '-e', 'TERM=dumb', '-e', 'PATH=<
https://jenkins.osmocom.org/jenkins/job/ttcn3-pcrf-test-ogs-latest/ws/_test…
>:<
https://jenkins.osmocom.org/jenkins/job/ttcn3-pcrf-test-ogs-latest/ws/_test…
>:<
https://jenkins.osmocom.org/jenkins/job/ttcn3-pcrf-test-ogs-latest/ws/pcrf
>:/usr/local/bin:/usr/sbin:/usr/bin:/sbin:/bin', '-e', 'HOME=/home/osmocom-build', '-e', 'PYTHONUNBUFFERED=1', '-t', 'testenv-pcrf-osmocom-latest-20260814-1354-223df3fb-1', 'install', '-Dm644', '<
https://jenkins.osmocom.org/jenkins/job/ttcn3-pcrf-test-ogs-latest/ws/pcrf/…
',> '<
https://jenkins.osmocom.org/jenkins/job/ttcn3-pcrf-test-ogs-latest/274/arti…
'][0m> [0;94m[testenv] + ['podman', 'exec', '-e', 'CCACHE_DIR=/home/osmocom-build/ccache/testenv', '-e', 'TESTENV_CACHE_DIR=<
https://jenkins.osmocom.org/jenkins/job/ttcn3-pcrf-test-ogs-latest/ws/_cache
',> '-e', 'TESTENV_SRC_DIR=/home/osmocom-build/jenkins/workspace', '-e', 'TESTENV_INSTALL_DIR=/', '-e', 'TERM=dumb', '-e', 'PATH=<
https://jenkins.osmocom.org/jenkins/job/ttcn3-pcrf-test-ogs-latest/ws/_test…
>:<
https://jenkins.osmocom.org/jenkins/job/ttcn3-pcrf-test-ogs-latest/ws/_test…
>:<
https://jenkins.osmocom.org/jenkins/job/ttcn3-pcrf-test-ogs-latest/ws/pcrf
>:/usr/local/bin:/usr/sbin:/usr/bin:/sbin:/bin', '-e', 'HOME=/home/osmocom-build', '-e', 'PYTHONUNBUFFERED=1', '-t', 'testenv-pcrf-osmocom-latest-20260814-1354-223df3fb-1', 'install', '-Dm644', '<
https://jenkins.osmocom.org/jenkins/job/ttcn3-pcrf-test-ogs-latest/ws/Commo…
',> '<
https://jenkins.osmocom.org/jenkins/job/ttcn3-pcrf-test-ogs-latest/274/arti…
'][0m> [0;94m[testenv] + ['podman', 'exec', '-e', 'CCACHE_DIR=/home/osmocom-build/ccache/testenv', '-e', 'TESTENV_CACHE_DIR=<
https://jenkins.osmocom.org/jenkins/job/ttcn3-pcrf-test-ogs-latest/ws/_cache
',> '-e', 'TESTENV_SRC_DIR=/home/osmocom-build/jenkins/workspace', '-e', 'TESTENV_INSTALL_DIR=/', '-e', 'TERM=dumb', '-e', 'PATH=<
https://jenkins.osmocom.org/jenkins/job/ttcn3-pcrf-test-ogs-latest/ws/_test…
>:<
https://jenkins.osmocom.org/jenkins/job/ttcn3-pcrf-test-ogs-latest/ws/_test…
>:<
https://jenkins.osmocom.org/jenkins/job/ttcn3-pcrf-test-ogs-latest/ws/pcrf
>:/usr/local/bin:/usr/sbin:/usr/bin:/sbin:/bin', '-e', 'HOME=/home/osmocom-build', '-e', 'PYTHONUNBUFFERED=1', '-t', 'testenv-pcrf-osmocom-latest-20260814-1354-223df3fb-1', 'sed', '-i', 's#TTCN3_HACKS_PATH := .*#TTCN3_HACKS_PATH := "<
https://jenkins.osmocom.org/jenkins/job/ttcn3-pcrf-test-ogs-latest/ws/
">#', '<
https://jenkins.osmocom.org/jenkins/job/ttcn3-pcrf-test-ogs-latest/274/arti…
'][0m> [0;94m[testenv] Adjusting testsuite config: <
https://jenkins.osmocom.org/jenkins/job/ttcn3-pcrf-test-ogs-latest/274/arti…
> [0;94m[testenv] + ['podman', 'exec', '-e', 'CCACHE_DIR=/home/osmocom-build/ccache/testenv', '-e', 'TESTENV_CACHE_DIR=<
https://jenkins.osmocom.org/jenkins/job/ttcn3-pcrf-test-ogs-latest/ws/_cache
',> '-e', 'TESTENV_SRC_DIR=/home/osmocom-build/jenkins/workspace', '-e', 'TESTENV_INSTALL_DIR=/', '-e', 'TERM=dumb', '-e', 'PATH=<
https://jenkins.osmocom.org/jenkins/job/ttcn3-pcrf-test-ogs-latest/ws/_test…
>:<
https://jenkins.osmocom.org/jenkins/job/ttcn3-pcrf-test-ogs-latest/ws/_test…
>:<
https://jenkins.osmocom.org/jenkins/job/ttcn3-pcrf-test-ogs-latest/ws/pcrf
>:/usr/local/bin:/usr/sbin:/usr/bin:/sbin:/bin', '-e', 'HOME=/home/osmocom-build', '-e', 'PYTHONUNBUFFERED=1', '-t', 'testenv-pcrf-osmocom-latest-20260814-1354-223df3fb-1', 'sed', '-i', '-e', 's/\\[MODULE_PARAMETERS\\]/\\[MODULE_PARAMETERS\\]\\nMisc_Helpers.mp_osmo_repo := "latest"/g', '-e', 's#../Common.cfg#Common.cfg#', '<
https://jenkins.osmocom.org/jenkins/job/ttcn3-pcrf-test-ogs-latest/274/arti…
'][0m> [0;94m[testenv] Adjusting testsuite config: <
https://jenkins.osmocom.org/jenkins/job/ttcn3-pcrf-test-ogs-latest/274/arti…
> [0;94m[testenv] + ['podman', 'exec', '-e', 'CCACHE_DIR=/home/osmocom-build/ccache/testenv', '-e', 'TESTENV_CACHE_DIR=<
https://jenkins.osmocom.org/jenkins/job/ttcn3-pcrf-test-ogs-latest/ws/_cache
',> '-e', 'TESTENV_SRC_DIR=/home/osmocom-build/jenkins/workspace', '-e', 'TESTENV_INSTALL_DIR=/', '-e', 'TERM=dumb', '-e', 'PATH=<
https://jenkins.osmocom.org/jenkins/job/ttcn3-pcrf-test-ogs-latest/ws/_test…
>:<
https://jenkins.osmocom.org/jenkins/job/ttcn3-pcrf-test-ogs-latest/ws/_test…
>:<
https://jenkins.osmocom.org/jenkins/job/ttcn3-pcrf-test-ogs-latest/ws/pcrf
>:/usr/local/bin:/usr/sbin:/usr/bin:/sbin:/bin', '-e', 'HOME=/home/osmocom-build', '-e', 'PYTHONUNBUFFERED=1', '-t', 'testenv-pcrf-osmocom-latest-20260814-1354-223df3fb-1', 'sed', '-i', '-e', 's/\\[MODULE_PARAMETERS\\]/\\[MODULE_PARAMETERS\\]\\nMisc_Helpers.mp_osmo_repo := "latest"/g', '-e', 's#../Common.cfg#Common.cfg#', '<
https://jenkins.osmocom.org/jenkins/job/ttcn3-pcrf-test-ogs-latest/274/arti…
'][0m> [0;94m[testenv] Adjusting testsuite config: <
https://jenkins.osmocom.org/jenkins/job/ttcn3-pcrf-test-ogs-latest/274/arti…
> [0;94m[testenv] + ['podman', 'exec', '-e', 'CCACHE_DIR=/home/osmocom-build/ccache/testenv', '-e', 'TESTENV_CACHE_DIR=<
https://jenkins.osmocom.org/jenkins/job/ttcn3-pcrf-test-ogs-latest/ws/_cache
',> '-e', 'TESTENV_SRC_DIR=/home/osmocom-build/jenkins/workspace', '-e', 'TESTENV_INSTALL_DIR=/', '-e', 'TERM=dumb', '-e', 'PATH=<
https://jenkins.osmocom.org/jenkins/job/ttcn3-pcrf-test-ogs-latest/ws/_test…
>:<
https://jenkins.osmocom.org/jenkins/job/ttcn3-pcrf-test-ogs-latest/ws/_test…
>:<
https://jenkins.osmocom.org/jenkins/job/ttcn3-pcrf-test-ogs-latest/ws/pcrf
>:/usr/local/bin:/usr/sbin:/usr/bin:/sbin:/bin', '-e', 'HOME=/home/osmocom-build', '-e', 'PYTHONUNBUFFERED=1', '-t', 'testenv-pcrf-osmocom-latest-20260814-1354-223df3fb-1', 'sed', '-i', '-e', 's/\\[MODULE_PARAMETERS\\]/\\[MODULE_PARAMETERS\\]\\nMisc_Helpers.mp_osmo_repo := "latest"/g', '-e', 's#../Common.cfg#Common.cfg#', '<
https://jenkins.osmocom.org/jenkins/job/ttcn3-pcrf-test-ogs-latest/274/arti…
'][0m> [1;34m[testenv] Running db prepare script[0m [0;94m[testenv] + ['podman', 'exec', '-e', 'CCACHE_DIR=/home/osmocom-build/ccache/testenv', '-e', 'TESTENV_CACHE_DIR=<
https://jenkins.osmocom.org/jenkins/job/ttcn3-pcrf-test-ogs-latest/ws/_cache
',> '-e', 'TESTENV_SRC_DIR=/home/osmocom-build/jenkins/workspace', '-e', 'TESTENV_INSTALL_DIR=/', '-e', 'TERM=dumb', '-e', 'PATH=<
https://jenkins.osmocom.org/jenkins/job/ttcn3-pcrf-test-ogs-latest/ws/_test…
>:<
https://jenkins.osmocom.org/jenkins/job/ttcn3-pcrf-test-ogs-latest/ws/_test…
>:<
https://jenkins.osmocom.org/jenkins/job/ttcn3-pcrf-test-ogs-latest/ws/pcrf
>:/usr/local/bin:/usr/sbin:/usr/bin:/sbin:/bin', '-e', 'HOME=/home/osmocom-build', '-e', 'PYTHONUNBUFFERED=1', '-t', '-w', '<
https://jenkins.osmocom.org/jenkins/job/ttcn3-pcrf-test-ogs-latest/274/arti…
',> 'testenv-pcrf-osmocom-latest-20260814-1354-223df3fb-1', 'sh', '-c', 'mkdir db'][0m [1;34m[testenv] Running db[0m [0;94m[testenv] + ['podman', 'exec', '-e', 'CCACHE_DIR=/home/osmocom-build/ccache/testenv', '-e', 'TESTENV_CACHE_DIR=<
https://jenkins.osmocom.org/jenkins/job/ttcn3-pcrf-test-ogs-latest/ws/_cache
',> '-e', 'TESTENV_SRC_DIR=/home/osmocom-build/jenkins/workspace', '-e', 'TESTENV_INSTALL_DIR=/', '-e', 'TERM=dumb', '-e', 'PATH=<
https://jenkins.osmocom.org/jenkins/job/ttcn3-pcrf-test-ogs-latest/ws/_test…
>:<
https://jenkins.osmocom.org/jenkins/job/ttcn3-pcrf-test-ogs-latest/ws/_test…
>:<
https://jenkins.osmocom.org/jenkins/job/ttcn3-pcrf-test-ogs-latest/ws/pcrf
>:/usr/local/bin:/usr/sbin:/usr/bin:/sbin:/bin', '-e', 'HOME=/home/osmocom-build', '-e', 'PYTHONUNBUFFERED=1', '-w', '<
https://jenkins.osmocom.org/jenkins/job/ttcn3-pcrf-test-ogs-latest/274/arti…
',> 'testenv-pcrf-osmocom-latest-20260814-1354-223df3fb-1', 'sh', '-c', 'ulimit -c unlimited; mongod --config mongod.conf 2>&1 | tee <
https://jenkins.osmocom.org/jenkins/job/ttcn3-pcrf-test-ogs-latest/274/arti…
'][0m> [1;34m[testenv] Running db setup script[0m [0;94m[testenv] + ['podman', 'exec', '-e', 'CCACHE_DIR=/home/osmocom-build/ccache/testenv', '-e', 'TESTENV_CACHE_DIR=<
https://jenkins.osmocom.org/jenkins/job/ttcn3-pcrf-test-ogs-latest/ws/_cache
',> '-e', 'TESTENV_SRC_DIR=/home/osmocom-build/jenkins/workspace', '-e', 'TESTENV_INSTALL_DIR=/', '-e', 'TERM=dumb', '-e', 'PATH=<
https://jenkins.osmocom.org/jenkins/job/ttcn3-pcrf-test-ogs-latest/ws/_test…
>:<
https://jenkins.osmocom.org/jenkins/job/ttcn3-pcrf-test-ogs-latest/ws/_test…
>:<
https://jenkins.osmocom.org/jenkins/job/ttcn3-pcrf-test-ogs-latest/ws/pcrf
>:/usr/local/bin:/usr/sbin:/usr/bin:/sbin:/bin', '-e', 'HOME=/home/osmocom-build', '-e', 'PYTHONUNBUFFERED=1', '-t', '-w', '<
https://jenkins.osmocom.org/jenkins/job/ttcn3-pcrf-test-ogs-latest/274/arti…
',> 'testenv-pcrf-osmocom-latest-20260814-1354-223df3fb-1', 'sh', '-c', 'create_test_subscribers.sh'][0m {"t":{"$date":"2026-08-14T13:54:48.515+00:00"},"s":"I", "c":"NETWORK", "id":4915701, "ctx":"-","msg":"Initialized wire specification","attr":{"spec":{"incomingExternalClient":{"minWireVersion":0,"maxWireVersion":13},"incomingInternalClient":{"minWireVersion":0,"maxWireVersion":13},"outgoing":{"minWireVersion":0,"maxWireVersion":13},"isInternalClient":true}}} {"t":{"$date":"2026-08-14T13:54:48.516+00:00"},"s":"I", "c":"CONTROL", "id":23285, "ctx":"main","msg":"Automatically disabling TLS 1.0, to force-enable TLS 1.0 specify --sslDisabledProtocols 'none'"} {"t":{"$date":"2026-08-14T13:54:48.516+00:00"},"s":"W", "c":"ASIO", "id":22601, "ctx":"main","msg":"No TransportLayer configured during NetworkInterface startup"} {"t":{"$date":"2026-08-14T13:54:48.517+00:00"},"s":"I", "c":"NETWORK", "id":4648601, "ctx":"main","msg":"Implicit TCP FastOpen unavailable. If TCP FastOpen is required, set tcpFastOpenServer, tcpFastOpenClient, and tcpFastOpenQueueSize."} + DB_URI=mongodb://127.0.0.103/open5gs + DBCTL=<
https://jenkins.osmocom.org/jenkins/job/ttcn3-pcrf-test-ogs-latest/ws/_cach…
> + DBCTL_CMD=<
https://jenkins.osmocom.org/jenkins/job/ttcn3-pcrf-test-ogs-latest/ws/_cach…
> --db_uri=mongodb://127.0.0.103/open5gs + [ -e <
https://jenkins.osmocom.org/jenkins/job/ttcn3-pcrf-test-ogs-latest/ws/_cach…
> ] + wget
https://raw.githubusercontent.com/open5gs/open5gs/v2.7.1/misc/db/open5gs-db…
-O <
https://jenkins.osmocom.org/jenkins/job/ttcn3-pcrf-test-ogs-latest/ws/_cach…
> --2026-08-14 13:54:48--
https://raw.githubusercontent.com/open5gs/open5gs/v2.7.1/misc/db/open5gs-db…
Resolving
raw.githubusercontent.com
(
raw.githubusercontent.com
)... 185.199.109.133, 185.199.110.133, 185.199.111.133, ... Connecting to
raw.githubusercontent.com
(raw.githubusercontent.com)|185.199.109.133|:443... {"t":{"$date":"2026-08-14T13:54:48.579+00:00"},"s":"W", "c":"ASIO", "id":22601, "ctx":"main","msg":"No TransportLayer configured during NetworkInterface startup"} {"t":{"$date":"2026-08-14T13:54:48.580+00:00"},"s":"I", "c":"REPL", "id":5123008, "ctx":"main","msg":"Successfully registered PrimaryOnlyService","attr":{"service":"TenantMigrationDonorService","ns":"config.tenantMigrationDonors"}} {"t":{"$date":"2026-08-14T13:54:48.580+00:00"},"s":"I", "c":"REPL", "id":5123008, "ctx":"main","msg":"Successfully registered PrimaryOnlyService","attr":{"service":"TenantMigrationRecipientService","ns":"config.tenantMigrationRecipients"}} {"t":{"$date":"2026-08-14T13:54:48.580+00:00"},"s":"I", "c":"CONTROL", "id":5945603, "ctx":"main","msg":"Multi threading initialized"} {"t":{"$date":"2026-08-14T13:54:48.580+00:00"},"s":"I", "c":"CONTROL", "id":4615611, "ctx":"initandlisten","msg":"MongoDB starting","attr":{"pid":150,"port":27017,"dbPath":"db","architecture":"64-bit","host":"3b56b3a8c7a4"}} {"t":{"$date":"2026-08-14T13:54:48.580+00:00"},"s":"I", "c":"CONTROL", "id":23403, "ctx":"initandlisten","msg":"Build Info","attr":{"buildInfo":{"version":"5.0.34","gitVersion":"3ed0d39e497e5876dab3a0b825f2e504806d0afd","openSSLVersion":"OpenSSL 1.1.1n 15 Mar 2022","modules":[],"allocator":"tcmalloc","environment":{"distmod":"debian11","distarch":"x86_64","target_arch":"x86_64"}}}} {"t":{"$date":"2026-08-14T13:54:48.580+00:00"},"s":"I", "c":"CONTROL", "id":51765, "ctx":"initandlisten","msg":"Operating System","attr":{"os":{"name":"PRETTY_NAME=\"Debian GNU/Linux 13 (trixie)\"","version":"Kernel 6.12.101+deb13-amd64"}}} {"t":{"$date":"2026-08-14T13:54:48.580+00:00"},"s":"I", "c":"CONTROL", "id":21951, "ctx":"initandlisten","msg":"Options set by command line","attr":{"options":{"config":"mongod.conf","net":{"bindIp":"127.0.0.103","port":27017},"processManagement":{"timeZoneInfo":"/usr/share/zoneinfo"},"storage":{"dbPath":"db"}}}} {"t":{"$date":"2026-08-14T13:54:48.581+00:00"},"s":"I", "c":"STORAGE", "id":22297, "ctx":"initandlisten","msg":"Using the XFS filesystem is strongly recommended with the WiredTiger storage engine. See
http://dochub.mongodb.org/core/prodnotes-filesystem
","tags":["startupWarnings"]} {"t":{"$date":"2026-08-14T13:54:48.581+00:00"},"s":"I", "c":"STORAGE", "id":22315, "ctx":"initandlisten","msg":"Opening WiredTiger","attr":{"config":"create,cache_size=31543M,session_max=33000,eviction=(threads_min=4,threads_max=4),config_base=false,statistics=(fast),log=(enabled=true,archive=true,path=journal,compressor=snappy),builtin_extension_config=(zstd=(compression_level=6)),file_manager=(close_idle_time=600,close_scan_interval=10,close_handle_minimum=2000),statistics_log=(wait=0),verbose=[recovery_progress,checkpoint_progress,compact_progress],"}} connected. HTTP request sent, awaiting response... {"t":{"$date":"2026-08-14T13:54:48.773+00:00"},"s":"I", "c":"STORAGE", "id":22430, "ctx":"initandlisten","msg":"WiredTiger message","attr":{"message":"[1786715688:772997][150:0x7f42748d7c80], txn-recover: [WT_VERB_RECOVERY_PROGRESS] recovery log replay has successfully finished and ran for 0 milliseconds"}} {"t":{"$date":"2026-08-14T13:54:48.773+00:00"},"s":"I", "c":"STORAGE", "id":22430, "ctx":"initandlisten","msg":"WiredTiger message","attr":{"message":"[1786715688:773039][150:0x7f42748d7c80], txn-recover: [WT_VERB_RECOVERY_ALL] Set global recovery timestamp: (0, 0)"}} {"t":{"$date":"2026-08-14T13:54:48.773+00:00"},"s":"I", "c":"STORAGE", "id":22430, "ctx":"initandlisten","msg":"WiredTiger message","attr":{"message":"[1786715688:773050][150:0x7f42748d7c80], txn-recover: [WT_VERB_RECOVERY_ALL] Set global oldest timestamp: (0, 0)"}} {"t":{"$date":"2026-08-14T13:54:48.773+00:00"},"s":"I", "c":"STORAGE", "id":22430, "ctx":"initandlisten","msg":"WiredTiger message","attr":{"message":"[1786715688:773071][150:0x7f42748d7c80], txn-recover: [WT_VERB_RECOVERY_PROGRESS] recovery was completed successfully and took 0ms, including 0ms for the log replay, 0ms for the rollback to stable, and 0ms for the checkpoint."}} {"t":{"$date":"2026-08-14T13:54:48.835+00:00"},"s":"I", "c":"STORAGE", "id":4795906, "ctx":"initandlisten","msg":"WiredTiger opened","attr":{"durationMillis":254}} {"t":{"$date":"2026-08-14T13:54:48.835+00:00"},"s":"I", "c":"RECOVERY", "id":23987, "ctx":"initandlisten","msg":"WiredTiger recoveryTimestamp","attr":{"recoveryTimestamp":{"$timestamp":{"t":0,"i":0}}}} {"t":{"$date":"2026-08-14T13:54:48.918+00:00"},"s":"I", "c":"STORAGE", "id":22262, "ctx":"initandlisten","msg":"Timestamp monitor starting"} {"t":{"$date":"2026-08-14T13:54:48.963+00:00"},"s":"W", "c":"CONTROL", "id":22120, "ctx":"initandlisten","msg":"Access control is not enabled for the database. Read and write access to data and configuration is unrestricted","tags":["startupWarnings"]} {"t":{"$date":"2026-08-14T13:54:48.963+00:00"},"s":"W", "c":"CONTROL", "id":22138, "ctx":"initandlisten","msg":"You are running this process as the root user, which is not recommended","tags":["startupWarnings"]} {"t":{"$date":"2026-08-14T13:54:48.963+00:00"},"s":"W", "c":"CONTROL", "id":22178, "ctx":"initandlisten","msg":"/sys/kernel/mm/transparent_hugepage/enabled is 'always'. We suggest setting it to 'never' in this binary version","tags":["startupWarnings"]} {"t":{"$date":"2026-08-14T13:54:48.968+00:00"},"s":"I", "c":"STORAGE", "id":20320, "ctx":"initandlisten","msg":"createCollection","attr":{"namespace":"admin.system.version","uuidDisposition":"provided","uuid":{"uuid":{"$uuid":"704d69e1-c2bb-4262-8911-0d699835d18c"}},"options":{"uuid":{"$uuid":"704d69e1-c2bb-4262-8911-0d699835d18c"}}}} {"t":{"$date":"2026-08-14T13:54:49.033+00:00"},"s":"I", "c":"INDEX", "id":20345, "ctx":"initandlisten","msg":"Index build: done building","attr":{"buildUUID":null,"namespace":"admin.system.version","index":"_id_","commitTimestamp":null}} {"t":{"$date":"2026-08-14T13:54:49.033+00:00"},"s":"I", "c":"REPL", "id":20459, "ctx":"initandlisten","msg":"Setting featureCompatibilityVersion","attr":{"newVersion":"5.0"}} {"t":{"$date":"2026-08-14T13:54:49.033+00:00"},"s":"I", "c":"NETWORK", "id":4915702, "ctx":"initandlisten","msg":"Updated wire specification","attr":{"oldSpec":{"incomingExternalClient":{"minWireVersion":0,"maxWireVersion":13},"incomingInternalClient":{"minWireVersion":0,"maxWireVersion":13},"outgoing":{"minWireVersion":0,"maxWireVersion":13},"isInternalClient":true},"newSpec":{"incomingExternalClient":{"minWireVersion":0,"maxWireVersion":13},"incomingInternalClient":{"minWireVersion":13,"maxWireVersion":13},"outgoing":{"minWireVersion":13,"maxWireVersion":13},"isInternalClient":true}}} {"t":{"$date":"2026-08-14T13:54:49.035+00:00"},"s":"I", "c":"NETWORK", "id":4915702, "ctx":"initandlisten","msg":"Updated wire specification","attr":{"oldSpec":{"incomingExternalClient":{"minWireVersion":0,"maxWireVersion":13},"incomingInternalClient":{"minWireVersion":13,"maxWireVersion":13},"outgoing":{"minWireVersion":13,"maxWireVersion":13},"isInternalClient":true},"newSpec":{"incomingExternalClient":{"minWireVersion":0,"maxWireVersion":13},"incomingInternalClient":{"minWireVersion":13,"maxWireVersion":13},"outgoing":{"minWireVersion":13,"maxWireVersion":13},"isInternalClient":true}}} {"t":{"$date":"2026-08-14T13:54:49.035+00:00"},"s":"I", "c":"STORAGE", "id":5071100, "ctx":"initandlisten","msg":"Clearing temp directory"} {"t":{"$date":"2026-08-14T13:54:49.035+00:00"},"s":"I", "c":"CONTROL", "id":20536, "ctx":"initandlisten","msg":"Flow Control is enabled on this deployment"} {"t":{"$date":"2026-08-14T13:54:49.036+00:00"},"s":"I", "c":"FTDC", "id":20625, "ctx":"initandlisten","msg":"Initializing full-time diagnostic data capture","attr":{"dataDirectory":"db/diagnostic.data"}} {"t":{"$date":"2026-08-14T13:54:49.036+00:00"},"s":"I", "c":"STORAGE", "id":20320, "ctx":"initandlisten","msg":"createCollection","attr":{"namespace":"local.startup_log","uuidDisposition":"generated","uuid":{"uuid":{"$uuid":"01c0b140-b187-4454-bbb1-4fc902310cf9"}},"options":{"capped":true,"size":10485760}}} {"t":{"$date":"2026-08-14T13:54:49.112+00:00"},"s":"I", "c":"INDEX", "id":20345, "ctx":"initandlisten","msg":"Index build: done building","attr":{"buildUUID":null,"namespace":"local.startup_log","index":"_id_","commitTimestamp":null}} {"t":{"$date":"2026-08-14T13:54:49.113+00:00"},"s":"I", "c":"REPL", "id":6015317, "ctx":"initandlisten","msg":"Setting new configuration state","attr":{"newState":"ConfigReplicationDisabled","oldState":"ConfigPreStart"}} {"t":{"$date":"2026-08-14T13:54:49.114+00:00"},"s":"I", "c":"NETWORK", "id":23015, "ctx":"listener","msg":"Listening on","attr":{"address":"/tmp/mongodb-27017.sock"}} {"t":{"$date":"2026-08-14T13:54:49.114+00:00"},"s":"I", "c":"NETWORK", "id":23015, "ctx":"listener","msg":"Listening on","attr":{"address":"127.0.0.103"}} {"t":{"$date":"2026-08-14T13:54:49.114+00:00"},"s":"I", "c":"NETWORK", "id":23016, "ctx":"listener","msg":"Waiting for connections","attr":{"port":27017,"ssl":"off"}} {"t":{"$date":"2026-08-14T13:54:49.120+00:00"},"s":"I", "c":"STORAGE", "id":20320, "ctx":"LogicalSessionCacheRefresh","msg":"createCollection","attr":{"namespace":"config.system.sessions","uuidDisposition":"generated","uuid":{"uuid":{"$uuid":"8c8763f9-2a40-4d36-a9c9-954a96d0809c"}},"options":{}}} {"t":{"$date":"2026-08-14T13:54:49.122+00:00"},"s":"I", "c":"CONTROL", "id":20712, "ctx":"LogicalSessionCacheReap","msg":"Sessions collection is not set up; waiting until next sessions reap interval","attr":{"error":"NamespaceNotFound: config.system.sessions does not exist"}} {"t":{"$date":"2026-08-14T13:54:49.225+00:00"},"s":"I", "c":"INDEX", "id":20345, "ctx":"LogicalSessionCacheRefresh","msg":"Index build: done building","attr":{"buildUUID":null,"namespace":"config.system.sessions","index":"_id_","commitTimestamp":null}} {"t":{"$date":"2026-08-14T13:54:49.225+00:00"},"s":"I", "c":"INDEX", "id":20345, "ctx":"LogicalSessionCacheRefresh","msg":"Index build: done building","attr":{"buildUUID":null,"namespace":"config.system.sessions","index":"lsidTTLIndex","commitTimestamp":null}} {"t":{"$date":"2026-08-14T13:54:49.226+00:00"},"s":"I", "c":"COMMAND", "id":51803, "ctx":"LogicalSessionCacheRefresh","msg":"Slow query","attr":{"type":"command","ns":"config.system.sessions","command":{"createIndexes":"system.sessions","v":2,"indexes":[{"key":{"lastUse":1},"name":"lsidTTLIndex","expireAfterSeconds":1800}],"ignoreUnknownIndexOptions":false,"writeConcern":{},"$db":"config"},"numYields":0,"reslen":114,"locks":{"ParallelBatchWriterMode":{"acquireCount":{"r":4}},"FeatureCompatibilityVersion":{"acquireCount":{"r":4,"w":1}},"ReplicationStateTransition":{"acquireCount":{"w":4}},"Global":{"acquireCount":{"r":4,"w":1}},"Database":{"acquireCount":{"r":3,"w":1}},"Collection":{"acquireCount":{"r":3,"w":1}},"Mutex":{"acquireCount":{"r":6}}},"storage":{},"protocol":"op_msg","durationMillis":105}} 503 first byte timeout 2026-08-14 13:55:19 ERROR 503: first byte timeout. [1;91m[testenv] db: setup script failed[0m [1;34m[testenv] Stopping podman container[0m [0;94m[testenv] + ['podman', 'kill', 'testenv-pcrf-osmocom-latest-20260814-1354-223df3fb-1'][0m testenv-pcrf-osmocom-latest-20260814-1354-223df3fb-1 [0;94m[testenv] feed_watchdog_loop: podman container has stopped[0m [1;34m[testenv] Logs saved to:
https://jenkins.osmocom.org/jenkins/job/ttcn3-pcrf-test-ogs-latest/274/arti…
[0m + RC=1 + [ 1 = 0 ] + uptime + grep --color=always -o load.* [01;31m[Kload average: 14.42, 9.85, 7.54[m[K + exit 1 Build step 'Execute shell' marked build as failure Recording test results ERROR: Step ‘Publish JUnit test result report’ failed: No test report files were found. Configuration error?
1
1
0
0
Jenkins build became unstable: ttcn3-remsim-test-latest #1964
by jenkins@lists.osmocom.org
15 Aug '26
15 Aug '26
See <
https://jenkins.osmocom.org/jenkins/job/ttcn3-remsim-test-latest/1964/displ…
>
1
1
0
0
← Newer
1
...
12
13
14
15
16
17
18
...
670
Older →
Jump to page:
1
2
3
4
5
6
7
8
9
10
11
12
13
14
15
16
17
18
19
20
21
22
23
24
25
26
27
28
29
30
31
32
33
34
35
36
37
38
39
40
41
42
43
44
45
46
47
48
49
50
51
52
53
54
55
56
57
58
59
60
61
62
63
64
65
66
67
68
69
70
71
72
73
74
75
76
77
78
79
80
81
82
83
84
85
86
87
88
89
90
91
92
93
94
95
96
97
98
99
100
101
102
103
104
105
106
107
108
109
110
111
112
113
114
115
116
117
118
119
120
121
122
123
124
125
126
127
128
129
130
131
132
133
134
135
136
137
138
139
140
141
142
143
144
145
146
147
148
149
150
151
152
153
154
155
156
157
158
159
160
161
162
163
164
165
166
167
168
169
170
171
172
173
174
175
176
177
178
179
180
181
182
183
184
185
186
187
188
189
190
191
192
193
194
195
196
197
198
199
200
201
202
203
204
205
206
207
208
209
210
211
212
213
214
215
216
217
218
219
220
221
222
223
224
225
226
227
228
229
230
231
232
233
234
235
236
237
238
239
240
241
242
243
244
245
246
247
248
249
250
251
252
253
254
255
256
257
258
259
260
261
262
263
264
265
266
267
268
269
270
271
272
273
274
275
276
277
278
279
280
281
282
283
284
285
286
287
288
289
290
291
292
293
294
295
296
297
298
299
300
301
302
303
304
305
306
307
308
309
310
311
312
313
314
315
316
317
318
319
320
321
322
323
324
325
326
327
328
329
330
331
332
333
334
335
336
337
338
339
340
341
342
343
344
345
346
347
348
349
350
351
352
353
354
355
356
357
358
359
360
361
362
363
364
365
366
367
368
369
370
371
372
373
374
375
376
377
378
379
380
381
382
383
384
385
386
387
388
389
390
391
392
393
394
395
396
397
398
399
400
401
402
403
404
405
406
407
408
409
410
411
412
413
414
415
416
417
418
419
420
421
422
423
424
425
426
427
428
429
430
431
432
433
434
435
436
437
438
439
440
441
442
443
444
445
446
447
448
449
450
451
452
453
454
455
456
457
458
459
460
461
462
463
464
465
466
467
468
469
470
471
472
473
474
475
476
477
478
479
480
481
482
483
484
485
486
487
488
489
490
491
492
493
494
495
496
497
498
499
500
501
502
503
504
505
506
507
508
509
510
511
512
513
514
515
516
517
518
519
520
521
522
523
524
525
526
527
528
529
530
531
532
533
534
535
536
537
538
539
540
541
542
543
544
545
546
547
548
549
550
551
552
553
554
555
556
557
558
559
560
561
562
563
564
565
566
567
568
569
570
571
572
573
574
575
576
577
578
579
580
581
582
583
584
585
586
587
588
589
590
591
592
593
594
595
596
597
598
599
600
601
602
603
604
605
606
607
608
609
610
611
612
613
614
615
616
617
618
619
620
621
622
623
624
625
626
627
628
629
630
631
632
633
634
635
636
637
638
639
640
641
642
643
644
645
646
647
648
649
650
651
652
653
654
655
656
657
658
659
660
661
662
663
664
665
666
667
668
669
670
Results per page:
10
25
50
100
200