lists.osmocom.org
Sign In
Sign Up
Sign In
Sign Up
Manage this list
×
Keyboard Shortcuts
Thread View
j
: Next unread message
k
: Previous unread message
j a
: Jump to all threads
j l
: Jump to MailingList overview
2026
September
August
July
June
May
April
March
February
January
2025
December
November
October
September
August
July
June
May
April
March
February
January
2024
December
November
October
September
August
July
June
May
April
March
February
January
2023
December
November
October
September
August
July
June
May
April
March
February
January
2022
December
November
October
September
August
July
June
May
April
March
February
January
2021
December
November
October
September
August
July
June
May
April
March
February
January
2020
December
November
October
September
August
July
June
May
April
March
February
January
2019
December
November
October
September
August
July
June
May
April
March
List overview
Download
jenkins-notifications
----- 2026 -----
September 2026
August 2026
July 2026
June 2026
May 2026
April 2026
March 2026
February 2026
January 2026
----- 2025 -----
December 2025
November 2025
October 2025
September 2025
August 2025
July 2025
June 2025
May 2025
April 2025
March 2025
February 2025
January 2025
----- 2024 -----
December 2024
November 2024
October 2024
September 2024
August 2024
July 2024
June 2024
May 2024
April 2024
March 2024
February 2024
January 2024
----- 2023 -----
December 2023
November 2023
October 2023
September 2023
August 2023
July 2023
June 2023
May 2023
April 2023
March 2023
February 2023
January 2023
----- 2022 -----
December 2022
November 2022
October 2022
September 2022
August 2022
July 2022
June 2022
May 2022
April 2022
March 2022
February 2022
January 2022
----- 2021 -----
December 2021
November 2021
October 2021
September 2021
August 2021
July 2021
June 2021
May 2021
April 2021
March 2021
February 2021
January 2021
----- 2020 -----
December 2020
November 2020
October 2020
September 2020
August 2020
July 2020
June 2020
May 2020
April 2020
March 2020
February 2020
January 2020
----- 2019 -----
December 2019
November 2019
October 2019
September 2019
August 2019
July 2019
June 2019
May 2019
April 2019
March 2019
jenkins-notifications@lists.osmocom.org
1 participants
6691 discussions
Start a n
N
ew thread
Build failed in Jenkins: ttcn3-bsc-test-vamos-asan #416
by jenkins@lists.osmocom.org
22 Aug '26
22 Aug '26
See <
https://jenkins.osmocom.org/jenkins/job/ttcn3-bsc-test-vamos-asan/416/displ…
> Changes: [Pau Espin Pedrol] pgw: Move generic helper find_teid to library/ [Pau Espin Pedrol] hnbgw: Send correct recovery timestamp in PFCP Assoc Setup Resp [Pau Espin Pedrol] hnbgw: Move generic PFCP ConnHdlr helpers to library/PFCP_Emulation.ttcn ------------------------------------------ [...truncated 108.95 KiB...] CCLD SCCP_Types_part_6.so CCLD SCCP_Types_part_7.so CCLD SCCPasp_Types_part_1.so CCLD SCCPasp_Types_part_2.so CCLD SCCPasp_Types_part_3.so CCLD SCCPasp_Types_part_4.so CCLD SCCPasp_Types_part_5.so CCLD SCCPasp_Types_part_6.so CCLD SCCPasp_Types_part_7.so CCLD SCTPasp_PortType_part_1.so CCLD SCTPasp_PortType_part_2.so CCLD SCTPasp_PortType_part_3.so CCLD SCTPasp_PortType_part_4.so CCLD SCTPasp_PortType_part_5.so CCLD SCTPasp_PortType_part_6.so CCLD SCTPasp_PortType_part_7.so CCLD SCTPasp_Types_part_1.so CCLD SCTPasp_Types_part_2.so CCLD SCTPasp_Types_part_3.so CCLD SCTPasp_Types_part_4.so CCLD SCTPasp_Types_part_5.so CCLD SCTPasp_Types_part_6.so CCLD SCTPasp_Types_part_7.so CCLD SDP_Templates_part_1.so CCLD SDP_Templates_part_2.so CCLD SDP_Templates_part_3.so CCLD SDP_Templates_part_4.so CCLD SDP_Templates_part_5.so CCLD SDP_Templates_part_6.so CCLD SDP_Templates_part_7.so CCLD SDP_Types_part_1.so CCLD SDP_Types_part_2.so CCLD SDP_Types_part_3.so CCLD SDP_Types_part_4.so CCLD SDP_Types_part_5.so CCLD SDP_Types_part_6.so CCLD SDP_Types_part_7.so CCLD Socket_API_Definitions_part_1.so CCLD Socket_API_Definitions_part_2.so CCLD Socket_API_Definitions_part_3.so CCLD Socket_API_Definitions_part_4.so CCLD Socket_API_Definitions_part_5.so CCLD Socket_API_Definitions_part_6.so CCLD Socket_API_Definitions_part_7.so CCLD StatsD_CodecPort_part_1.so CCLD StatsD_CodecPort_part_2.so CCLD StatsD_CodecPort_part_3.so CCLD StatsD_CodecPort_part_4.so CCLD StatsD_CodecPort_part_5.so CCLD StatsD_CodecPort_part_6.so CCLD StatsD_CodecPort_part_7.so CCLD StatsD_CodecPort_CtrlFunct_part_1.so CCLD StatsD_CodecPort_CtrlFunct_part_2.so CCLD StatsD_CodecPort_CtrlFunct_part_3.so CCLD StatsD_CodecPort_CtrlFunct_part_4.so CCLD StatsD_CodecPort_CtrlFunct_part_5.so CCLD StatsD_CodecPort_CtrlFunct_part_6.so CCLD StatsD_CodecPort_CtrlFunct_part_7.so CCLD StatsD_Types_part_1.so CCLD StatsD_Types_part_2.so CCLD StatsD_Types_part_3.so CCLD StatsD_Types_part_4.so CCLD StatsD_Types_part_5.so CCLD StatsD_Types_part_6.so CCLD StatsD_Types_part_7.so CCLD TCCConversion_Functions_part_1.so CCLD TCCConversion_Functions_part_2.so CCLD TCCConversion_Functions_part_3.so CCLD TCCConversion_Functions_part_4.so CCLD TCCConversion_Functions_part_6.so CCLD TCCConversion_Functions_part_5.so CCLD TCCConversion_Functions_part_7.so CCLD TCCInterface_Functions_part_1.so CCLD TCCInterface_Functions_part_2.so CCLD TCCInterface_Functions_part_3.so CCLD TCCInterface_Functions_part_4.so CCLD TCCInterface_Functions_part_5.so CCLD TCCInterface_Functions_part_6.so CCLD TCCInterface_Functions_part_7.so CCLD TELNETasp_PortType_part_1.so CCLD TELNETasp_PortType_part_2.so CCLD TELNETasp_PortType_part_3.so CCLD TELNETasp_PortType_part_4.so CCLD TELNETasp_PortType_part_5.so CCLD TELNETasp_PortType_part_6.so CCLD TELNETasp_PortType_part_7.so CCLD IPA_Emulation.so CCLD RAN_Adapter.so CCLD RAN_Emulation.so CCLD SCCP_Adapter.so CCLD SCCP_Mapping.so CCLD StatsD_Checker.so CCLD IPA_Emulation_part_1.so CCLD IPA_Emulation_part_2.so CCLD IPA_Emulation_part_3.so CCLD IPA_Emulation_part_4.so CCLD IPA_Emulation_part_5.so CCLD IPA_Emulation_part_6.so CCLD IPA_Emulation_part_7.so CCLD RAN_Adapter_part_1.so CCLD RAN_Adapter_part_2.so CCLD RAN_Adapter_part_3.so CCLD RAN_Adapter_part_4.so CCLD RAN_Adapter_part_5.so CCLD RAN_Adapter_part_6.so CCLD RAN_Adapter_part_7.so CCLD RAN_Emulation_part_1.so CCLD RAN_Emulation_part_2.so CCLD RAN_Emulation_part_3.so CCLD RAN_Emulation_part_4.so CCLD RAN_Emulation_part_5.so CCLD RAN_Emulation_part_6.so CCLD RAN_Emulation_part_7.so CCLD SCCP_Adapter_part_1.so CCLD SCCP_Adapter_part_2.so CCLD SCCP_Adapter_part_3.so CCLD SCCP_Adapter_part_4.so CCLD SCCP_Adapter_part_5.so CCLD SCCP_Adapter_part_6.so CCLD SCCP_Adapter_part_7.so CCLD SCCP_Mapping_part_2.so CCLD SCCP_Mapping_part_1.so CCLD SCCP_Mapping_part_3.so CCLD SCCP_Mapping_part_4.so CCLD SCCP_Mapping_part_5.so CCLD SCCP_Mapping_part_6.so CCLD SCCP_Mapping_part_7.so CCLD StatsD_Checker_part_1.so CCLD StatsD_Checker_part_2.so CCLD StatsD_Checker_part_3.so CCLD StatsD_Checker_part_4.so CCLD StatsD_Checker_part_5.so CCLD StatsD_Checker_part_6.so CCLD StatsD_Checker_part_7.so CCLD SDP_parse_.tab.so CCLD lex.SDP_parse_.so CCLD CBSP_CodecPort_CtrlFunctdef.so CCLD IPA_CodecPort_CtrlFunctDef.so CCLD IPL4asp_PT.so CCLD IPL4asp_discovery.so CCLD IuUP_EncDec.so CCLD MGCP_CodecPort_CtrlFunctDef.so CCLD Native_FunctionDefs.so CCLD RTP_CodecPort_CtrlFunctDef.so CCLD RTP_EncDec.so CCLD SCTPasp_PT.so CCLD SDP_EncDec.so CCLD StatsD_CodecPort_CtrlFunctdef.so CCLD TCCConversion.so CCLD TCCInterface.so CCLD TELNETasp_PT.so CCLD BSC_Tests make[1]: Leaving directory '<
https://jenkins.osmocom.org/jenkins/job/ttcn3-bsc-test-vamos-asan/ws/_cache…
'> [1;34m[testenv][vamos] Stopping podman container (restart)[0m [0;94m[testenv][vamos] + ['podman', 'kill', 'testenv-bsc-vamos-osmocom-nightly-asan-20260821-1603-1f7544c7-0'][0m testenv-bsc-vamos-osmocom-nightly-asan-20260821-1603-1f7544c7-0 [0;94m[testenv][vamos] + ['podman', 'run', '--rm', '--name', 'testenv-bsc-vamos-osmocom-nightly-asan-20260821-1603-1f7544c7-1', '--log-driver', 'json-file', '--log-opt', 'path=<
https://jenkins.osmocom.org/jenkins/job/ttcn3-bsc-test-vamos-asan/416/artif…
',> '--security-opt=seccomp=<
https://jenkins.osmocom.org/jenkins/job/ttcn3-bsc-test-vamos-asan/ws/_teste…
',> '--cap-add=NET_ADMIN', '--cap-add=NET_RAW', '--cap-add=SYS_ADMIN', '--device=/dev/net/tun', '--volume', '<
https://jenkins.osmocom.org/jenkins/job/ttcn3-bsc-test-vamos-asan/ws/_cache…
>:/var/cache/apt', '--volume', '<
https://jenkins.osmocom.org/jenkins/job/ttcn3-bsc-test-vamos-asan/ws/_cache…
>:/var/lib/apt', '--sysctl', 'net.ipv4.conf.all.send_redirects=0', '--sysctl', 'net.ipv4.conf.default.send_redirects=0', '-e', 'PODMAN=1', '-e', 'HOST_USER=osmocom-build', '-e', 'TESTENV_BINARY_REPO=1', '--volume', '<
https://jenkins.osmocom.org/jenkins/job/ttcn3-bsc-test-vamos-asan/ws/logs
>:<
https://jenkins.osmocom.org/jenkins/job/ttcn3-bsc-test-vamos-asan/ws/logs
',> '--volume', '<
https://jenkins.osmocom.org/jenkins/job/ttcn3-bsc-test-vamos-asan/ws/_cache
>:<
https://jenkins.osmocom.org/jenkins/job/ttcn3-bsc-test-vamos-asan/ws/_cache
',> '--volume', '/home/osmocom-build/ccache/testenv:/home/osmocom-build/ccache/testenv', '--volume', '/home/osmocom-build/jenkins/workspace:/home/osmocom-build/jenkins/workspace', 'debian-trixie-osmo-ttcn3-testenv', '<
https://jenkins.osmocom.org/jenkins/job/ttcn3-bsc-test-vamos-asan/ws/_teste…
'][0m> [0;94m[testenv][vamos] + ['podman', 'exec', '-e', 'CCACHE_DIR=/home/osmocom-build/ccache/testenv', '-e', 'TESTENV_CACHE_DIR=<
https://jenkins.osmocom.org/jenkins/job/ttcn3-bsc-test-vamos-asan/ws/_cache
',> '-e', 'TESTENV_SRC_DIR=/home/osmocom-build/jenkins/workspace', '-e', 'TESTENV_INSTALL_DIR=/', '-e', 'TERM=dumb', '-e', 'PATH=<
https://jenkins.osmocom.org/jenkins/job/ttcn3-bsc-test-vamos-asan/ws/_teste…
>:<
https://jenkins.osmocom.org/jenkins/job/ttcn3-bsc-test-vamos-asan/ws/_teste…
>:<
https://jenkins.osmocom.org/jenkins/job/ttcn3-bsc-test-vamos-asan/ws/bsc
>:/usr/local/bin:/usr/sbin:/usr/bin:/sbin:/bin', '-e', 'HOME=/home/osmocom-build', '-e', 'PYTHONUNBUFFERED=1', '-t', 'testenv-bsc-vamos-osmocom-nightly-asan-20260821-1603-1f7544c7-1', 'rm', '/etc/apt/apt.conf.d/docker-clean'][0m Running testenv-podman-main.sh [0;94m[testenv][vamos] + ['podman', 'exec', '-e', 'CCACHE_DIR=/home/osmocom-build/ccache/testenv', '-e', 'TESTENV_CACHE_DIR=<
https://jenkins.osmocom.org/jenkins/job/ttcn3-bsc-test-vamos-asan/ws/_cache
',> '-e', 'TESTENV_SRC_DIR=/home/osmocom-build/jenkins/workspace', '-e', 'TESTENV_INSTALL_DIR=/', '-e', 'TERM=dumb', '-e', 'PATH=<
https://jenkins.osmocom.org/jenkins/job/ttcn3-bsc-test-vamos-asan/ws/_teste…
>:<
https://jenkins.osmocom.org/jenkins/job/ttcn3-bsc-test-vamos-asan/ws/_teste…
>:<
https://jenkins.osmocom.org/jenkins/job/ttcn3-bsc-test-vamos-asan/ws/bsc
>:/usr/local/bin:/usr/sbin:/usr/bin:/sbin:/bin', '-e', 'HOME=/home/osmocom-build', '-e', 'PYTHONUNBUFFERED=1', '-t', 'testenv-bsc-vamos-osmocom-nightly-asan-20260821-1603-1f7544c7-1', 'sh', '-c', "echo 'deb [signed-by=/obs.key]
https://downloads.osmocom.org/packages/osmocom:/nightly:/asan/Debian_13/
./' > /etc/apt/sources.list.d/osmocom.list"][0m [0;94m[testenv][vamos] + ['podman', 'exec', '-e', 'CCACHE_DIR=/home/osmocom-build/ccache/testenv', '-e', 'TESTENV_CACHE_DIR=<
https://jenkins.osmocom.org/jenkins/job/ttcn3-bsc-test-vamos-asan/ws/_cache
',> '-e', 'TESTENV_SRC_DIR=/home/osmocom-build/jenkins/workspace', '-e', 'TESTENV_INSTALL_DIR=/', '-e', 'TERM=dumb', '-e', 'PATH=<
https://jenkins.osmocom.org/jenkins/job/ttcn3-bsc-test-vamos-asan/ws/_teste…
>:<
https://jenkins.osmocom.org/jenkins/job/ttcn3-bsc-test-vamos-asan/ws/_teste…
>:<
https://jenkins.osmocom.org/jenkins/job/ttcn3-bsc-test-vamos-asan/ws/bsc
>:/usr/local/bin:/usr/sbin:/usr/bin:/sbin:/bin', '-e', 'HOME=/home/osmocom-build', '-e', 'PYTHONUNBUFFERED=1', '-t', 'testenv-bsc-vamos-osmocom-nightly-asan-20260821-1603-1f7544c7-1', 'sh', '-c', 'echo \'Package: *\nPin: origin "
downloads.osmocom.org
"\nPin-Priority: 1100\n\' > /etc/apt/preferences.d/osmocom-apt-pin'][0m [0;94m[testenv][vamos] + ['podman', 'exec', '-e', 'CCACHE_DIR=/home/osmocom-build/ccache/testenv', '-e', 'TESTENV_CACHE_DIR=<
https://jenkins.osmocom.org/jenkins/job/ttcn3-bsc-test-vamos-asan/ws/_cache
',> '-e', 'TESTENV_SRC_DIR=/home/osmocom-build/jenkins/workspace', '-e', 'TESTENV_INSTALL_DIR=/', '-e', 'TERM=dumb', '-e', 'PATH=<
https://jenkins.osmocom.org/jenkins/job/ttcn3-bsc-test-vamos-asan/ws/_teste…
>:<
https://jenkins.osmocom.org/jenkins/job/ttcn3-bsc-test-vamos-asan/ws/_teste…
>:<
https://jenkins.osmocom.org/jenkins/job/ttcn3-bsc-test-vamos-asan/ws/bsc
>:/usr/local/bin:/usr/sbin:/usr/bin:/sbin:/bin', '-e', 'HOME=/home/osmocom-build', '-e', 'PYTHONUNBUFFERED=1', '-t', 'testenv-bsc-vamos-osmocom-nightly-asan-20260821-1603-1f7544c7-1', 'apt-get', '-q', 'update'][0m [0;94m[testenv] feed_watchdog_loop: podman container has stopped[0m Hit:1
http://deb.debian.org/debian
trixie InRelease Hit:2
http://deb.debian.org/debian
trixie-updates InRelease Hit:3
http://deb.debian.org/debian-security
trixie-security InRelease Get:4
https://downloads.osmocom.org/packages/osmocom:/nightly:/asan/Debian_13
./ InRelease [1611 B] Get:5
https://downloads.osmocom.org/packages/osmocom:/nightly:/asan/Debian_13
./ Packages [55.9 kB] Fetched 57.5 kB in 0s (346 kB/s) Reading package lists... [0;94m[testenv][vamos] + ['podman', 'exec', '-e', 'CCACHE_DIR=/home/osmocom-build/ccache/testenv', '-e', 'TESTENV_CACHE_DIR=<
https://jenkins.osmocom.org/jenkins/job/ttcn3-bsc-test-vamos-asan/ws/_cache
',> '-e', 'TESTENV_SRC_DIR=/home/osmocom-build/jenkins/workspace', '-e', 'TESTENV_INSTALL_DIR=/', '-e', 'TERM=dumb', '-e', 'PATH=<
https://jenkins.osmocom.org/jenkins/job/ttcn3-bsc-test-vamos-asan/ws/_teste…
>:<
https://jenkins.osmocom.org/jenkins/job/ttcn3-bsc-test-vamos-asan/ws/_teste…
>:<
https://jenkins.osmocom.org/jenkins/job/ttcn3-bsc-test-vamos-asan/ws/bsc
>:/usr/local/bin:/usr/sbin:/usr/bin:/sbin:/bin', '-e', 'HOME=/home/osmocom-build', '-e', 'PYTHONUNBUFFERED=1', '-t', 'testenv-bsc-vamos-osmocom-nightly-asan-20260821-1603-1f7544c7-1', 'sh', '-c', 'apt-cache pkgnames | grep -- -dbg > <
https://jenkins.osmocom.org/jenkins/job/ttcn3-bsc-test-vamos-asan/ws/_cache…
'][0m> [0;94m[testenv][vamos] + ['podman', 'exec', '-e', 'CCACHE_DIR=/home/osmocom-build/ccache/testenv', '-e', 'TESTENV_CACHE_DIR=<
https://jenkins.osmocom.org/jenkins/job/ttcn3-bsc-test-vamos-asan/ws/_cache
',> '-e', 'TESTENV_SRC_DIR=/home/osmocom-build/jenkins/workspace', '-e', 'TESTENV_INSTALL_DIR=/', '-e', 'TERM=dumb', '-e', 'PATH=<
https://jenkins.osmocom.org/jenkins/job/ttcn3-bsc-test-vamos-asan/ws/_teste…
>:<
https://jenkins.osmocom.org/jenkins/job/ttcn3-bsc-test-vamos-asan/ws/_teste…
>:<
https://jenkins.osmocom.org/jenkins/job/ttcn3-bsc-test-vamos-asan/ws/bsc
>:/usr/local/bin:/usr/sbin:/usr/bin:/sbin:/bin', '-e', 'HOME=/home/osmocom-build', '-e', 'PYTHONUNBUFFERED=1', '-t', 'testenv-bsc-vamos-osmocom-nightly-asan-20260821-1603-1f7544c7-1', 'apt-rdepends', 'osmo-stp'][0m [0;94m[testenv][vamos] osmo-stp -> osmo-stp: installing osmo-stp-dbg[0m [0;94m[testenv][vamos] osmo-stp -> libc6: installing libc6-dbg[0m [0;94m[testenv][vamos] osmo-stp -> libosmo-sigtran12: installing libosmo-sigtran-dbg[0m [0;94m[testenv][vamos] osmo-stp -> libosmo-asn1-tcap1: installing libosmo-asn1-tcap-dbg[0m [0;94m[testenv][vamos] osmo-stp -> libosmocore22: installing libosmocore-dbg[0m [0;94m[testenv][vamos] + ['podman', 'exec', '-e', 'CCACHE_DIR=/home/osmocom-build/ccache/testenv', '-e', 'TESTENV_CACHE_DIR=<
https://jenkins.osmocom.org/jenkins/job/ttcn3-bsc-test-vamos-asan/ws/_cache
',> '-e', 'TESTENV_SRC_DIR=/home/osmocom-build/jenkins/workspace', '-e', 'TESTENV_INSTALL_DIR=/', '-e', 'TERM=dumb', '-e', 'PATH=<
https://jenkins.osmocom.org/jenkins/job/ttcn3-bsc-test-vamos-asan/ws/_teste…
>:<
https://jenkins.osmocom.org/jenkins/job/ttcn3-bsc-test-vamos-asan/ws/_teste…
>:<
https://jenkins.osmocom.org/jenkins/job/ttcn3-bsc-test-vamos-asan/ws/bsc
>:/usr/local/bin:/usr/sbin:/usr/bin:/sbin:/bin', '-e', 'HOME=/home/osmocom-build', '-e', 'PYTHONUNBUFFERED=1', '-t', 'testenv-bsc-vamos-osmocom-nightly-asan-20260821-1603-1f7544c7-1', 'apt-rdepends', 'osmo-bts-virtual'][0m [0;94m[testenv][vamos] osmo-bts-virtual -> osmo-bts-virtual: installing osmo-bts-virtual-dbg[0m [0;94m[testenv][vamos] osmo-bts-virtual -> libc6: installing libc6-dbg[0m [0;94m[testenv][vamos] osmo-bts-virtual -> libosmocore22: installing libosmocore-dbg[0m [0;94m[testenv][vamos] + ['podman', 'exec', '-e', 'CCACHE_DIR=/home/osmocom-build/ccache/testenv', '-e', 'TESTENV_CACHE_DIR=<
https://jenkins.osmocom.org/jenkins/job/ttcn3-bsc-test-vamos-asan/ws/_cache
',> '-e', 'TESTENV_SRC_DIR=/home/osmocom-build/jenkins/workspace', '-e', 'TESTENV_INSTALL_DIR=/', '-e', 'TERM=dumb', '-e', 'PATH=<
https://jenkins.osmocom.org/jenkins/job/ttcn3-bsc-test-vamos-asan/ws/_teste…
>:<
https://jenkins.osmocom.org/jenkins/job/ttcn3-bsc-test-vamos-asan/ws/_teste…
>:<
https://jenkins.osmocom.org/jenkins/job/ttcn3-bsc-test-vamos-asan/ws/bsc
>:/usr/local/bin:/usr/sbin:/usr/bin:/sbin:/bin', '-e', 'HOME=/home/osmocom-build', '-e', 'PYTHONUNBUFFERED=1', '-t', 'testenv-bsc-vamos-osmocom-nightly-asan-20260821-1603-1f7544c7-1', 'apt-rdepends', 'osmo-bsc'][0m [0;94m[testenv][vamos] osmo-bsc -> osmo-bsc: installing osmo-bsc-dbg[0m [0;94m[testenv][vamos] osmo-bsc -> libc6: installing libc6-dbg[0m [0;94m[testenv][vamos] osmo-bsc -> libosmo-mgcp-client14: installing libosmo-mgcp-client14-dbgsym[0m [0;94m[testenv][vamos] osmo-bsc -> libosmocore22: installing libosmocore-dbg[0m [0;94m[testenv][vamos] osmo-bsc -> libosmo-sigtran12: installing libosmo-sigtran-dbg[0m [0;94m[testenv][vamos] osmo-bsc -> libosmo-asn1-tcap1: installing libosmo-asn1-tcap-dbg[0m [1;34m[testenv][vamos] Installing packages: osmo-stp, osmo-bts-virtual, osmo-bsc, osmo-stp-dbg, libc6-dbg, libosmo-sigtran-dbg, libosmo-asn1-tcap-dbg, libosmocore-dbg, osmo-bts-virtual-dbg, osmo-bsc-dbg, libosmo-mgcp-client14-dbgsym[0m [0;94m[testenv][vamos] + ['podman', 'exec', '-e', 'CCACHE_DIR=/home/osmocom-build/ccache/testenv', '-e', 'TESTENV_CACHE_DIR=<
https://jenkins.osmocom.org/jenkins/job/ttcn3-bsc-test-vamos-asan/ws/_cache
',> '-e', 'TESTENV_SRC_DIR=/home/osmocom-build/jenkins/workspace', '-e', 'TESTENV_INSTALL_DIR=/', '-e', 'TERM=dumb', '-e', 'PATH=<
https://jenkins.osmocom.org/jenkins/job/ttcn3-bsc-test-vamos-asan/ws/_teste…
>:<
https://jenkins.osmocom.org/jenkins/job/ttcn3-bsc-test-vamos-asan/ws/_teste…
>:<
https://jenkins.osmocom.org/jenkins/job/ttcn3-bsc-test-vamos-asan/ws/bsc
>:/usr/local/bin:/usr/sbin:/usr/bin:/sbin:/bin', '-e', 'HOME=/home/osmocom-build', '-e', 'PYTHONUNBUFFERED=1', '-t', 'testenv-bsc-vamos-osmocom-nightly-asan-20260821-1603-1f7544c7-1', 'apt-get', '-q', 'install', '-y', '--no-install-recommends', 'osmo-stp', 'osmo-bts-virtual', 'osmo-bsc', 'osmo-stp-dbg', 'libc6-dbg', 'libosmo-sigtran-dbg', 'libosmo-asn1-tcap-dbg', 'libosmocore-dbg', 'osmo-bts-virtual-dbg', 'osmo-bsc-dbg', 'libosmo-mgcp-client14-dbgsym'][0m Reading package lists... Building dependency tree... Solving dependencies... Some packages could not be installed. This may mean that you have requested an impossible situation or if you are using the unstable distribution that some required packages have not yet been created or been moved out of Incoming. The following information may help to resolve the situation: The following packages have unmet dependencies: libosmo-mgcp-client14 : Depends: osmocom-nightly-asan (= 202608192029) but 202608202029 is to be installed osmo-bsc : Depends: osmocom-nightly-asan (= 202608192029) but 202608202029 is to be installed osmo-bsc-dbg : Depends: osmocom-nightly-asan (= 202608192029) but 202608202029 is to be installed E: Unable to correct problems, you have held broken packages. E: The following information from --solver 3.0 may provide additional context: Unable to satisfy dependencies. Reached two conflicting decisions: 1. osmo-bsc:amd64=1.14.0.40.779dd6.202608192029~asan is selected for install 2. osmo-bsc:amd64=1.14.0.40.779dd6.202608192029~asan Depends osmocom-nightly-asan (= 202608192029) but none of the choices are installable: [no choices] [1;91m[testenv][vamos] Command failed unexpectedly[0m [0;94m[testenv][vamos] Command: ['podman', 'exec', '-e', 'CCACHE_DIR=/home/osmocom-build/ccache/testenv', '-e', 'TESTENV_CACHE_DIR=<
https://jenkins.osmocom.org/jenkins/job/ttcn3-bsc-test-vamos-asan/ws/_cache
',> '-e', 'TESTENV_SRC_DIR=/home/osmocom-build/jenkins/workspace', '-e', 'TESTENV_INSTALL_DIR=/', '-e', 'TERM=dumb', '-e', 'PATH=<
https://jenkins.osmocom.org/jenkins/job/ttcn3-bsc-test-vamos-asan/ws/_teste…
>:<
https://jenkins.osmocom.org/jenkins/job/ttcn3-bsc-test-vamos-asan/ws/_teste…
>:<
https://jenkins.osmocom.org/jenkins/job/ttcn3-bsc-test-vamos-asan/ws/bsc
>:/usr/local/bin:/usr/sbin:/usr/bin:/sbin:/bin', '-e', 'HOME=/home/osmocom-build', '-e', 'PYTHONUNBUFFERED=1', '-t', 'testenv-bsc-vamos-osmocom-nightly-asan-20260821-1603-1f7544c7-1', 'apt-get', '-q', 'install', '-y', '--no-install-recommends', 'osmo-stp', 'osmo-bts-virtual', 'osmo-bsc', 'osmo-stp-dbg', 'libc6-dbg', 'libosmo-sigtran-dbg', 'libosmo-asn1-tcap-dbg', 'libosmocore-dbg', 'osmo-bts-virtual-dbg', 'osmo-bsc-dbg', 'libosmo-mgcp-client14-dbgsym'][0m [0;94m[testenv][vamos] Returncode: 100[0m [1;34m[testenv][vamos] Stopping podman container[0m [0;94m[testenv][vamos] + ['podman', 'kill', 'testenv-bsc-vamos-osmocom-nightly-asan-20260821-1603-1f7544c7-1'][0m testenv-bsc-vamos-osmocom-nightly-asan-20260821-1603-1f7544c7-1 Traceback (most recent call last): File "<
https://jenkins.osmocom.org/jenkins/job/ttcn3-bsc-test-vamos-asan/ws/./test…
",> line 135, in <module> main() File "<
https://jenkins.osmocom.org/jenkins/job/ttcn3-bsc-test-vamos-asan/ws/./test…
",> line 124, in main run() File "<
https://jenkins.osmocom.org/jenkins/job/ttcn3-bsc-test-vamos-asan/ws/./test…
",> line 73, in run testenv.podman_install.packages(cfg, cfg_name) File "<
https://jenkins.osmocom.org/jenkins/job/ttcn3-bsc-test-vamos-asan/ws/_teste…
",> line 233, in packages apt_install(packages) File "<
https://jenkins.osmocom.org/jenkins/job/ttcn3-bsc-test-vamos-asan/ws/_teste…
",> line 99, in apt_install testenv.cmd.run(["apt-get", "-q", "install", "-y", "--no-install-recommends"] + pkgs) File "<
https://jenkins.osmocom.org/jenkins/job/ttcn3-bsc-test-vamos-asan/ws/_teste…
",> line 127, in run return testenv.podman.exec_cmd(cmd, check=check, env=env, **kwargs) ^^^^^^^^^^^^^^^^^^^^^^^^^^^^^^^^^^^^^^^^^^^^^^^^^^^^^^^^^^^^ File "<
https://jenkins.osmocom.org/jenkins/job/ttcn3-bsc-test-vamos-asan/ws/_teste…
",> line 156, in exec_cmd return testenv.cmd.run( ^^^^^^^^^^^^^^^^ File "<
https://jenkins.osmocom.org/jenkins/job/ttcn3-bsc-test-vamos-asan/ws/_teste…
",> line 144, in run exit_error_cmd(p, "Command failed unexpectedly") File "<
https://jenkins.osmocom.org/jenkins/job/ttcn3-bsc-test-vamos-asan/ws/_teste…
",> line 88, in exit_error_cmd raise RuntimeError("shell command related error, find details right above this python trace") RuntimeError: shell command related error, find details right above this python trace [0;94m[testenv][vamos] feed_watchdog_loop: podman container has stopped[0m [1;34m[testenv][vamos] Logs saved to:
https://jenkins.osmocom.org/jenkins/job/ttcn3-bsc-test-vamos-asan/416/artif…
[0m + RC=1 + [ 1 = 0 ] + uptime + grep --color=always -o load.* [01;31m[Kload average: 3.63, 1.18, 2.04[m[K + exit 1 Build step 'Execute shell' marked build as failure Recording test results ERROR: Step ‘Publish JUnit test result report’ failed: No test report files were found. Configuration error?
1
1
0
0
Build failed in Jenkins: ttcn3-bsc-test #3322
by jenkins@lists.osmocom.org
22 Aug '26
22 Aug '26
See <
https://jenkins.osmocom.org/jenkins/job/ttcn3-bsc-test/3322/display/redirec…
> Changes: [Pau Espin Pedrol] sgsn: Fail in obvious way when unexpected ServiceAccept is received [Oliver Smith] testenv: subprocess.run with explicit check=False [Oliver Smith] smdpp/generate_all_test_certificates: use f-string [Oliver Smith] testenv: remove *args from various functions [Oliver Smith] testenv: various small syntax tweaks ------------------------------------------ [...truncated 108.30 KiB...] CCLD SCCP_Types_part_6.so CCLD SCCP_Types_part_7.so CCLD SCCPasp_Types_part_1.so CCLD SCCPasp_Types_part_2.so CCLD SCCPasp_Types_part_3.so CCLD SCCPasp_Types_part_4.so CCLD SCCPasp_Types_part_5.so CCLD SCCPasp_Types_part_6.so CCLD SCCPasp_Types_part_7.so CCLD SCTPasp_PortType_part_1.so CCLD SCTPasp_PortType_part_2.so CCLD SCTPasp_PortType_part_3.so CCLD SCTPasp_PortType_part_5.so CCLD SCTPasp_PortType_part_4.so CCLD SCTPasp_PortType_part_6.so CCLD SCTPasp_PortType_part_7.so CCLD SCTPasp_Types_part_1.so CCLD SCTPasp_Types_part_2.so CCLD SCTPasp_Types_part_3.so CCLD SCTPasp_Types_part_4.so CCLD SCTPasp_Types_part_5.so CCLD SCTPasp_Types_part_6.so CCLD SCTPasp_Types_part_7.so CCLD SDP_Templates_part_1.so CCLD SDP_Templates_part_2.so CCLD SDP_Templates_part_3.so CCLD SDP_Templates_part_4.so CCLD SDP_Templates_part_5.so CCLD SDP_Templates_part_7.so CCLD SDP_Templates_part_6.so CCLD SDP_Types_part_1.so CCLD SDP_Types_part_2.so CCLD SDP_Types_part_3.so CCLD SDP_Types_part_5.so CCLD SDP_Types_part_4.so CCLD SDP_Types_part_6.so CCLD SDP_Types_part_7.so CCLD Socket_API_Definitions_part_1.so CCLD Socket_API_Definitions_part_2.so CCLD Socket_API_Definitions_part_3.so CCLD Socket_API_Definitions_part_4.so CCLD Socket_API_Definitions_part_5.so CCLD Socket_API_Definitions_part_7.so CCLD StatsD_CodecPort_part_1.so CCLD StatsD_CodecPort_part_2.so CCLD StatsD_CodecPort_part_3.so CCLD StatsD_CodecPort_part_4.so CCLD StatsD_CodecPort_part_5.so CCLD StatsD_CodecPort_part_6.so CCLD Socket_API_Definitions_part_6.so CCLD StatsD_CodecPort_part_7.so CCLD StatsD_CodecPort_CtrlFunct_part_1.so CCLD StatsD_CodecPort_CtrlFunct_part_2.so CCLD StatsD_CodecPort_CtrlFunct_part_3.so CCLD StatsD_CodecPort_CtrlFunct_part_4.so CCLD StatsD_CodecPort_CtrlFunct_part_5.so CCLD StatsD_CodecPort_CtrlFunct_part_6.so CCLD StatsD_CodecPort_CtrlFunct_part_7.so CCLD StatsD_Types_part_1.so CCLD StatsD_Types_part_2.so CCLD StatsD_Types_part_3.so CCLD StatsD_Types_part_4.so CCLD StatsD_Types_part_5.so CCLD StatsD_Types_part_6.so CCLD StatsD_Types_part_7.so CCLD TCCConversion_Functions_part_1.so CCLD TCCConversion_Functions_part_2.so CCLD TCCConversion_Functions_part_3.so CCLD TCCConversion_Functions_part_4.so CCLD TCCConversion_Functions_part_5.so CCLD TCCConversion_Functions_part_7.so CCLD TCCConversion_Functions_part_6.so CCLD TCCInterface_Functions_part_1.so CCLD TCCInterface_Functions_part_2.so CCLD TCCInterface_Functions_part_3.so CCLD TCCInterface_Functions_part_4.so CCLD TCCInterface_Functions_part_5.so CCLD TCCInterface_Functions_part_6.so CCLD TCCInterface_Functions_part_7.so CCLD TELNETasp_PortType_part_1.so CCLD TELNETasp_PortType_part_2.so CCLD TELNETasp_PortType_part_3.so CCLD TELNETasp_PortType_part_4.so CCLD TELNETasp_PortType_part_5.so CCLD TELNETasp_PortType_part_6.so CCLD TELNETasp_PortType_part_7.so CCLD IPA_Emulation.so CCLD RAN_Adapter.so CCLD RAN_Emulation.so CCLD SCCP_Adapter.so CCLD SCCP_Mapping.so CCLD StatsD_Checker.so CCLD IPA_Emulation_part_1.so CCLD IPA_Emulation_part_2.so CCLD IPA_Emulation_part_3.so CCLD IPA_Emulation_part_4.so CCLD IPA_Emulation_part_5.so CCLD IPA_Emulation_part_7.so CCLD IPA_Emulation_part_6.so CCLD RAN_Adapter_part_1.so CCLD RAN_Adapter_part_3.so CCLD RAN_Adapter_part_2.so CCLD RAN_Adapter_part_4.so CCLD RAN_Adapter_part_5.so CCLD RAN_Adapter_part_6.so CCLD RAN_Adapter_part_7.so CCLD RAN_Emulation_part_1.so CCLD RAN_Emulation_part_2.so CCLD RAN_Emulation_part_4.so CCLD RAN_Emulation_part_3.so CCLD RAN_Emulation_part_5.so CCLD RAN_Emulation_part_6.so CCLD RAN_Emulation_part_7.so CCLD SCCP_Adapter_part_1.so CCLD SCCP_Adapter_part_2.so CCLD SCCP_Adapter_part_3.so CCLD SCCP_Adapter_part_4.so CCLD SCCP_Adapter_part_5.so CCLD SCCP_Adapter_part_6.so CCLD SCCP_Adapter_part_7.so CCLD SCCP_Mapping_part_1.so CCLD SCCP_Mapping_part_2.so CCLD SCCP_Mapping_part_3.so CCLD SCCP_Mapping_part_4.so CCLD SCCP_Mapping_part_5.so CCLD SCCP_Mapping_part_6.so CCLD SCCP_Mapping_part_7.so CCLD StatsD_Checker_part_1.so CCLD StatsD_Checker_part_2.so CCLD StatsD_Checker_part_3.so CCLD StatsD_Checker_part_4.so CCLD StatsD_Checker_part_6.so CCLD StatsD_Checker_part_5.so CCLD StatsD_Checker_part_7.so CCLD SDP_parse_.tab.so CCLD lex.SDP_parse_.so CCLD CBSP_CodecPort_CtrlFunctdef.so CCLD IPA_CodecPort_CtrlFunctDef.so CCLD IPL4asp_PT.so CCLD IPL4asp_discovery.so CCLD IuUP_EncDec.so CCLD MGCP_CodecPort_CtrlFunctDef.so CCLD Native_FunctionDefs.so CCLD RTP_CodecPort_CtrlFunctDef.so CCLD RTP_EncDec.so CCLD SCTPasp_PT.so CCLD SDP_EncDec.so CCLD StatsD_CodecPort_CtrlFunctdef.so CCLD TCCConversion.so CCLD TCCInterface.so CCLD TELNETasp_PT.so CCLD BSC_Tests make[1]: Leaving directory '<
https://jenkins.osmocom.org/jenkins/job/ttcn3-bsc-test/ws/_cache/podman/tit…
'> [1;34m[testenv][generic] Stopping podman container (restart)[0m [0;94m[testenv][generic] + ['podman', 'kill', 'testenv-bsc-generic-osmocom-nightly-20260821-0841-3362fb9b-0'][0m testenv-bsc-generic-osmocom-nightly-20260821-0841-3362fb9b-0 [0;94m[testenv][generic] + ['podman', 'run', '--rm', '--name', 'testenv-bsc-generic-osmocom-nightly-20260821-0841-3362fb9b-1', '--log-driver', 'json-file', '--log-opt', 'path=<
https://jenkins.osmocom.org/jenkins/job/ttcn3-bsc-test/3322/artifact/logs/p…
',> '--security-opt=seccomp=<
https://jenkins.osmocom.org/jenkins/job/ttcn3-bsc-test/ws/_testenv/data/pod…
',> '--cap-add=NET_ADMIN', '--cap-add=NET_RAW', '--cap-add=SYS_ADMIN', '--device=/dev/net/tun', '--volume', '<
https://jenkins.osmocom.org/jenkins/job/ttcn3-bsc-test/ws/_cache/podman/var…
>:/var/cache/apt', '--volume', '<
https://jenkins.osmocom.org/jenkins/job/ttcn3-bsc-test/ws/_cache/podman/var…
>:/var/lib/apt', '--sysctl', 'net.ipv4.conf.all.send_redirects=0', '--sysctl', 'net.ipv4.conf.default.send_redirects=0', '-e', 'PODMAN=1', '-e', 'HOST_USER=osmocom-build', '-e', 'TESTENV_BINARY_REPO=1', '--volume', '<
https://jenkins.osmocom.org/jenkins/job/ttcn3-bsc-test/ws/logs
>:<
https://jenkins.osmocom.org/jenkins/job/ttcn3-bsc-test/ws/logs
',> '--volume', '<
https://jenkins.osmocom.org/jenkins/job/ttcn3-bsc-test/ws/_cache
>:<
https://jenkins.osmocom.org/jenkins/job/ttcn3-bsc-test/ws/_cache
',> '--volume', '/home/osmocom-build/ccache/testenv:/home/osmocom-build/ccache/testenv', '--volume', '/home/osmocom-build/jenkins/workspace:/home/osmocom-build/jenkins/workspace', 'debian-trixie-osmo-ttcn3-testenv', '<
https://jenkins.osmocom.org/jenkins/job/ttcn3-bsc-test/ws/_testenv/data/scr…
'][0m> Running testenv-podman-main.sh [0;94m[testenv] feed_watchdog_loop: podman container has stopped[0m [0;94m[testenv][generic] + ['podman', 'exec', '-e', 'CCACHE_DIR=/home/osmocom-build/ccache/testenv', '-e', 'TESTENV_CACHE_DIR=<
https://jenkins.osmocom.org/jenkins/job/ttcn3-bsc-test/ws/_cache
',> '-e', 'TESTENV_SRC_DIR=/home/osmocom-build/jenkins/workspace', '-e', 'TESTENV_INSTALL_DIR=/', '-e', 'TERM=dumb', '-e', 'PATH=<
https://jenkins.osmocom.org/jenkins/job/ttcn3-bsc-test/ws/_testenv/data/scr…
>:<
https://jenkins.osmocom.org/jenkins/job/ttcn3-bsc-test/ws/_testenv/data/scr…
>:<
https://jenkins.osmocom.org/jenkins/job/ttcn3-bsc-test/ws/bsc
>:/usr/local/bin:/usr/sbin:/usr/bin:/sbin:/bin', '-e', 'HOME=/home/osmocom-build', '-e', 'PYTHONUNBUFFERED=1', '-t', 'testenv-bsc-generic-osmocom-nightly-20260821-0841-3362fb9b-1', 'rm', '/etc/apt/apt.conf.d/docker-clean'][0m [0;94m[testenv][generic] + ['podman', 'exec', '-e', 'CCACHE_DIR=/home/osmocom-build/ccache/testenv', '-e', 'TESTENV_CACHE_DIR=<
https://jenkins.osmocom.org/jenkins/job/ttcn3-bsc-test/ws/_cache
',> '-e', 'TESTENV_SRC_DIR=/home/osmocom-build/jenkins/workspace', '-e', 'TESTENV_INSTALL_DIR=/', '-e', 'TERM=dumb', '-e', 'PATH=<
https://jenkins.osmocom.org/jenkins/job/ttcn3-bsc-test/ws/_testenv/data/scr…
>:<
https://jenkins.osmocom.org/jenkins/job/ttcn3-bsc-test/ws/_testenv/data/scr…
>:<
https://jenkins.osmocom.org/jenkins/job/ttcn3-bsc-test/ws/bsc
>:/usr/local/bin:/usr/sbin:/usr/bin:/sbin:/bin', '-e', 'HOME=/home/osmocom-build', '-e', 'PYTHONUNBUFFERED=1', '-t', 'testenv-bsc-generic-osmocom-nightly-20260821-0841-3362fb9b-1', 'sh', '-c', "echo 'deb [signed-by=/obs.key]
https://downloads.osmocom.org/packages/osmocom:/nightly/Debian_13/
./' > /etc/apt/sources.list.d/osmocom.list"][0m [0;94m[testenv][generic] + ['podman', 'exec', '-e', 'CCACHE_DIR=/home/osmocom-build/ccache/testenv', '-e', 'TESTENV_CACHE_DIR=<
https://jenkins.osmocom.org/jenkins/job/ttcn3-bsc-test/ws/_cache
',> '-e', 'TESTENV_SRC_DIR=/home/osmocom-build/jenkins/workspace', '-e', 'TESTENV_INSTALL_DIR=/', '-e', 'TERM=dumb', '-e', 'PATH=<
https://jenkins.osmocom.org/jenkins/job/ttcn3-bsc-test/ws/_testenv/data/scr…
>:<
https://jenkins.osmocom.org/jenkins/job/ttcn3-bsc-test/ws/_testenv/data/scr…
>:<
https://jenkins.osmocom.org/jenkins/job/ttcn3-bsc-test/ws/bsc
>:/usr/local/bin:/usr/sbin:/usr/bin:/sbin:/bin', '-e', 'HOME=/home/osmocom-build', '-e', 'PYTHONUNBUFFERED=1', '-t', 'testenv-bsc-generic-osmocom-nightly-20260821-0841-3362fb9b-1', 'sh', '-c', 'echo \'Package: *\nPin: origin "
downloads.osmocom.org
"\nPin-Priority: 1100\n\' > /etc/apt/preferences.d/osmocom-apt-pin'][0m [0;94m[testenv][generic] + ['podman', 'exec', '-e', 'CCACHE_DIR=/home/osmocom-build/ccache/testenv', '-e', 'TESTENV_CACHE_DIR=<
https://jenkins.osmocom.org/jenkins/job/ttcn3-bsc-test/ws/_cache
',> '-e', 'TESTENV_SRC_DIR=/home/osmocom-build/jenkins/workspace', '-e', 'TESTENV_INSTALL_DIR=/', '-e', 'TERM=dumb', '-e', 'PATH=<
https://jenkins.osmocom.org/jenkins/job/ttcn3-bsc-test/ws/_testenv/data/scr…
>:<
https://jenkins.osmocom.org/jenkins/job/ttcn3-bsc-test/ws/_testenv/data/scr…
>:<
https://jenkins.osmocom.org/jenkins/job/ttcn3-bsc-test/ws/bsc
>:/usr/local/bin:/usr/sbin:/usr/bin:/sbin:/bin', '-e', 'HOME=/home/osmocom-build', '-e', 'PYTHONUNBUFFERED=1', '-t', 'testenv-bsc-generic-osmocom-nightly-20260821-0841-3362fb9b-1', 'apt-get', '-q', 'update'][0m Hit:1
http://deb.debian.org/debian
trixie InRelease Hit:2
http://deb.debian.org/debian
trixie-updates InRelease Hit:3
http://deb.debian.org/debian-security
trixie-security InRelease Get:4
https://downloads.osmocom.org/packages/osmocom:/nightly/Debian_13
./ InRelease [1620 B] Get:5
https://downloads.osmocom.org/packages/osmocom:/nightly/Debian_13
./ Packages [200 kB] Fetched 201 kB in 0s (879 kB/s) Reading package lists... [0;94m[testenv][generic] + ['podman', 'exec', '-e', 'CCACHE_DIR=/home/osmocom-build/ccache/testenv', '-e', 'TESTENV_CACHE_DIR=<
https://jenkins.osmocom.org/jenkins/job/ttcn3-bsc-test/ws/_cache
',> '-e', 'TESTENV_SRC_DIR=/home/osmocom-build/jenkins/workspace', '-e', 'TESTENV_INSTALL_DIR=/', '-e', 'TERM=dumb', '-e', 'PATH=<
https://jenkins.osmocom.org/jenkins/job/ttcn3-bsc-test/ws/_testenv/data/scr…
>:<
https://jenkins.osmocom.org/jenkins/job/ttcn3-bsc-test/ws/_testenv/data/scr…
>:<
https://jenkins.osmocom.org/jenkins/job/ttcn3-bsc-test/ws/bsc
>:/usr/local/bin:/usr/sbin:/usr/bin:/sbin:/bin', '-e', 'HOME=/home/osmocom-build', '-e', 'PYTHONUNBUFFERED=1', '-t', 'testenv-bsc-generic-osmocom-nightly-20260821-0841-3362fb9b-1', 'sh', '-c', 'apt-cache pkgnames | grep -- -dbg > <
https://jenkins.osmocom.org/jenkins/job/ttcn3-bsc-test/ws/_cache/podman/dbg…
'][0m> [0;94m[testenv][generic] + ['podman', 'exec', '-e', 'CCACHE_DIR=/home/osmocom-build/ccache/testenv', '-e', 'TESTENV_CACHE_DIR=<
https://jenkins.osmocom.org/jenkins/job/ttcn3-bsc-test/ws/_cache
',> '-e', 'TESTENV_SRC_DIR=/home/osmocom-build/jenkins/workspace', '-e', 'TESTENV_INSTALL_DIR=/', '-e', 'TERM=dumb', '-e', 'PATH=<
https://jenkins.osmocom.org/jenkins/job/ttcn3-bsc-test/ws/_testenv/data/scr…
>:<
https://jenkins.osmocom.org/jenkins/job/ttcn3-bsc-test/ws/_testenv/data/scr…
>:<
https://jenkins.osmocom.org/jenkins/job/ttcn3-bsc-test/ws/bsc
>:/usr/local/bin:/usr/sbin:/usr/bin:/sbin:/bin', '-e', 'HOME=/home/osmocom-build', '-e', 'PYTHONUNBUFFERED=1', '-t', 'testenv-bsc-generic-osmocom-nightly-20260821-0841-3362fb9b-1', 'apt-rdepends', 'osmo-bsc'][0m [0;94m[testenv][generic] osmo-bsc -> osmo-bsc: installing osmo-bsc-dbg[0m [0;94m[testenv][generic] osmo-bsc -> libc6: installing libc6-dbg[0m [0;94m[testenv][generic] osmo-bsc -> libosmo-mgcp-client14: installing libosmo-mgcp-client14-dbgsym[0m [0;94m[testenv][generic] osmo-bsc -> libosmocore22: installing libosmocore-dbg[0m [0;94m[testenv][generic] osmo-bsc -> libosmo-sigtran12: installing libosmo-sigtran-dbg[0m [0;94m[testenv][generic] osmo-bsc -> libosmo-asn1-tcap1: installing libosmo-asn1-tcap-dbg[0m [0;94m[testenv][generic] + ['podman', 'exec', '-e', 'CCACHE_DIR=/home/osmocom-build/ccache/testenv', '-e', 'TESTENV_CACHE_DIR=<
https://jenkins.osmocom.org/jenkins/job/ttcn3-bsc-test/ws/_cache
',> '-e', 'TESTENV_SRC_DIR=/home/osmocom-build/jenkins/workspace', '-e', 'TESTENV_INSTALL_DIR=/', '-e', 'TERM=dumb', '-e', 'PATH=<
https://jenkins.osmocom.org/jenkins/job/ttcn3-bsc-test/ws/_testenv/data/scr…
>:<
https://jenkins.osmocom.org/jenkins/job/ttcn3-bsc-test/ws/_testenv/data/scr…
>:<
https://jenkins.osmocom.org/jenkins/job/ttcn3-bsc-test/ws/bsc
>:/usr/local/bin:/usr/sbin:/usr/bin:/sbin:/bin', '-e', 'HOME=/home/osmocom-build', '-e', 'PYTHONUNBUFFERED=1', '-t', 'testenv-bsc-generic-osmocom-nightly-20260821-0841-3362fb9b-1', 'apt-rdepends', 'osmo-bts-virtual'][0m [0;94m[testenv][generic] osmo-bts-virtual -> osmo-bts-virtual: installing osmo-bts-virtual-dbg[0m [0;94m[testenv][generic] osmo-bts-virtual -> libc6: installing libc6-dbg[0m [0;94m[testenv][generic] osmo-bts-virtual -> libosmocore22: installing libosmocore-dbg[0m [0;94m[testenv][generic] + ['podman', 'exec', '-e', 'CCACHE_DIR=/home/osmocom-build/ccache/testenv', '-e', 'TESTENV_CACHE_DIR=<
https://jenkins.osmocom.org/jenkins/job/ttcn3-bsc-test/ws/_cache
',> '-e', 'TESTENV_SRC_DIR=/home/osmocom-build/jenkins/workspace', '-e', 'TESTENV_INSTALL_DIR=/', '-e', 'TERM=dumb', '-e', 'PATH=<
https://jenkins.osmocom.org/jenkins/job/ttcn3-bsc-test/ws/_testenv/data/scr…
>:<
https://jenkins.osmocom.org/jenkins/job/ttcn3-bsc-test/ws/_testenv/data/scr…
>:<
https://jenkins.osmocom.org/jenkins/job/ttcn3-bsc-test/ws/bsc
>:/usr/local/bin:/usr/sbin:/usr/bin:/sbin:/bin', '-e', 'HOME=/home/osmocom-build', '-e', 'PYTHONUNBUFFERED=1', '-t', 'testenv-bsc-generic-osmocom-nightly-20260821-0841-3362fb9b-1', 'apt-rdepends', 'osmo-stp'][0m [0;94m[testenv][generic] osmo-stp -> osmo-stp: installing osmo-stp-dbg[0m [0;94m[testenv][generic] osmo-stp -> libc6: installing libc6-dbg[0m [0;94m[testenv][generic] osmo-stp -> libosmo-sigtran12: installing libosmo-sigtran-dbg[0m [0;94m[testenv][generic] osmo-stp -> libosmo-asn1-tcap1: installing libosmo-asn1-tcap-dbg[0m [0;94m[testenv][generic] osmo-stp -> libosmocore22: installing libosmocore-dbg[0m [1;34m[testenv][generic] Installing packages: osmo-bsc, osmo-bts-virtual, osmo-stp, osmo-bsc-dbg, libc6-dbg, libosmo-mgcp-client14-dbgsym, libosmocore-dbg, libosmo-sigtran-dbg, libosmo-asn1-tcap-dbg, osmo-bts-virtual-dbg, osmo-stp-dbg[0m [0;94m[testenv][generic] + ['podman', 'exec', '-e', 'CCACHE_DIR=/home/osmocom-build/ccache/testenv', '-e', 'TESTENV_CACHE_DIR=<
https://jenkins.osmocom.org/jenkins/job/ttcn3-bsc-test/ws/_cache
',> '-e', 'TESTENV_SRC_DIR=/home/osmocom-build/jenkins/workspace', '-e', 'TESTENV_INSTALL_DIR=/', '-e', 'TERM=dumb', '-e', 'PATH=<
https://jenkins.osmocom.org/jenkins/job/ttcn3-bsc-test/ws/_testenv/data/scr…
>:<
https://jenkins.osmocom.org/jenkins/job/ttcn3-bsc-test/ws/_testenv/data/scr…
>:<
https://jenkins.osmocom.org/jenkins/job/ttcn3-bsc-test/ws/bsc
>:/usr/local/bin:/usr/sbin:/usr/bin:/sbin:/bin', '-e', 'HOME=/home/osmocom-build', '-e', 'PYTHONUNBUFFERED=1', '-t', 'testenv-bsc-generic-osmocom-nightly-20260821-0841-3362fb9b-1', 'apt-get', '-q', 'install', '-y', '--no-install-recommends', 'osmo-bsc', 'osmo-bts-virtual', 'osmo-stp', 'osmo-bsc-dbg', 'libc6-dbg', 'libosmo-mgcp-client14-dbgsym', 'libosmocore-dbg', 'libosmo-sigtran-dbg', 'libosmo-asn1-tcap-dbg', 'osmo-bts-virtual-dbg', 'osmo-stp-dbg'][0m Reading package lists... Building dependency tree... Solving dependencies... Some packages could not be installed. This may mean that you have requested an impossible situation or if you are using the unstable distribution that some required packages have not yet been created or been moved out of Incoming. The following information may help to resolve the situation: The following packages have unmet dependencies: libosmo-mgcp-client14 : Depends: osmocom-nightly (= 202608191800) but 202608201800 is to be installed osmo-bsc : Depends: osmocom-nightly (= 202608191800) but 202608201800 is to be installed osmo-bsc-dbg : Depends: osmocom-nightly (= 202608191800) but 202608201800 is to be installed E: Unable to correct problems, you have held broken packages. E: The following information from --solver 3.0 may provide additional context: Unable to satisfy dependencies. Reached two conflicting decisions: 1. osmo-bsc:amd64=1.14.0.40.779dd6.202608191800 is selected for install 2. osmo-bsc:amd64=1.14.0.40.779dd6.202608191800 Depends osmocom-nightly (= 202608191800) but none of the choices are installable: [no choices] [1;91m[testenv][generic] Command failed unexpectedly[0m [0;94m[testenv][generic] Command: ['podman', 'exec', '-e', 'CCACHE_DIR=/home/osmocom-build/ccache/testenv', '-e', 'TESTENV_CACHE_DIR=<
https://jenkins.osmocom.org/jenkins/job/ttcn3-bsc-test/ws/_cache
',> '-e', 'TESTENV_SRC_DIR=/home/osmocom-build/jenkins/workspace', '-e', 'TESTENV_INSTALL_DIR=/', '-e', 'TERM=dumb', '-e', 'PATH=<
https://jenkins.osmocom.org/jenkins/job/ttcn3-bsc-test/ws/_testenv/data/scr…
>:<
https://jenkins.osmocom.org/jenkins/job/ttcn3-bsc-test/ws/_testenv/data/scr…
>:<
https://jenkins.osmocom.org/jenkins/job/ttcn3-bsc-test/ws/bsc
>:/usr/local/bin:/usr/sbin:/usr/bin:/sbin:/bin', '-e', 'HOME=/home/osmocom-build', '-e', 'PYTHONUNBUFFERED=1', '-t', 'testenv-bsc-generic-osmocom-nightly-20260821-0841-3362fb9b-1', 'apt-get', '-q', 'install', '-y', '--no-install-recommends', 'osmo-bsc', 'osmo-bts-virtual', 'osmo-stp', 'osmo-bsc-dbg', 'libc6-dbg', 'libosmo-mgcp-client14-dbgsym', 'libosmocore-dbg', 'libosmo-sigtran-dbg', 'libosmo-asn1-tcap-dbg', 'osmo-bts-virtual-dbg', 'osmo-stp-dbg'][0m [0;94m[testenv][generic] Returncode: 100[0m [1;34m[testenv][generic] Stopping podman container[0m [0;94m[testenv][generic] + ['podman', 'kill', 'testenv-bsc-generic-osmocom-nightly-20260821-0841-3362fb9b-1'][0m testenv-bsc-generic-osmocom-nightly-20260821-0841-3362fb9b-1 Traceback (most recent call last): File "<
https://jenkins.osmocom.org/jenkins/job/ttcn3-bsc-test/ws/./testenv.py
",> line 135, in <module> main() File "<
https://jenkins.osmocom.org/jenkins/job/ttcn3-bsc-test/ws/./testenv.py
",> line 124, in main run() File "<
https://jenkins.osmocom.org/jenkins/job/ttcn3-bsc-test/ws/./testenv.py
",> line 73, in run testenv.podman_install.packages(cfg, cfg_name) File "<
https://jenkins.osmocom.org/jenkins/job/ttcn3-bsc-test/ws/_testenv/testenv/…
",> line 233, in packages apt_install(packages) File "<
https://jenkins.osmocom.org/jenkins/job/ttcn3-bsc-test/ws/_testenv/testenv/…
",> line 99, in apt_install testenv.cmd.run(["apt-get", "-q", "install", "-y", "--no-install-recommends"] + pkgs) File "<
https://jenkins.osmocom.org/jenkins/job/ttcn3-bsc-test/ws/_testenv/testenv/…
",> line 127, in run return testenv.podman.exec_cmd(cmd, check=check, env=env, **kwargs) ^^^^^^^^^^^^^^^^^^^^^^^^^^^^^^^^^^^^^^^^^^^^^^^^^^^^^^^^^^^^ File "<
https://jenkins.osmocom.org/jenkins/job/ttcn3-bsc-test/ws/_testenv/testenv/…
",> line 156, in exec_cmd return testenv.cmd.run( ^^^^^^^^^^^^^^^^ File "<
https://jenkins.osmocom.org/jenkins/job/ttcn3-bsc-test/ws/_testenv/testenv/…
",> line 144, in run exit_error_cmd(p, "Command failed unexpectedly") File "<
https://jenkins.osmocom.org/jenkins/job/ttcn3-bsc-test/ws/_testenv/testenv/…
",> line 88, in exit_error_cmd raise RuntimeError("shell command related error, find details right above this python trace") RuntimeError: shell command related error, find details right above this python trace [0;94m[testenv][generic] feed_watchdog_loop: podman container has stopped[0m [1;34m[testenv][generic] Logs saved to:
https://jenkins.osmocom.org/jenkins/job/ttcn3-bsc-test/3322/artifact/logs/
[0m + RC=1 + [ 1 = 0 ] + uptime + grep --color=always -o load.* [01;31m[Kload average: 22.98, 16.57, 10.95[m[K + exit 1 Build step 'Execute shell' marked build as failure Recording test results ERROR: Step ‘Publish JUnit test result report’ failed: No test report files were found. Configuration error?
1
1
0
0
Build failed in Jenkins: ttcn3-bsc-test-sccplite #3052
by jenkins@lists.osmocom.org
22 Aug '26
22 Aug '26
See <
https://jenkins.osmocom.org/jenkins/job/ttcn3-bsc-test-sccplite/3052/displa…
> Changes: [Pau Espin Pedrol] sgsn: Fail in obvious way when unexpected ServiceAccept is received [Oliver Smith] testenv: subprocess.run with explicit check=False [Oliver Smith] smdpp/generate_all_test_certificates: use f-string [Oliver Smith] testenv: remove *args from various functions [Oliver Smith] testenv: various small syntax tweaks ------------------------------------------ [...truncated 108.59 KiB...] CCLD SCCP_Templates_part_7.so CCLD SCCP_Types_part_1.so CCLD SCCP_Types_part_2.so CCLD SCCP_Types_part_3.so CCLD SCCP_Types_part_4.so CCLD SCCP_Types_part_5.so CCLD SCCP_Types_part_6.so CCLD SCCP_Types_part_7.so CCLD SCCPasp_Types_part_1.so CCLD SCCPasp_Types_part_2.so CCLD SCCPasp_Types_part_3.so CCLD SCCPasp_Types_part_4.so CCLD SCCPasp_Types_part_5.so CCLD SCCPasp_Types_part_6.so CCLD SCCPasp_Types_part_7.so CCLD SCTPasp_PortType_part_1.so CCLD SCTPasp_PortType_part_2.so CCLD SCTPasp_PortType_part_3.so CCLD SCTPasp_PortType_part_4.so CCLD SCTPasp_PortType_part_5.so CCLD SCTPasp_PortType_part_6.so CCLD SCTPasp_PortType_part_7.so CCLD SCTPasp_Types_part_1.so CCLD SCTPasp_Types_part_2.so CCLD SCTPasp_Types_part_3.so CCLD SCTPasp_Types_part_4.so CCLD SCTPasp_Types_part_5.so CCLD SCTPasp_Types_part_6.so CCLD SCTPasp_Types_part_7.so CCLD SDP_Templates_part_1.so CCLD SDP_Templates_part_2.so CCLD SDP_Templates_part_3.so CCLD SDP_Templates_part_4.so CCLD SDP_Templates_part_5.so CCLD SDP_Templates_part_6.so CCLD SDP_Templates_part_7.so CCLD SDP_Types_part_1.so CCLD SDP_Types_part_2.so CCLD SDP_Types_part_3.so CCLD SDP_Types_part_4.so CCLD SDP_Types_part_5.so CCLD SDP_Types_part_6.so CCLD SDP_Types_part_7.so CCLD Socket_API_Definitions_part_1.so CCLD Socket_API_Definitions_part_2.so CCLD Socket_API_Definitions_part_3.so CCLD Socket_API_Definitions_part_4.so CCLD Socket_API_Definitions_part_5.so CCLD Socket_API_Definitions_part_6.so CCLD Socket_API_Definitions_part_7.so CCLD StatsD_CodecPort_part_1.so CCLD StatsD_CodecPort_part_2.so CCLD StatsD_CodecPort_part_3.so CCLD StatsD_CodecPort_part_4.so CCLD StatsD_CodecPort_part_5.so CCLD StatsD_CodecPort_part_6.so CCLD StatsD_CodecPort_part_7.so CCLD StatsD_CodecPort_CtrlFunct_part_1.so CCLD StatsD_CodecPort_CtrlFunct_part_2.so CCLD StatsD_CodecPort_CtrlFunct_part_3.so CCLD StatsD_CodecPort_CtrlFunct_part_4.so CCLD StatsD_CodecPort_CtrlFunct_part_5.so CCLD StatsD_CodecPort_CtrlFunct_part_6.so CCLD StatsD_CodecPort_CtrlFunct_part_7.so CCLD StatsD_Types_part_1.so CCLD StatsD_Types_part_2.so CCLD StatsD_Types_part_3.so CCLD StatsD_Types_part_4.so CCLD StatsD_Types_part_5.so CCLD StatsD_Types_part_6.so CCLD StatsD_Types_part_7.so CCLD TCCConversion_Functions_part_1.so CCLD TCCConversion_Functions_part_2.so CCLD TCCConversion_Functions_part_3.so CCLD TCCConversion_Functions_part_4.so CCLD TCCConversion_Functions_part_5.so CCLD TCCConversion_Functions_part_6.so CCLD TCCConversion_Functions_part_7.so CCLD TCCInterface_Functions_part_1.so CCLD TCCInterface_Functions_part_2.so CCLD TCCInterface_Functions_part_3.so CCLD TCCInterface_Functions_part_4.so CCLD TCCInterface_Functions_part_5.so CCLD TCCInterface_Functions_part_6.so CCLD TCCInterface_Functions_part_7.so CCLD TELNETasp_PortType_part_1.so CCLD TELNETasp_PortType_part_2.so CCLD TELNETasp_PortType_part_3.so CCLD TELNETasp_PortType_part_4.so CCLD TELNETasp_PortType_part_5.so CCLD TELNETasp_PortType_part_6.so CCLD TELNETasp_PortType_part_7.so CCLD IPA_Emulation.so CCLD RAN_Adapter.so CCLD RAN_Emulation.so CCLD SCCP_Adapter.so CCLD SCCP_Mapping.so CCLD StatsD_Checker.so CCLD IPA_Emulation_part_1.so CCLD IPA_Emulation_part_2.so CCLD IPA_Emulation_part_3.so CCLD IPA_Emulation_part_4.so CCLD IPA_Emulation_part_5.so CCLD IPA_Emulation_part_6.so CCLD IPA_Emulation_part_7.so CCLD RAN_Adapter_part_1.so CCLD RAN_Adapter_part_2.so CCLD RAN_Adapter_part_3.so CCLD RAN_Adapter_part_4.so CCLD RAN_Adapter_part_5.so CCLD RAN_Adapter_part_6.so CCLD RAN_Adapter_part_7.so CCLD RAN_Emulation_part_1.so CCLD RAN_Emulation_part_2.so CCLD RAN_Emulation_part_3.so CCLD RAN_Emulation_part_4.so CCLD RAN_Emulation_part_5.so CCLD RAN_Emulation_part_6.so CCLD RAN_Emulation_part_7.so CCLD SCCP_Adapter_part_1.so CCLD SCCP_Adapter_part_2.so CCLD SCCP_Adapter_part_3.so CCLD SCCP_Adapter_part_4.so CCLD SCCP_Adapter_part_5.so CCLD SCCP_Adapter_part_6.so CCLD SCCP_Adapter_part_7.so CCLD SCCP_Mapping_part_1.so CCLD SCCP_Mapping_part_2.so CCLD SCCP_Mapping_part_3.so CCLD SCCP_Mapping_part_4.so CCLD SCCP_Mapping_part_5.so CCLD SCCP_Mapping_part_6.so CCLD SCCP_Mapping_part_7.so CCLD StatsD_Checker_part_1.so CCLD StatsD_Checker_part_2.so CCLD StatsD_Checker_part_3.so CCLD StatsD_Checker_part_4.so CCLD StatsD_Checker_part_5.so CCLD StatsD_Checker_part_6.so CCLD StatsD_Checker_part_7.so CCLD SDP_parse_.tab.so CCLD lex.SDP_parse_.so CCLD CBSP_CodecPort_CtrlFunctdef.so CCLD IPA_CodecPort_CtrlFunctDef.so CCLD IPL4asp_PT.so CCLD IPL4asp_discovery.so CCLD IuUP_EncDec.so CCLD MGCP_CodecPort_CtrlFunctDef.so CCLD Native_FunctionDefs.so CCLD RTP_CodecPort_CtrlFunctDef.so CCLD RTP_EncDec.so CCLD SCTPasp_PT.so CCLD SDP_EncDec.so CCLD StatsD_CodecPort_CtrlFunctdef.so CCLD TCCConversion.so CCLD TCCInterface.so CCLD TELNETasp_PT.so CCLD BSC_Tests make[1]: Leaving directory '<
https://jenkins.osmocom.org/jenkins/job/ttcn3-bsc-test-sccplite/ws/_cache/p…
'> [1;34m[testenv][sccplite] Stopping podman container (restart)[0m [0;94m[testenv][sccplite] + ['podman', 'kill', 'testenv-bsc-sccplite-osmocom-nightly-20260821-0848-46eec8c8-0'][0m testenv-bsc-sccplite-osmocom-nightly-20260821-0848-46eec8c8-0 [0;94m[testenv][sccplite] + ['podman', 'run', '--rm', '--name', 'testenv-bsc-sccplite-osmocom-nightly-20260821-0848-46eec8c8-1', '--log-driver', 'json-file', '--log-opt', 'path=<
https://jenkins.osmocom.org/jenkins/job/ttcn3-bsc-test-sccplite/3052/artifa…
',> '--security-opt=seccomp=<
https://jenkins.osmocom.org/jenkins/job/ttcn3-bsc-test-sccplite/ws/_testenv…
',> '--cap-add=NET_ADMIN', '--cap-add=NET_RAW', '--cap-add=SYS_ADMIN', '--device=/dev/net/tun', '--volume', '<
https://jenkins.osmocom.org/jenkins/job/ttcn3-bsc-test-sccplite/ws/_cache/p…
>:/var/cache/apt', '--volume', '<
https://jenkins.osmocom.org/jenkins/job/ttcn3-bsc-test-sccplite/ws/_cache/p…
>:/var/lib/apt', '--sysctl', 'net.ipv4.conf.all.send_redirects=0', '--sysctl', 'net.ipv4.conf.default.send_redirects=0', '-e', 'PODMAN=1', '-e', 'HOST_USER=osmocom-build', '-e', 'TESTENV_BINARY_REPO=1', '--volume', '<
https://jenkins.osmocom.org/jenkins/job/ttcn3-bsc-test-sccplite/ws/logs
>:<
https://jenkins.osmocom.org/jenkins/job/ttcn3-bsc-test-sccplite/ws/logs
',> '--volume', '<
https://jenkins.osmocom.org/jenkins/job/ttcn3-bsc-test-sccplite/ws/_cache
>:<
https://jenkins.osmocom.org/jenkins/job/ttcn3-bsc-test-sccplite/ws/_cache
',> '--volume', '/home/osmocom-build/ccache/testenv:/home/osmocom-build/ccache/testenv', '--volume', '/home/osmocom-build/jenkins/workspace:/home/osmocom-build/jenkins/workspace', 'debian-trixie-osmo-ttcn3-testenv', '<
https://jenkins.osmocom.org/jenkins/job/ttcn3-bsc-test-sccplite/ws/_testenv…
'][0m> [0;94m[testenv] feed_watchdog_loop: podman container has stopped[0m Running testenv-podman-main.sh [0;94m[testenv][sccplite] + ['podman', 'exec', '-e', 'CCACHE_DIR=/home/osmocom-build/ccache/testenv', '-e', 'TESTENV_CACHE_DIR=<
https://jenkins.osmocom.org/jenkins/job/ttcn3-bsc-test-sccplite/ws/_cache
',> '-e', 'TESTENV_SRC_DIR=/home/osmocom-build/jenkins/workspace', '-e', 'TESTENV_INSTALL_DIR=/', '-e', 'TERM=dumb', '-e', 'PATH=<
https://jenkins.osmocom.org/jenkins/job/ttcn3-bsc-test-sccplite/ws/_testenv…
>:<
https://jenkins.osmocom.org/jenkins/job/ttcn3-bsc-test-sccplite/ws/_testenv…
>:<
https://jenkins.osmocom.org/jenkins/job/ttcn3-bsc-test-sccplite/ws/bsc
>:/usr/local/bin:/usr/sbin:/usr/bin:/sbin:/bin', '-e', 'HOME=/home/osmocom-build', '-e', 'PYTHONUNBUFFERED=1', '-t', 'testenv-bsc-sccplite-osmocom-nightly-20260821-0848-46eec8c8-1', 'rm', '/etc/apt/apt.conf.d/docker-clean'][0m [0;94m[testenv][sccplite] + ['podman', 'exec', '-e', 'CCACHE_DIR=/home/osmocom-build/ccache/testenv', '-e', 'TESTENV_CACHE_DIR=<
https://jenkins.osmocom.org/jenkins/job/ttcn3-bsc-test-sccplite/ws/_cache
',> '-e', 'TESTENV_SRC_DIR=/home/osmocom-build/jenkins/workspace', '-e', 'TESTENV_INSTALL_DIR=/', '-e', 'TERM=dumb', '-e', 'PATH=<
https://jenkins.osmocom.org/jenkins/job/ttcn3-bsc-test-sccplite/ws/_testenv…
>:<
https://jenkins.osmocom.org/jenkins/job/ttcn3-bsc-test-sccplite/ws/_testenv…
>:<
https://jenkins.osmocom.org/jenkins/job/ttcn3-bsc-test-sccplite/ws/bsc
>:/usr/local/bin:/usr/sbin:/usr/bin:/sbin:/bin', '-e', 'HOME=/home/osmocom-build', '-e', 'PYTHONUNBUFFERED=1', '-t', 'testenv-bsc-sccplite-osmocom-nightly-20260821-0848-46eec8c8-1', 'sh', '-c', "echo 'deb [signed-by=/obs.key]
https://downloads.osmocom.org/packages/osmocom:/nightly/Debian_13/
./' > /etc/apt/sources.list.d/osmocom.list"][0m [0;94m[testenv][sccplite] + ['podman', 'exec', '-e', 'CCACHE_DIR=/home/osmocom-build/ccache/testenv', '-e', 'TESTENV_CACHE_DIR=<
https://jenkins.osmocom.org/jenkins/job/ttcn3-bsc-test-sccplite/ws/_cache
',> '-e', 'TESTENV_SRC_DIR=/home/osmocom-build/jenkins/workspace', '-e', 'TESTENV_INSTALL_DIR=/', '-e', 'TERM=dumb', '-e', 'PATH=<
https://jenkins.osmocom.org/jenkins/job/ttcn3-bsc-test-sccplite/ws/_testenv…
>:<
https://jenkins.osmocom.org/jenkins/job/ttcn3-bsc-test-sccplite/ws/_testenv…
>:<
https://jenkins.osmocom.org/jenkins/job/ttcn3-bsc-test-sccplite/ws/bsc
>:/usr/local/bin:/usr/sbin:/usr/bin:/sbin:/bin', '-e', 'HOME=/home/osmocom-build', '-e', 'PYTHONUNBUFFERED=1', '-t', 'testenv-bsc-sccplite-osmocom-nightly-20260821-0848-46eec8c8-1', 'sh', '-c', 'echo \'Package: *\nPin: origin "
downloads.osmocom.org
"\nPin-Priority: 1100\n\' > /etc/apt/preferences.d/osmocom-apt-pin'][0m [0;94m[testenv][sccplite] + ['podman', 'exec', '-e', 'CCACHE_DIR=/home/osmocom-build/ccache/testenv', '-e', 'TESTENV_CACHE_DIR=<
https://jenkins.osmocom.org/jenkins/job/ttcn3-bsc-test-sccplite/ws/_cache
',> '-e', 'TESTENV_SRC_DIR=/home/osmocom-build/jenkins/workspace', '-e', 'TESTENV_INSTALL_DIR=/', '-e', 'TERM=dumb', '-e', 'PATH=<
https://jenkins.osmocom.org/jenkins/job/ttcn3-bsc-test-sccplite/ws/_testenv…
>:<
https://jenkins.osmocom.org/jenkins/job/ttcn3-bsc-test-sccplite/ws/_testenv…
>:<
https://jenkins.osmocom.org/jenkins/job/ttcn3-bsc-test-sccplite/ws/bsc
>:/usr/local/bin:/usr/sbin:/usr/bin:/sbin:/bin', '-e', 'HOME=/home/osmocom-build', '-e', 'PYTHONUNBUFFERED=1', '-t', 'testenv-bsc-sccplite-osmocom-nightly-20260821-0848-46eec8c8-1', 'apt-get', '-q', 'update'][0m Hit:1
http://deb.debian.org/debian
trixie InRelease Hit:2
http://deb.debian.org/debian
trixie-updates InRelease Get:3
https://downloads.osmocom.org/packages/osmocom:/nightly/Debian_13
./ InRelease [1620 B] Hit:4
http://deb.debian.org/debian-security
trixie-security InRelease Get:5
https://downloads.osmocom.org/packages/osmocom:/nightly/Debian_13
./ Packages [200 kB] Fetched 201 kB in 0s (1434 kB/s) Reading package lists... [0;94m[testenv][sccplite] + ['podman', 'exec', '-e', 'CCACHE_DIR=/home/osmocom-build/ccache/testenv', '-e', 'TESTENV_CACHE_DIR=<
https://jenkins.osmocom.org/jenkins/job/ttcn3-bsc-test-sccplite/ws/_cache
',> '-e', 'TESTENV_SRC_DIR=/home/osmocom-build/jenkins/workspace', '-e', 'TESTENV_INSTALL_DIR=/', '-e', 'TERM=dumb', '-e', 'PATH=<
https://jenkins.osmocom.org/jenkins/job/ttcn3-bsc-test-sccplite/ws/_testenv…
>:<
https://jenkins.osmocom.org/jenkins/job/ttcn3-bsc-test-sccplite/ws/_testenv…
>:<
https://jenkins.osmocom.org/jenkins/job/ttcn3-bsc-test-sccplite/ws/bsc
>:/usr/local/bin:/usr/sbin:/usr/bin:/sbin:/bin', '-e', 'HOME=/home/osmocom-build', '-e', 'PYTHONUNBUFFERED=1', '-t', 'testenv-bsc-sccplite-osmocom-nightly-20260821-0848-46eec8c8-1', 'sh', '-c', 'apt-cache pkgnames | grep -- -dbg > <
https://jenkins.osmocom.org/jenkins/job/ttcn3-bsc-test-sccplite/ws/_cache/p…
'][0m> [0;94m[testenv][sccplite] + ['podman', 'exec', '-e', 'CCACHE_DIR=/home/osmocom-build/ccache/testenv', '-e', 'TESTENV_CACHE_DIR=<
https://jenkins.osmocom.org/jenkins/job/ttcn3-bsc-test-sccplite/ws/_cache
',> '-e', 'TESTENV_SRC_DIR=/home/osmocom-build/jenkins/workspace', '-e', 'TESTENV_INSTALL_DIR=/', '-e', 'TERM=dumb', '-e', 'PATH=<
https://jenkins.osmocom.org/jenkins/job/ttcn3-bsc-test-sccplite/ws/_testenv…
>:<
https://jenkins.osmocom.org/jenkins/job/ttcn3-bsc-test-sccplite/ws/_testenv…
>:<
https://jenkins.osmocom.org/jenkins/job/ttcn3-bsc-test-sccplite/ws/bsc
>:/usr/local/bin:/usr/sbin:/usr/bin:/sbin:/bin', '-e', 'HOME=/home/osmocom-build', '-e', 'PYTHONUNBUFFERED=1', '-t', 'testenv-bsc-sccplite-osmocom-nightly-20260821-0848-46eec8c8-1', 'apt-rdepends', 'osmo-bts-virtual'][0m [0;94m[testenv][sccplite] osmo-bts-virtual -> osmo-bts-virtual: installing osmo-bts-virtual-dbg[0m [0;94m[testenv][sccplite] osmo-bts-virtual -> libc6: installing libc6-dbg[0m [0;94m[testenv][sccplite] osmo-bts-virtual -> libosmocore22: installing libosmocore-dbg[0m [0;94m[testenv][sccplite] + ['podman', 'exec', '-e', 'CCACHE_DIR=/home/osmocom-build/ccache/testenv', '-e', 'TESTENV_CACHE_DIR=<
https://jenkins.osmocom.org/jenkins/job/ttcn3-bsc-test-sccplite/ws/_cache
',> '-e', 'TESTENV_SRC_DIR=/home/osmocom-build/jenkins/workspace', '-e', 'TESTENV_INSTALL_DIR=/', '-e', 'TERM=dumb', '-e', 'PATH=<
https://jenkins.osmocom.org/jenkins/job/ttcn3-bsc-test-sccplite/ws/_testenv…
>:<
https://jenkins.osmocom.org/jenkins/job/ttcn3-bsc-test-sccplite/ws/_testenv…
>:<
https://jenkins.osmocom.org/jenkins/job/ttcn3-bsc-test-sccplite/ws/bsc
>:/usr/local/bin:/usr/sbin:/usr/bin:/sbin:/bin', '-e', 'HOME=/home/osmocom-build', '-e', 'PYTHONUNBUFFERED=1', '-t', 'testenv-bsc-sccplite-osmocom-nightly-20260821-0848-46eec8c8-1', 'apt-rdepends', 'osmo-bsc'][0m [0;94m[testenv][sccplite] osmo-bsc -> osmo-bsc: installing osmo-bsc-dbg[0m [0;94m[testenv][sccplite] osmo-bsc -> libc6: installing libc6-dbg[0m [0;94m[testenv][sccplite] osmo-bsc -> libosmo-mgcp-client14: installing libosmo-mgcp-client14-dbgsym[0m [0;94m[testenv][sccplite] osmo-bsc -> libosmocore22: installing libosmocore-dbg[0m [0;94m[testenv][sccplite] osmo-bsc -> libosmo-sigtran12: installing libosmo-sigtran-dbg[0m [0;94m[testenv][sccplite] osmo-bsc -> libosmo-asn1-tcap1: installing libosmo-asn1-tcap-dbg[0m [1;34m[testenv][sccplite] Installing packages: osmo-bts-virtual, osmo-bsc, osmo-bts-virtual-dbg, libc6-dbg, libosmocore-dbg, osmo-bsc-dbg, libosmo-mgcp-client14-dbgsym, libosmo-sigtran-dbg, libosmo-asn1-tcap-dbg[0m [0;94m[testenv][sccplite] + ['podman', 'exec', '-e', 'CCACHE_DIR=/home/osmocom-build/ccache/testenv', '-e', 'TESTENV_CACHE_DIR=<
https://jenkins.osmocom.org/jenkins/job/ttcn3-bsc-test-sccplite/ws/_cache
',> '-e', 'TESTENV_SRC_DIR=/home/osmocom-build/jenkins/workspace', '-e', 'TESTENV_INSTALL_DIR=/', '-e', 'TERM=dumb', '-e', 'PATH=<
https://jenkins.osmocom.org/jenkins/job/ttcn3-bsc-test-sccplite/ws/_testenv…
>:<
https://jenkins.osmocom.org/jenkins/job/ttcn3-bsc-test-sccplite/ws/_testenv…
>:<
https://jenkins.osmocom.org/jenkins/job/ttcn3-bsc-test-sccplite/ws/bsc
>:/usr/local/bin:/usr/sbin:/usr/bin:/sbin:/bin', '-e', 'HOME=/home/osmocom-build', '-e', 'PYTHONUNBUFFERED=1', '-t', 'testenv-bsc-sccplite-osmocom-nightly-20260821-0848-46eec8c8-1', 'apt-get', '-q', 'install', '-y', '--no-install-recommends', 'osmo-bts-virtual', 'osmo-bsc', 'osmo-bts-virtual-dbg', 'libc6-dbg', 'libosmocore-dbg', 'osmo-bsc-dbg', 'libosmo-mgcp-client14-dbgsym', 'libosmo-sigtran-dbg', 'libosmo-asn1-tcap-dbg'][0m Reading package lists... Building dependency tree... Solving dependencies... Some packages could not be installed. This may mean that you have requested an impossible situation or if you are using the unstable distribution that some required packages have not yet been created or been moved out of Incoming. The following information may help to resolve the situation: The following packages have unmet dependencies: libosmo-mgcp-client14 : Depends: osmocom-nightly (= 202608191800) but 202608201800 is to be installed osmo-bsc : Depends: osmocom-nightly (= 202608191800) but 202608201800 is to be installed osmo-bsc-dbg : Depends: osmocom-nightly (= 202608191800) but 202608201800 is to be installed E: Unable to correct problems, you have held broken packages. E: The following information from --solver 3.0 may provide additional context: Unable to satisfy dependencies. Reached two conflicting decisions: 1. osmo-bsc:amd64=1.14.0.40.779dd6.202608191800 is selected for install 2. osmo-bsc:amd64=1.14.0.40.779dd6.202608191800 Depends osmocom-nightly (= 202608191800) but none of the choices are installable: [no choices] [1;91m[testenv][sccplite] Command failed unexpectedly[0m [0;94m[testenv][sccplite] Command: ['podman', 'exec', '-e', 'CCACHE_DIR=/home/osmocom-build/ccache/testenv', '-e', 'TESTENV_CACHE_DIR=<
https://jenkins.osmocom.org/jenkins/job/ttcn3-bsc-test-sccplite/ws/_cache
',> '-e', 'TESTENV_SRC_DIR=/home/osmocom-build/jenkins/workspace', '-e', 'TESTENV_INSTALL_DIR=/', '-e', 'TERM=dumb', '-e', 'PATH=<
https://jenkins.osmocom.org/jenkins/job/ttcn3-bsc-test-sccplite/ws/_testenv…
>:<
https://jenkins.osmocom.org/jenkins/job/ttcn3-bsc-test-sccplite/ws/_testenv…
>:<
https://jenkins.osmocom.org/jenkins/job/ttcn3-bsc-test-sccplite/ws/bsc
>:/usr/local/bin:/usr/sbin:/usr/bin:/sbin:/bin', '-e', 'HOME=/home/osmocom-build', '-e', 'PYTHONUNBUFFERED=1', '-t', 'testenv-bsc-sccplite-osmocom-nightly-20260821-0848-46eec8c8-1', 'apt-get', '-q', 'install', '-y', '--no-install-recommends', 'osmo-bts-virtual', 'osmo-bsc', 'osmo-bts-virtual-dbg', 'libc6-dbg', 'libosmocore-dbg', 'osmo-bsc-dbg', 'libosmo-mgcp-client14-dbgsym', 'libosmo-sigtran-dbg', 'libosmo-asn1-tcap-dbg'][0m [0;94m[testenv][sccplite] Returncode: 100[0m [1;34m[testenv][sccplite] Stopping podman container[0m [0;94m[testenv][sccplite] + ['podman', 'kill', 'testenv-bsc-sccplite-osmocom-nightly-20260821-0848-46eec8c8-1'][0m testenv-bsc-sccplite-osmocom-nightly-20260821-0848-46eec8c8-1 Traceback (most recent call last): File "<
https://jenkins.osmocom.org/jenkins/job/ttcn3-bsc-test-sccplite/ws/./testen…
",> line 135, in <module> main() File "<
https://jenkins.osmocom.org/jenkins/job/ttcn3-bsc-test-sccplite/ws/./testen…
",> line 124, in main run() File "<
https://jenkins.osmocom.org/jenkins/job/ttcn3-bsc-test-sccplite/ws/./testen…
",> line 73, in run testenv.podman_install.packages(cfg, cfg_name) File "<
https://jenkins.osmocom.org/jenkins/job/ttcn3-bsc-test-sccplite/ws/_testenv…
",> line 233, in packages apt_install(packages) File "<
https://jenkins.osmocom.org/jenkins/job/ttcn3-bsc-test-sccplite/ws/_testenv…
",> line 99, in apt_install testenv.cmd.run(["apt-get", "-q", "install", "-y", "--no-install-recommends"] + pkgs) File "<
https://jenkins.osmocom.org/jenkins/job/ttcn3-bsc-test-sccplite/ws/_testenv…
",> line 127, in run return testenv.podman.exec_cmd(cmd, check=check, env=env, **kwargs) ^^^^^^^^^^^^^^^^^^^^^^^^^^^^^^^^^^^^^^^^^^^^^^^^^^^^^^^^^^^^ File "<
https://jenkins.osmocom.org/jenkins/job/ttcn3-bsc-test-sccplite/ws/_testenv…
",> line 156, in exec_cmd return testenv.cmd.run( ^^^^^^^^^^^^^^^^ File "<
https://jenkins.osmocom.org/jenkins/job/ttcn3-bsc-test-sccplite/ws/_testenv…
",> line 144, in run exit_error_cmd(p, "Command failed unexpectedly") File "<
https://jenkins.osmocom.org/jenkins/job/ttcn3-bsc-test-sccplite/ws/_testenv…
",> line 88, in exit_error_cmd raise RuntimeError("shell command related error, find details right above this python trace") RuntimeError: shell command related error, find details right above this python trace [0;94m[testenv][sccplite] feed_watchdog_loop: podman container has stopped[0m [1;34m[testenv][sccplite] Logs saved to:
https://jenkins.osmocom.org/jenkins/job/ttcn3-bsc-test-sccplite/3052/artifa…
[0m + RC=1 + [ 1 = 0 ] + uptime + grep --color=always -o load.* [01;31m[Kload average: 9.53, 11.40, 11.08[m[K + exit 1 Build step 'Execute shell' marked build as failure Recording test results ERROR: Step ‘Publish JUnit test result report’ failed: No test report files were found. Configuration error?
1
1
0
0
Build failed in Jenkins: ttcn3-hnbgw-test #1690
by jenkins@lists.osmocom.org
22 Aug '26
22 Aug '26
See <
https://jenkins.osmocom.org/jenkins/job/ttcn3-hnbgw-test/1690/display/redir…
> Changes: [Pau Espin Pedrol] sgsn: Fail in obvious way when unexpected ServiceAccept is received [Oliver Smith] testenv: subprocess.run with explicit check=False [Oliver Smith] smdpp/generate_all_test_certificates: use f-string [Oliver Smith] testenv: remove *args from various functions [Oliver Smith] testenv: various small syntax tweaks ------------------------------------------ [...truncated 118.80 KiB...] CCLD HNBAP_CommonDataTypes_part_1.so CCLD HNBAP_CommonDataTypes_part_2.so CCLD HNBAP_CommonDataTypes_part_3.so CCLD HNBAP_CommonDataTypes_part_4.so CCLD HNBAP_CommonDataTypes_part_5.so CCLD HNBAP_CommonDataTypes_part_6.so CCLD HNBAP_CommonDataTypes_part_7.so CCLD HNBAP_Constants_part_1.so CCLD HNBAP_Constants_part_2.so CCLD HNBAP_Constants_part_3.so CCLD HNBAP_Constants_part_5.so CCLD HNBAP_Constants_part_4.so CCLD HNBAP_Constants_part_6.so CCLD HNBAP_Containers_part_1.so CCLD HNBAP_Constants_part_7.so CCLD HNBAP_Containers_part_3.so CCLD HNBAP_Containers_part_2.so CCLD HNBAP_Containers_part_4.so CCLD HNBAP_Containers_part_5.so CCLD HNBAP_Containers_part_6.so CCLD HNBAP_Containers_part_7.so CCLD HNBAP_IEs_part_1.so CCLD HNBAP_IEs_part_2.so CCLD HNBAP_IEs_part_3.so CCLD HNBAP_IEs_part_4.so CCLD HNBAP_IEs_part_5.so CCLD HNBAP_IEs_part_6.so CCLD HNBAP_IEs_part_7.so CCLD HNBAP_PDU_Contents_part_1.so CCLD HNBAP_PDU_Contents_part_2.so CCLD HNBAP_PDU_Contents_part_3.so CCLD HNBAP_PDU_Contents_part_5.so CCLD HNBAP_PDU_Contents_part_4.so CCLD HNBAP_PDU_Contents_part_6.so CCLD HNBAP_PDU_Contents_part_7.so CCLD HNBAP_PDU_Descriptions_part_1.so CCLD HNBAP_PDU_Descriptions_part_2.so CCLD HNBAP_PDU_Descriptions_part_3.so CCLD HNBAP_PDU_Descriptions_part_4.so CCLD HNBAP_PDU_Descriptions_part_5.so CCLD HNBAP_PDU_Descriptions_part_6.so CCLD HNBAP_PDU_Descriptions_part_7.so CCLD RANAP_CommonDataTypes_part_1.so CCLD RANAP_CommonDataTypes_part_2.so CCLD RANAP_CommonDataTypes_part_3.so CCLD RANAP_CommonDataTypes_part_4.so CCLD RANAP_CommonDataTypes_part_5.so CCLD RANAP_CommonDataTypes_part_6.so CCLD RANAP_CommonDataTypes_part_7.so CCLD RANAP_Constants_part_1.so CCLD RANAP_Constants_part_2.so CCLD RANAP_Constants_part_3.so CCLD RANAP_Constants_part_4.so CCLD RANAP_Constants_part_5.so CCLD RANAP_Constants_part_6.so CCLD RANAP_Constants_part_7.so CCLD RANAP_Containers_part_1.so CCLD RANAP_Containers_part_2.so CCLD RANAP_Containers_part_3.so CCLD RANAP_Containers_part_4.so CCLD RANAP_Containers_part_5.so CCLD RANAP_Containers_part_6.so CCLD RANAP_Containers_part_7.so CCLD RANAP_IEs_part_1.so CCLD RANAP_IEs_part_2.so CCLD RANAP_IEs_part_3.so CCLD RANAP_IEs_part_4.so CCLD RANAP_IEs_part_5.so CCLD RANAP_IEs_part_6.so CCLD RANAP_IEs_part_7.so CCLD RANAP_PDU_Contents_part_1.so CCLD RANAP_PDU_Contents_part_2.so CCLD RANAP_PDU_Contents_part_3.so CCLD RANAP_PDU_Contents_part_4.so CCLD RANAP_PDU_Contents_part_5.so CCLD RANAP_PDU_Contents_part_6.so CCLD RANAP_PDU_Contents_part_7.so CCLD RANAP_PDU_Descriptions_part_1.so CCLD RANAP_PDU_Descriptions_part_2.so CCLD RANAP_PDU_Descriptions_part_3.so CCLD RANAP_PDU_Descriptions_part_4.so CCLD RANAP_PDU_Descriptions_part_5.so CCLD RANAP_PDU_Descriptions_part_6.so CCLD RANAP_PDU_Descriptions_part_7.so CCLD RUA_CommonDataTypes_part_1.so CCLD RUA_CommonDataTypes_part_2.so CCLD RUA_CommonDataTypes_part_3.so CCLD RUA_CommonDataTypes_part_4.so CCLD RUA_CommonDataTypes_part_5.so CCLD RUA_CommonDataTypes_part_6.so CCLD RUA_CommonDataTypes_part_7.so CCLD RUA_Constants_part_1.so CCLD RUA_Constants_part_2.so CCLD RUA_Constants_part_3.so CCLD RUA_Constants_part_4.so CCLD RUA_Constants_part_5.so CCLD RUA_Constants_part_6.so CCLD RUA_Constants_part_7.so CCLD RUA_Containers_part_1.so CCLD RUA_Containers_part_2.so CCLD RUA_Containers_part_3.so CCLD RUA_Containers_part_4.so CCLD RUA_Containers_part_5.so CCLD RUA_Containers_part_6.so CCLD RUA_Containers_part_7.so CCLD RUA_IEs_part_1.so CCLD RUA_IEs_part_2.so CCLD RUA_IEs_part_3.so CCLD RUA_IEs_part_4.so CCLD RUA_IEs_part_5.so CCLD RUA_IEs_part_6.so CCLD RUA_IEs_part_7.so CCLD RUA_PDU_Contents_part_1.so CCLD RUA_PDU_Contents_part_3.so CCLD RUA_PDU_Contents_part_2.so CCLD RUA_PDU_Contents_part_4.so CCLD RUA_PDU_Contents_part_5.so CCLD RUA_PDU_Contents_part_6.so CCLD RUA_PDU_Contents_part_7.so CCLD RUA_PDU_Descriptions_part_1.so CCLD RUA_PDU_Descriptions_part_2.so CCLD RUA_PDU_Descriptions_part_3.so CCLD RUA_PDU_Descriptions_part_4.so CCLD RUA_PDU_Descriptions_part_5.so CCLD RUA_PDU_Descriptions_part_6.so CCLD RUA_PDU_Descriptions_part_7.so CCLD SDP_parse_.tab.so CCLD lex.SDP_parse_.so CCLD IPA_CodecPort_CtrlFunctDef.so CCLD IPL4asp_PT.so CCLD IPL4asp_discovery.so CCLD IuUP_EncDec.so CCLD Iuh_CodecPort_CtrlFunctDef.so CCLD Native_FunctionDefs.so CCLD RTP_CodecPort_CtrlFunctDef.so CCLD RTP_EncDec.so CCLD SCTPasp_PT.so CCLD SDP_EncDec.so CCLD StatsD_CodecPort_CtrlFunctdef.so CCLD TCCConversion.so CCLD TCCEncoding.so CCLD TCCInterface.so CCLD TELNETasp_PT.so CCLD HNBAP_EncDec.so CCLD RUA_EncDec.so CCLD RANAP_EncDec.so CCLD MGCP_CodecPort_CtrlFunctDef.so CCLD UD_PT.so CCLD PFCP_CodecPort_CtrlFunctDef.so CCLD HNBGW_Tests make[1]: Leaving directory '<
https://jenkins.osmocom.org/jenkins/job/ttcn3-hnbgw-test/ws/_cache/podman/t…
'> [1;34m[testenv][generic] Stopping podman container (restart)[0m [0;94m[testenv][generic] + ['podman', 'kill', 'testenv-hnbgw-all-osmocom-nightly-20260821-0847-d8d021c0-0'][0m testenv-hnbgw-all-osmocom-nightly-20260821-0847-d8d021c0-0 [0;94m[testenv][generic] + ['podman', 'run', '--rm', '--name', 'testenv-hnbgw-all-osmocom-nightly-20260821-0847-d8d021c0-1', '--log-driver', 'json-file', '--log-opt', 'path=<
https://jenkins.osmocom.org/jenkins/job/ttcn3-hnbgw-test/1690/artifact/logs…
',> '--security-opt=seccomp=<
https://jenkins.osmocom.org/jenkins/job/ttcn3-hnbgw-test/ws/_testenv/data/p…
',> '--cap-add=NET_ADMIN', '--cap-add=NET_RAW', '--cap-add=SYS_ADMIN', '--device=/dev/net/tun', '--volume', '<
https://jenkins.osmocom.org/jenkins/job/ttcn3-hnbgw-test/ws/_cache/podman/v…
>:/var/cache/apt', '--volume', '<
https://jenkins.osmocom.org/jenkins/job/ttcn3-hnbgw-test/ws/_cache/podman/v…
>:/var/lib/apt', '--sysctl', 'net.ipv4.conf.all.send_redirects=0', '--sysctl', 'net.ipv4.conf.default.send_redirects=0', '-e', 'PODMAN=1', '-e', 'HOST_USER=osmocom-build', '-e', 'TESTENV_BINARY_REPO=1', '--volume', '<
https://jenkins.osmocom.org/jenkins/job/ttcn3-hnbgw-test/ws/logs
>:<
https://jenkins.osmocom.org/jenkins/job/ttcn3-hnbgw-test/ws/logs
',> '--volume', '<
https://jenkins.osmocom.org/jenkins/job/ttcn3-hnbgw-test/ws/_cache
>:<
https://jenkins.osmocom.org/jenkins/job/ttcn3-hnbgw-test/ws/_cache
',> '--volume', '/home/osmocom-build/ccache/testenv:/home/osmocom-build/ccache/testenv', '--volume', '/home/osmocom-build/jenkins/workspace:/home/osmocom-build/jenkins/workspace', 'debian-trixie-osmo-ttcn3-testenv', '<
https://jenkins.osmocom.org/jenkins/job/ttcn3-hnbgw-test/ws/_testenv/data/s…
'][0m> [0;94m[testenv] feed_watchdog_loop: podman container has stopped[0m Running testenv-podman-main.sh [0;94m[testenv][generic] + ['podman', 'exec', '-e', 'CCACHE_DIR=/home/osmocom-build/ccache/testenv', '-e', 'TESTENV_CACHE_DIR=<
https://jenkins.osmocom.org/jenkins/job/ttcn3-hnbgw-test/ws/_cache
',> '-e', 'TESTENV_SRC_DIR=/home/osmocom-build/jenkins/workspace', '-e', 'TESTENV_INSTALL_DIR=/', '-e', 'TERM=dumb', '-e', 'PATH=<
https://jenkins.osmocom.org/jenkins/job/ttcn3-hnbgw-test/ws/_testenv/data/s…
>:<
https://jenkins.osmocom.org/jenkins/job/ttcn3-hnbgw-test/ws/_testenv/data/s…
>:<
https://jenkins.osmocom.org/jenkins/job/ttcn3-hnbgw-test/ws/hnbgw
>:/usr/local/bin:/usr/sbin:/usr/bin:/sbin:/bin', '-e', 'HOME=/home/osmocom-build', '-e', 'PYTHONUNBUFFERED=1', '-t', 'testenv-hnbgw-all-osmocom-nightly-20260821-0847-d8d021c0-1', 'rm', '/etc/apt/apt.conf.d/docker-clean'][0m [0;94m[testenv][generic] + ['podman', 'exec', '-e', 'CCACHE_DIR=/home/osmocom-build/ccache/testenv', '-e', 'TESTENV_CACHE_DIR=<
https://jenkins.osmocom.org/jenkins/job/ttcn3-hnbgw-test/ws/_cache
',> '-e', 'TESTENV_SRC_DIR=/home/osmocom-build/jenkins/workspace', '-e', 'TESTENV_INSTALL_DIR=/', '-e', 'TERM=dumb', '-e', 'PATH=<
https://jenkins.osmocom.org/jenkins/job/ttcn3-hnbgw-test/ws/_testenv/data/s…
>:<
https://jenkins.osmocom.org/jenkins/job/ttcn3-hnbgw-test/ws/_testenv/data/s…
>:<
https://jenkins.osmocom.org/jenkins/job/ttcn3-hnbgw-test/ws/hnbgw
>:/usr/local/bin:/usr/sbin:/usr/bin:/sbin:/bin', '-e', 'HOME=/home/osmocom-build', '-e', 'PYTHONUNBUFFERED=1', '-t', 'testenv-hnbgw-all-osmocom-nightly-20260821-0847-d8d021c0-1', 'sh', '-c', "echo 'deb [signed-by=/obs.key]
https://downloads.osmocom.org/packages/osmocom:/nightly/Debian_13/
./' > /etc/apt/sources.list.d/osmocom.list"][0m [0;94m[testenv][generic] + ['podman', 'exec', '-e', 'CCACHE_DIR=/home/osmocom-build/ccache/testenv', '-e', 'TESTENV_CACHE_DIR=<
https://jenkins.osmocom.org/jenkins/job/ttcn3-hnbgw-test/ws/_cache
',> '-e', 'TESTENV_SRC_DIR=/home/osmocom-build/jenkins/workspace', '-e', 'TESTENV_INSTALL_DIR=/', '-e', 'TERM=dumb', '-e', 'PATH=<
https://jenkins.osmocom.org/jenkins/job/ttcn3-hnbgw-test/ws/_testenv/data/s…
>:<
https://jenkins.osmocom.org/jenkins/job/ttcn3-hnbgw-test/ws/_testenv/data/s…
>:<
https://jenkins.osmocom.org/jenkins/job/ttcn3-hnbgw-test/ws/hnbgw
>:/usr/local/bin:/usr/sbin:/usr/bin:/sbin:/bin', '-e', 'HOME=/home/osmocom-build', '-e', 'PYTHONUNBUFFERED=1', '-t', 'testenv-hnbgw-all-osmocom-nightly-20260821-0847-d8d021c0-1', 'sh', '-c', 'echo \'Package: *\nPin: origin "
downloads.osmocom.org
"\nPin-Priority: 1100\n\' > /etc/apt/preferences.d/osmocom-apt-pin'][0m [0;94m[testenv][generic] + ['podman', 'exec', '-e', 'CCACHE_DIR=/home/osmocom-build/ccache/testenv', '-e', 'TESTENV_CACHE_DIR=<
https://jenkins.osmocom.org/jenkins/job/ttcn3-hnbgw-test/ws/_cache
',> '-e', 'TESTENV_SRC_DIR=/home/osmocom-build/jenkins/workspace', '-e', 'TESTENV_INSTALL_DIR=/', '-e', 'TERM=dumb', '-e', 'PATH=<
https://jenkins.osmocom.org/jenkins/job/ttcn3-hnbgw-test/ws/_testenv/data/s…
>:<
https://jenkins.osmocom.org/jenkins/job/ttcn3-hnbgw-test/ws/_testenv/data/s…
>:<
https://jenkins.osmocom.org/jenkins/job/ttcn3-hnbgw-test/ws/hnbgw
>:/usr/local/bin:/usr/sbin:/usr/bin:/sbin:/bin', '-e', 'HOME=/home/osmocom-build', '-e', 'PYTHONUNBUFFERED=1', '-t', 'testenv-hnbgw-all-osmocom-nightly-20260821-0847-d8d021c0-1', 'apt-get', '-q', 'update'][0m Hit:1
http://deb.debian.org/debian
trixie InRelease Hit:2
http://deb.debian.org/debian
trixie-updates InRelease Get:3
https://downloads.osmocom.org/packages/osmocom:/nightly/Debian_13
./ InRelease [1620 B] Hit:4
http://deb.debian.org/debian-security
trixie-security InRelease Get:5
https://downloads.osmocom.org/packages/osmocom:/nightly/Debian_13
./ Packages [200 kB] Fetched 201 kB in 0s (2247 kB/s) Reading package lists... [0;94m[testenv][generic] + ['podman', 'exec', '-e', 'CCACHE_DIR=/home/osmocom-build/ccache/testenv', '-e', 'TESTENV_CACHE_DIR=<
https://jenkins.osmocom.org/jenkins/job/ttcn3-hnbgw-test/ws/_cache
',> '-e', 'TESTENV_SRC_DIR=/home/osmocom-build/jenkins/workspace', '-e', 'TESTENV_INSTALL_DIR=/', '-e', 'TERM=dumb', '-e', 'PATH=<
https://jenkins.osmocom.org/jenkins/job/ttcn3-hnbgw-test/ws/_testenv/data/s…
>:<
https://jenkins.osmocom.org/jenkins/job/ttcn3-hnbgw-test/ws/_testenv/data/s…
>:<
https://jenkins.osmocom.org/jenkins/job/ttcn3-hnbgw-test/ws/hnbgw
>:/usr/local/bin:/usr/sbin:/usr/bin:/sbin:/bin', '-e', 'HOME=/home/osmocom-build', '-e', 'PYTHONUNBUFFERED=1', '-t', 'testenv-hnbgw-all-osmocom-nightly-20260821-0847-d8d021c0-1', 'sh', '-c', 'apt-cache pkgnames | grep -- -dbg > <
https://jenkins.osmocom.org/jenkins/job/ttcn3-hnbgw-test/ws/_cache/podman/d…
'][0m> [0;94m[testenv][generic] + ['podman', 'exec', '-e', 'CCACHE_DIR=/home/osmocom-build/ccache/testenv', '-e', 'TESTENV_CACHE_DIR=<
https://jenkins.osmocom.org/jenkins/job/ttcn3-hnbgw-test/ws/_cache
',> '-e', 'TESTENV_SRC_DIR=/home/osmocom-build/jenkins/workspace', '-e', 'TESTENV_INSTALL_DIR=/', '-e', 'TERM=dumb', '-e', 'PATH=<
https://jenkins.osmocom.org/jenkins/job/ttcn3-hnbgw-test/ws/_testenv/data/s…
>:<
https://jenkins.osmocom.org/jenkins/job/ttcn3-hnbgw-test/ws/_testenv/data/s…
>:<
https://jenkins.osmocom.org/jenkins/job/ttcn3-hnbgw-test/ws/hnbgw
>:/usr/local/bin:/usr/sbin:/usr/bin:/sbin:/bin', '-e', 'HOME=/home/osmocom-build', '-e', 'PYTHONUNBUFFERED=1', '-t', 'testenv-hnbgw-all-osmocom-nightly-20260821-0847-d8d021c0-1', 'apt-rdepends', 'osmo-stp'][0m [0;94m[testenv][generic] osmo-stp -> osmo-stp: installing osmo-stp-dbg[0m [0;94m[testenv][generic] osmo-stp -> libc6: installing libc6-dbg[0m [0;94m[testenv][generic] osmo-stp -> libosmo-sigtran12: installing libosmo-sigtran-dbg[0m [0;94m[testenv][generic] osmo-stp -> libosmo-asn1-tcap1: installing libosmo-asn1-tcap-dbg[0m [0;94m[testenv][generic] osmo-stp -> libosmocore22: installing libosmocore-dbg[0m [0;94m[testenv][generic] + ['podman', 'exec', '-e', 'CCACHE_DIR=/home/osmocom-build/ccache/testenv', '-e', 'TESTENV_CACHE_DIR=<
https://jenkins.osmocom.org/jenkins/job/ttcn3-hnbgw-test/ws/_cache
',> '-e', 'TESTENV_SRC_DIR=/home/osmocom-build/jenkins/workspace', '-e', 'TESTENV_INSTALL_DIR=/', '-e', 'TERM=dumb', '-e', 'PATH=<
https://jenkins.osmocom.org/jenkins/job/ttcn3-hnbgw-test/ws/_testenv/data/s…
>:<
https://jenkins.osmocom.org/jenkins/job/ttcn3-hnbgw-test/ws/_testenv/data/s…
>:<
https://jenkins.osmocom.org/jenkins/job/ttcn3-hnbgw-test/ws/hnbgw
>:/usr/local/bin:/usr/sbin:/usr/bin:/sbin:/bin', '-e', 'HOME=/home/osmocom-build', '-e', 'PYTHONUNBUFFERED=1', '-t', 'testenv-hnbgw-all-osmocom-nightly-20260821-0847-d8d021c0-1', 'apt-rdepends', 'osmo-hnbgw'][0m [0;94m[testenv][generic] osmo-hnbgw -> osmo-hnbgw: installing osmo-hnbgw-dbg[0m [0;94m[testenv][generic] osmo-hnbgw -> libasn1c1: installing libasn1c-dbg[0m [0;94m[testenv][generic] osmo-hnbgw -> libc6: installing libc6-dbg[0m [0;94m[testenv][generic] osmo-hnbgw -> libosmo-hnbap0: installing libosmo-hnbap-dbg[0m [0;94m[testenv][generic] osmo-hnbgw -> libosmocore22: installing libosmocore-dbg[0m [0;94m[testenv][generic] osmo-hnbgw -> libosmo-mgcp-client14: installing libosmo-mgcp-client14-dbgsym[0m [0;94m[testenv][generic] osmo-hnbgw -> libosmo-pfcp4: installing libosmo-pfcp-dbg[0m [0;94m[testenv][generic] osmo-hnbgw -> libosmo-gtlv1: installing libosmo-gtlv-dbg[0m [0;94m[testenv][generic] osmo-hnbgw -> libosmo-ranap7: installing libosmo-ranap-dbg[0m [0;94m[testenv][generic] osmo-hnbgw -> libosmo-sigtran12: installing libosmo-sigtran-dbg[0m [0;94m[testenv][generic] osmo-hnbgw -> libosmo-asn1-tcap1: installing libosmo-asn1-tcap-dbg[0m [0;94m[testenv][generic] osmo-hnbgw -> libosmo-rua0: installing libosmo-rua-dbg[0m [1;34m[testenv][generic] Installing packages: osmo-stp, osmo-hnbgw, osmo-stp-dbg, libc6-dbg, libosmo-sigtran-dbg, libosmo-asn1-tcap-dbg, libosmocore-dbg, osmo-hnbgw-dbg, libasn1c-dbg, libosmo-hnbap-dbg, libosmo-mgcp-client14-dbgsym, libosmo-pfcp-dbg, libosmo-gtlv-dbg, libosmo-ranap-dbg, libosmo-rua-dbg[0m [0;94m[testenv][generic] + ['podman', 'exec', '-e', 'CCACHE_DIR=/home/osmocom-build/ccache/testenv', '-e', 'TESTENV_CACHE_DIR=<
https://jenkins.osmocom.org/jenkins/job/ttcn3-hnbgw-test/ws/_cache
',> '-e', 'TESTENV_SRC_DIR=/home/osmocom-build/jenkins/workspace', '-e', 'TESTENV_INSTALL_DIR=/', '-e', 'TERM=dumb', '-e', 'PATH=<
https://jenkins.osmocom.org/jenkins/job/ttcn3-hnbgw-test/ws/_testenv/data/s…
>:<
https://jenkins.osmocom.org/jenkins/job/ttcn3-hnbgw-test/ws/_testenv/data/s…
>:<
https://jenkins.osmocom.org/jenkins/job/ttcn3-hnbgw-test/ws/hnbgw
>:/usr/local/bin:/usr/sbin:/usr/bin:/sbin:/bin', '-e', 'HOME=/home/osmocom-build', '-e', 'PYTHONUNBUFFERED=1', '-t', 'testenv-hnbgw-all-osmocom-nightly-20260821-0847-d8d021c0-1', 'apt-get', '-q', 'install', '-y', '--no-install-recommends', 'osmo-stp', 'osmo-hnbgw', 'osmo-stp-dbg', 'libc6-dbg', 'libosmo-sigtran-dbg', 'libosmo-asn1-tcap-dbg', 'libosmocore-dbg', 'osmo-hnbgw-dbg', 'libasn1c-dbg', 'libosmo-hnbap-dbg', 'libosmo-mgcp-client14-dbgsym', 'libosmo-pfcp-dbg', 'libosmo-gtlv-dbg', 'libosmo-ranap-dbg', 'libosmo-rua-dbg'][0m Reading package lists... Building dependency tree... Solving dependencies... Some packages could not be installed. This may mean that you have requested an impossible situation or if you are using the unstable distribution that some required packages have not yet been created or been moved out of Incoming. The following information may help to resolve the situation: The following packages have unmet dependencies: libosmo-mgcp-client14 : Depends: osmocom-nightly (= 202608191800) but 202608201800 is to be installed osmo-hnbgw : Depends: osmocom-nightly (= 202608191800) but 202608201800 is to be installed osmo-hnbgw-dbg : Depends: osmocom-nightly (= 202608191800) but 202608201800 is to be installed E: Unable to correct problems, you have held broken packages. E: The following information from --solver 3.0 may provide additional context: Unable to satisfy dependencies. Reached two conflicting decisions: 1. osmo-hnbgw:amd64=1.8.0.3.520f.202608191800 is selected for install 2. osmo-hnbgw:amd64 Depends osmocom-nightly (= 202608191800) but none of the choices are installable: [no choices] [1;91m[testenv][generic] Command failed unexpectedly[0m [0;94m[testenv][generic] Command: ['podman', 'exec', '-e', 'CCACHE_DIR=/home/osmocom-build/ccache/testenv', '-e', 'TESTENV_CACHE_DIR=<
https://jenkins.osmocom.org/jenkins/job/ttcn3-hnbgw-test/ws/_cache
',> '-e', 'TESTENV_SRC_DIR=/home/osmocom-build/jenkins/workspace', '-e', 'TESTENV_INSTALL_DIR=/', '-e', 'TERM=dumb', '-e', 'PATH=<
https://jenkins.osmocom.org/jenkins/job/ttcn3-hnbgw-test/ws/_testenv/data/s…
>:<
https://jenkins.osmocom.org/jenkins/job/ttcn3-hnbgw-test/ws/_testenv/data/s…
>:<
https://jenkins.osmocom.org/jenkins/job/ttcn3-hnbgw-test/ws/hnbgw
>:/usr/local/bin:/usr/sbin:/usr/bin:/sbin:/bin', '-e', 'HOME=/home/osmocom-build', '-e', 'PYTHONUNBUFFERED=1', '-t', 'testenv-hnbgw-all-osmocom-nightly-20260821-0847-d8d021c0-1', 'apt-get', '-q', 'install', '-y', '--no-install-recommends', 'osmo-stp', 'osmo-hnbgw', 'osmo-stp-dbg', 'libc6-dbg', 'libosmo-sigtran-dbg', 'libosmo-asn1-tcap-dbg', 'libosmocore-dbg', 'osmo-hnbgw-dbg', 'libasn1c-dbg', 'libosmo-hnbap-dbg', 'libosmo-mgcp-client14-dbgsym', 'libosmo-pfcp-dbg', 'libosmo-gtlv-dbg', 'libosmo-ranap-dbg', 'libosmo-rua-dbg'][0m [0;94m[testenv][generic] Returncode: 100[0m [1;34m[testenv][generic] Stopping podman container[0m [0;94m[testenv][generic] + ['podman', 'kill', 'testenv-hnbgw-all-osmocom-nightly-20260821-0847-d8d021c0-1'][0m testenv-hnbgw-all-osmocom-nightly-20260821-0847-d8d021c0-1 Traceback (most recent call last): File "<
https://jenkins.osmocom.org/jenkins/job/ttcn3-hnbgw-test/ws/./testenv.py
",> line 135, in <module> main() File "<
https://jenkins.osmocom.org/jenkins/job/ttcn3-hnbgw-test/ws/./testenv.py
",> line 124, in main run() File "<
https://jenkins.osmocom.org/jenkins/job/ttcn3-hnbgw-test/ws/./testenv.py
",> line 73, in run testenv.podman_install.packages(cfg, cfg_name) File "<
https://jenkins.osmocom.org/jenkins/job/ttcn3-hnbgw-test/ws/_testenv/testen…
",> line 233, in packages apt_install(packages) File "<
https://jenkins.osmocom.org/jenkins/job/ttcn3-hnbgw-test/ws/_testenv/testen…
",> line 99, in apt_install testenv.cmd.run(["apt-get", "-q", "install", "-y", "--no-install-recommends"] + pkgs) File "<
https://jenkins.osmocom.org/jenkins/job/ttcn3-hnbgw-test/ws/_testenv/testen…
",> line 127, in run return testenv.podman.exec_cmd(cmd, check=check, env=env, **kwargs) ^^^^^^^^^^^^^^^^^^^^^^^^^^^^^^^^^^^^^^^^^^^^^^^^^^^^^^^^^^^^ File "<
https://jenkins.osmocom.org/jenkins/job/ttcn3-hnbgw-test/ws/_testenv/testen…
",> line 156, in exec_cmd return testenv.cmd.run( ^^^^^^^^^^^^^^^^ File "<
https://jenkins.osmocom.org/jenkins/job/ttcn3-hnbgw-test/ws/_testenv/testen…
",> line 144, in run exit_error_cmd(p, "Command failed unexpectedly") File "<
https://jenkins.osmocom.org/jenkins/job/ttcn3-hnbgw-test/ws/_testenv/testen…
",> line 88, in exit_error_cmd raise RuntimeError("shell command related error, find details right above this python trace") RuntimeError: shell command related error, find details right above this python trace [0;94m[testenv][generic] feed_watchdog_loop: podman container has stopped[0m [1;34m[testenv][generic] Logs saved to:
https://jenkins.osmocom.org/jenkins/job/ttcn3-hnbgw-test/1690/artifact/logs/
[0m + RC=1 + [ 1 = 0 ] + uptime + grep --color=always -o load.* [01;31m[Kload average: 10.31, 11.96, 11.23[m[K + exit 1 Build step 'Execute shell' marked build as failure Recording test results ERROR: Step ‘Publish JUnit test result report’ failed: No test report files were found. Configuration error?
1
1
0
0
Build failed in Jenkins: ttcn3-bsc-test-vamos #1921
by jenkins@lists.osmocom.org
22 Aug '26
22 Aug '26
See <
https://jenkins.osmocom.org/jenkins/job/ttcn3-bsc-test-vamos/1921/display/r…
> Changes: [Pau Espin Pedrol] sgsn: Fail in obvious way when unexpected ServiceAccept is received [Oliver Smith] testenv: subprocess.run with explicit check=False [Oliver Smith] smdpp/generate_all_test_certificates: use f-string [Oliver Smith] testenv: remove *args from various functions [Oliver Smith] testenv: various small syntax tweaks ------------------------------------------ [...truncated 108.60 KiB...] CCLD SCCP_Types_part_6.so CCLD SCCPasp_Types_part_1.so CCLD SCCP_Types_part_7.so CCLD SCCPasp_Types_part_2.so CCLD SCCPasp_Types_part_3.so CCLD SCCPasp_Types_part_4.so CCLD SCCPasp_Types_part_5.so CCLD SCCPasp_Types_part_6.so CCLD SCCPasp_Types_part_7.so CCLD SCTPasp_PortType_part_1.so CCLD SCTPasp_PortType_part_2.so CCLD SCTPasp_PortType_part_3.so CCLD SCTPasp_PortType_part_4.so CCLD SCTPasp_PortType_part_5.so CCLD SCTPasp_PortType_part_6.so CCLD SCTPasp_PortType_part_7.so CCLD SCTPasp_Types_part_1.so CCLD SCTPasp_Types_part_2.so CCLD SCTPasp_Types_part_4.so CCLD SCTPasp_Types_part_3.so CCLD SCTPasp_Types_part_5.so CCLD SCTPasp_Types_part_6.so CCLD SCTPasp_Types_part_7.so CCLD SDP_Templates_part_1.so CCLD SDP_Templates_part_2.so CCLD SDP_Templates_part_3.so CCLD SDP_Templates_part_4.so CCLD SDP_Templates_part_5.so CCLD SDP_Templates_part_6.so CCLD SDP_Templates_part_7.so CCLD SDP_Types_part_1.so CCLD SDP_Types_part_2.so CCLD SDP_Types_part_3.so CCLD SDP_Types_part_4.so CCLD SDP_Types_part_5.so CCLD SDP_Types_part_6.so CCLD SDP_Types_part_7.so CCLD Socket_API_Definitions_part_1.so CCLD Socket_API_Definitions_part_2.so CCLD Socket_API_Definitions_part_3.so CCLD Socket_API_Definitions_part_4.so CCLD Socket_API_Definitions_part_5.so CCLD Socket_API_Definitions_part_6.so CCLD Socket_API_Definitions_part_7.so CCLD StatsD_CodecPort_part_1.so CCLD StatsD_CodecPort_part_2.so CCLD StatsD_CodecPort_part_3.so CCLD StatsD_CodecPort_part_4.so CCLD StatsD_CodecPort_part_5.so CCLD StatsD_CodecPort_part_6.so CCLD StatsD_CodecPort_part_7.so CCLD StatsD_CodecPort_CtrlFunct_part_1.so CCLD StatsD_CodecPort_CtrlFunct_part_2.so CCLD StatsD_CodecPort_CtrlFunct_part_3.so CCLD StatsD_CodecPort_CtrlFunct_part_4.so CCLD StatsD_CodecPort_CtrlFunct_part_5.so CCLD StatsD_CodecPort_CtrlFunct_part_6.so CCLD StatsD_CodecPort_CtrlFunct_part_7.so CCLD StatsD_Types_part_1.so CCLD StatsD_Types_part_2.so CCLD StatsD_Types_part_3.so CCLD StatsD_Types_part_4.so CCLD StatsD_Types_part_5.so CCLD StatsD_Types_part_6.so CCLD StatsD_Types_part_7.so CCLD TCCConversion_Functions_part_1.so CCLD TCCConversion_Functions_part_2.so CCLD TCCConversion_Functions_part_3.so CCLD TCCConversion_Functions_part_4.so CCLD TCCConversion_Functions_part_5.so CCLD TCCConversion_Functions_part_6.so CCLD TCCConversion_Functions_part_7.so CCLD TCCInterface_Functions_part_1.so CCLD TCCInterface_Functions_part_2.so CCLD TCCInterface_Functions_part_3.so CCLD TCCInterface_Functions_part_4.so CCLD TCCInterface_Functions_part_5.so CCLD TCCInterface_Functions_part_6.so CCLD TCCInterface_Functions_part_7.so CCLD TELNETasp_PortType_part_1.so CCLD TELNETasp_PortType_part_2.so CCLD TELNETasp_PortType_part_3.so CCLD TELNETasp_PortType_part_4.so CCLD TELNETasp_PortType_part_5.so CCLD TELNETasp_PortType_part_6.so CCLD TELNETasp_PortType_part_7.so CCLD IPA_Emulation.so CCLD RAN_Adapter.so CCLD RAN_Emulation.so CCLD SCCP_Adapter.so CCLD SCCP_Mapping.so CCLD StatsD_Checker.so CCLD IPA_Emulation_part_1.so CCLD IPA_Emulation_part_2.so CCLD IPA_Emulation_part_3.so CCLD IPA_Emulation_part_4.so CCLD IPA_Emulation_part_5.so CCLD IPA_Emulation_part_6.so CCLD RAN_Adapter_part_1.so CCLD RAN_Adapter_part_2.so CCLD IPA_Emulation_part_7.so CCLD RAN_Adapter_part_3.so CCLD RAN_Adapter_part_4.so CCLD RAN_Adapter_part_5.so CCLD RAN_Adapter_part_6.so CCLD RAN_Adapter_part_7.so CCLD RAN_Emulation_part_1.so CCLD RAN_Emulation_part_2.so CCLD RAN_Emulation_part_3.so CCLD RAN_Emulation_part_4.so CCLD RAN_Emulation_part_5.so CCLD RAN_Emulation_part_6.so CCLD RAN_Emulation_part_7.so CCLD SCCP_Adapter_part_1.so CCLD SCCP_Adapter_part_2.so CCLD SCCP_Adapter_part_3.so CCLD SCCP_Adapter_part_4.so CCLD SCCP_Adapter_part_5.so CCLD SCCP_Adapter_part_6.so CCLD SCCP_Adapter_part_7.so CCLD SCCP_Mapping_part_1.so CCLD SCCP_Mapping_part_2.so CCLD SCCP_Mapping_part_3.so CCLD SCCP_Mapping_part_4.so CCLD SCCP_Mapping_part_5.so CCLD SCCP_Mapping_part_6.so CCLD SCCP_Mapping_part_7.so CCLD StatsD_Checker_part_1.so CCLD StatsD_Checker_part_2.so CCLD StatsD_Checker_part_3.so CCLD StatsD_Checker_part_4.so CCLD StatsD_Checker_part_5.so CCLD StatsD_Checker_part_6.so CCLD StatsD_Checker_part_7.so CCLD SDP_parse_.tab.so CCLD lex.SDP_parse_.so CCLD CBSP_CodecPort_CtrlFunctdef.so CCLD IPA_CodecPort_CtrlFunctDef.so CCLD IPL4asp_PT.so CCLD IPL4asp_discovery.so CCLD IuUP_EncDec.so CCLD MGCP_CodecPort_CtrlFunctDef.so CCLD Native_FunctionDefs.so CCLD RTP_CodecPort_CtrlFunctDef.so CCLD RTP_EncDec.so CCLD SCTPasp_PT.so CCLD SDP_EncDec.so CCLD StatsD_CodecPort_CtrlFunctdef.so CCLD TCCConversion.so CCLD TCCInterface.so CCLD TELNETasp_PT.so CCLD BSC_Tests make[1]: Leaving directory '<
https://jenkins.osmocom.org/jenkins/job/ttcn3-bsc-test-vamos/ws/_cache/podm…
'> [1;34m[testenv][vamos] Stopping podman container (restart)[0m [0;94m[testenv][vamos] + ['podman', 'kill', 'testenv-bsc-vamos-osmocom-nightly-20260821-0826-7fdcbfdf-0'][0m testenv-bsc-vamos-osmocom-nightly-20260821-0826-7fdcbfdf-0 [0;94m[testenv][vamos] + ['podman', 'run', '--rm', '--name', 'testenv-bsc-vamos-osmocom-nightly-20260821-0826-7fdcbfdf-1', '--log-driver', 'json-file', '--log-opt', 'path=<
https://jenkins.osmocom.org/jenkins/job/ttcn3-bsc-test-vamos/1921/artifact/…
',> '--security-opt=seccomp=<
https://jenkins.osmocom.org/jenkins/job/ttcn3-bsc-test-vamos/ws/_testenv/da…
',> '--cap-add=NET_ADMIN', '--cap-add=NET_RAW', '--cap-add=SYS_ADMIN', '--device=/dev/net/tun', '--volume', '<
https://jenkins.osmocom.org/jenkins/job/ttcn3-bsc-test-vamos/ws/_cache/podm…
>:/var/cache/apt', '--volume', '<
https://jenkins.osmocom.org/jenkins/job/ttcn3-bsc-test-vamos/ws/_cache/podm…
>:/var/lib/apt', '--sysctl', 'net.ipv4.conf.all.send_redirects=0', '--sysctl', 'net.ipv4.conf.default.send_redirects=0', '-e', 'PODMAN=1', '-e', 'HOST_USER=osmocom-build', '-e', 'TESTENV_BINARY_REPO=1', '--volume', '<
https://jenkins.osmocom.org/jenkins/job/ttcn3-bsc-test-vamos/ws/logs
>:<
https://jenkins.osmocom.org/jenkins/job/ttcn3-bsc-test-vamos/ws/logs
',> '--volume', '<
https://jenkins.osmocom.org/jenkins/job/ttcn3-bsc-test-vamos/ws/_cache
>:<
https://jenkins.osmocom.org/jenkins/job/ttcn3-bsc-test-vamos/ws/_cache
',> '--volume', '/home/osmocom-build/ccache/testenv:/home/osmocom-build/ccache/testenv', '--volume', '/home/osmocom-build/jenkins/workspace:/home/osmocom-build/jenkins/workspace', 'debian-trixie-osmo-ttcn3-testenv', '<
https://jenkins.osmocom.org/jenkins/job/ttcn3-bsc-test-vamos/ws/_testenv/da…
'][0m> [0;94m[testenv] feed_watchdog_loop: podman container has stopped[0m Running testenv-podman-main.sh [0;94m[testenv][vamos] + ['podman', 'exec', '-e', 'CCACHE_DIR=/home/osmocom-build/ccache/testenv', '-e', 'TESTENV_CACHE_DIR=<
https://jenkins.osmocom.org/jenkins/job/ttcn3-bsc-test-vamos/ws/_cache
',> '-e', 'TESTENV_SRC_DIR=/home/osmocom-build/jenkins/workspace', '-e', 'TESTENV_INSTALL_DIR=/', '-e', 'TERM=dumb', '-e', 'PATH=<
https://jenkins.osmocom.org/jenkins/job/ttcn3-bsc-test-vamos/ws/_testenv/da…
>:<
https://jenkins.osmocom.org/jenkins/job/ttcn3-bsc-test-vamos/ws/_testenv/da…
>:<
https://jenkins.osmocom.org/jenkins/job/ttcn3-bsc-test-vamos/ws/bsc
>:/usr/local/bin:/usr/sbin:/usr/bin:/sbin:/bin', '-e', 'HOME=/home/osmocom-build', '-e', 'PYTHONUNBUFFERED=1', '-t', 'testenv-bsc-vamos-osmocom-nightly-20260821-0826-7fdcbfdf-1', 'rm', '/etc/apt/apt.conf.d/docker-clean'][0m [0;94m[testenv][vamos] + ['podman', 'exec', '-e', 'CCACHE_DIR=/home/osmocom-build/ccache/testenv', '-e', 'TESTENV_CACHE_DIR=<
https://jenkins.osmocom.org/jenkins/job/ttcn3-bsc-test-vamos/ws/_cache
',> '-e', 'TESTENV_SRC_DIR=/home/osmocom-build/jenkins/workspace', '-e', 'TESTENV_INSTALL_DIR=/', '-e', 'TERM=dumb', '-e', 'PATH=<
https://jenkins.osmocom.org/jenkins/job/ttcn3-bsc-test-vamos/ws/_testenv/da…
>:<
https://jenkins.osmocom.org/jenkins/job/ttcn3-bsc-test-vamos/ws/_testenv/da…
>:<
https://jenkins.osmocom.org/jenkins/job/ttcn3-bsc-test-vamos/ws/bsc
>:/usr/local/bin:/usr/sbin:/usr/bin:/sbin:/bin', '-e', 'HOME=/home/osmocom-build', '-e', 'PYTHONUNBUFFERED=1', '-t', 'testenv-bsc-vamos-osmocom-nightly-20260821-0826-7fdcbfdf-1', 'sh', '-c', "echo 'deb [signed-by=/obs.key]
https://downloads.osmocom.org/packages/osmocom:/nightly/Debian_13/
./' > /etc/apt/sources.list.d/osmocom.list"][0m [0;94m[testenv][vamos] + ['podman', 'exec', '-e', 'CCACHE_DIR=/home/osmocom-build/ccache/testenv', '-e', 'TESTENV_CACHE_DIR=<
https://jenkins.osmocom.org/jenkins/job/ttcn3-bsc-test-vamos/ws/_cache
',> '-e', 'TESTENV_SRC_DIR=/home/osmocom-build/jenkins/workspace', '-e', 'TESTENV_INSTALL_DIR=/', '-e', 'TERM=dumb', '-e', 'PATH=<
https://jenkins.osmocom.org/jenkins/job/ttcn3-bsc-test-vamos/ws/_testenv/da…
>:<
https://jenkins.osmocom.org/jenkins/job/ttcn3-bsc-test-vamos/ws/_testenv/da…
>:<
https://jenkins.osmocom.org/jenkins/job/ttcn3-bsc-test-vamos/ws/bsc
>:/usr/local/bin:/usr/sbin:/usr/bin:/sbin:/bin', '-e', 'HOME=/home/osmocom-build', '-e', 'PYTHONUNBUFFERED=1', '-t', 'testenv-bsc-vamos-osmocom-nightly-20260821-0826-7fdcbfdf-1', 'sh', '-c', 'echo \'Package: *\nPin: origin "
downloads.osmocom.org
"\nPin-Priority: 1100\n\' > /etc/apt/preferences.d/osmocom-apt-pin'][0m [0;94m[testenv][vamos] + ['podman', 'exec', '-e', 'CCACHE_DIR=/home/osmocom-build/ccache/testenv', '-e', 'TESTENV_CACHE_DIR=<
https://jenkins.osmocom.org/jenkins/job/ttcn3-bsc-test-vamos/ws/_cache
',> '-e', 'TESTENV_SRC_DIR=/home/osmocom-build/jenkins/workspace', '-e', 'TESTENV_INSTALL_DIR=/', '-e', 'TERM=dumb', '-e', 'PATH=<
https://jenkins.osmocom.org/jenkins/job/ttcn3-bsc-test-vamos/ws/_testenv/da…
>:<
https://jenkins.osmocom.org/jenkins/job/ttcn3-bsc-test-vamos/ws/_testenv/da…
>:<
https://jenkins.osmocom.org/jenkins/job/ttcn3-bsc-test-vamos/ws/bsc
>:/usr/local/bin:/usr/sbin:/usr/bin:/sbin:/bin', '-e', 'HOME=/home/osmocom-build', '-e', 'PYTHONUNBUFFERED=1', '-t', 'testenv-bsc-vamos-osmocom-nightly-20260821-0826-7fdcbfdf-1', 'apt-get', '-q', 'update'][0m Hit:1
http://deb.debian.org/debian
trixie InRelease Hit:2
http://deb.debian.org/debian
trixie-updates InRelease Hit:3
http://deb.debian.org/debian-security
trixie-security InRelease Get:4
https://downloads.osmocom.org/packages/osmocom:/nightly/Debian_13
./ InRelease [1620 B] Get:5
https://downloads.osmocom.org/packages/osmocom:/nightly/Debian_13
./ Packages [200 kB] Fetched 201 kB in 1s (275 kB/s) Reading package lists... [0;94m[testenv][vamos] + ['podman', 'exec', '-e', 'CCACHE_DIR=/home/osmocom-build/ccache/testenv', '-e', 'TESTENV_CACHE_DIR=<
https://jenkins.osmocom.org/jenkins/job/ttcn3-bsc-test-vamos/ws/_cache
',> '-e', 'TESTENV_SRC_DIR=/home/osmocom-build/jenkins/workspace', '-e', 'TESTENV_INSTALL_DIR=/', '-e', 'TERM=dumb', '-e', 'PATH=<
https://jenkins.osmocom.org/jenkins/job/ttcn3-bsc-test-vamos/ws/_testenv/da…
>:<
https://jenkins.osmocom.org/jenkins/job/ttcn3-bsc-test-vamos/ws/_testenv/da…
>:<
https://jenkins.osmocom.org/jenkins/job/ttcn3-bsc-test-vamos/ws/bsc
>:/usr/local/bin:/usr/sbin:/usr/bin:/sbin:/bin', '-e', 'HOME=/home/osmocom-build', '-e', 'PYTHONUNBUFFERED=1', '-t', 'testenv-bsc-vamos-osmocom-nightly-20260821-0826-7fdcbfdf-1', 'sh', '-c', 'apt-cache pkgnames | grep -- -dbg > <
https://jenkins.osmocom.org/jenkins/job/ttcn3-bsc-test-vamos/ws/_cache/podm…
'][0m> [0;94m[testenv][vamos] + ['podman', 'exec', '-e', 'CCACHE_DIR=/home/osmocom-build/ccache/testenv', '-e', 'TESTENV_CACHE_DIR=<
https://jenkins.osmocom.org/jenkins/job/ttcn3-bsc-test-vamos/ws/_cache
',> '-e', 'TESTENV_SRC_DIR=/home/osmocom-build/jenkins/workspace', '-e', 'TESTENV_INSTALL_DIR=/', '-e', 'TERM=dumb', '-e', 'PATH=<
https://jenkins.osmocom.org/jenkins/job/ttcn3-bsc-test-vamos/ws/_testenv/da…
>:<
https://jenkins.osmocom.org/jenkins/job/ttcn3-bsc-test-vamos/ws/_testenv/da…
>:<
https://jenkins.osmocom.org/jenkins/job/ttcn3-bsc-test-vamos/ws/bsc
>:/usr/local/bin:/usr/sbin:/usr/bin:/sbin:/bin', '-e', 'HOME=/home/osmocom-build', '-e', 'PYTHONUNBUFFERED=1', '-t', 'testenv-bsc-vamos-osmocom-nightly-20260821-0826-7fdcbfdf-1', 'apt-rdepends', 'osmo-stp'][0m [0;94m[testenv][vamos] osmo-stp -> osmo-stp: installing osmo-stp-dbg[0m [0;94m[testenv][vamos] osmo-stp -> libc6: installing libc6-dbg[0m [0;94m[testenv][vamos] osmo-stp -> libosmo-sigtran12: installing libosmo-sigtran-dbg[0m [0;94m[testenv][vamos] osmo-stp -> libosmo-asn1-tcap1: installing libosmo-asn1-tcap-dbg[0m [0;94m[testenv][vamos] osmo-stp -> libosmocore22: installing libosmocore-dbg[0m [0;94m[testenv][vamos] + ['podman', 'exec', '-e', 'CCACHE_DIR=/home/osmocom-build/ccache/testenv', '-e', 'TESTENV_CACHE_DIR=<
https://jenkins.osmocom.org/jenkins/job/ttcn3-bsc-test-vamos/ws/_cache
',> '-e', 'TESTENV_SRC_DIR=/home/osmocom-build/jenkins/workspace', '-e', 'TESTENV_INSTALL_DIR=/', '-e', 'TERM=dumb', '-e', 'PATH=<
https://jenkins.osmocom.org/jenkins/job/ttcn3-bsc-test-vamos/ws/_testenv/da…
>:<
https://jenkins.osmocom.org/jenkins/job/ttcn3-bsc-test-vamos/ws/_testenv/da…
>:<
https://jenkins.osmocom.org/jenkins/job/ttcn3-bsc-test-vamos/ws/bsc
>:/usr/local/bin:/usr/sbin:/usr/bin:/sbin:/bin', '-e', 'HOME=/home/osmocom-build', '-e', 'PYTHONUNBUFFERED=1', '-t', 'testenv-bsc-vamos-osmocom-nightly-20260821-0826-7fdcbfdf-1', 'apt-rdepends', 'osmo-bts-virtual'][0m [0;94m[testenv][vamos] osmo-bts-virtual -> osmo-bts-virtual: installing osmo-bts-virtual-dbg[0m [0;94m[testenv][vamos] osmo-bts-virtual -> libc6: installing libc6-dbg[0m [0;94m[testenv][vamos] osmo-bts-virtual -> libosmocore22: installing libosmocore-dbg[0m [0;94m[testenv][vamos] + ['podman', 'exec', '-e', 'CCACHE_DIR=/home/osmocom-build/ccache/testenv', '-e', 'TESTENV_CACHE_DIR=<
https://jenkins.osmocom.org/jenkins/job/ttcn3-bsc-test-vamos/ws/_cache
',> '-e', 'TESTENV_SRC_DIR=/home/osmocom-build/jenkins/workspace', '-e', 'TESTENV_INSTALL_DIR=/', '-e', 'TERM=dumb', '-e', 'PATH=<
https://jenkins.osmocom.org/jenkins/job/ttcn3-bsc-test-vamos/ws/_testenv/da…
>:<
https://jenkins.osmocom.org/jenkins/job/ttcn3-bsc-test-vamos/ws/_testenv/da…
>:<
https://jenkins.osmocom.org/jenkins/job/ttcn3-bsc-test-vamos/ws/bsc
>:/usr/local/bin:/usr/sbin:/usr/bin:/sbin:/bin', '-e', 'HOME=/home/osmocom-build', '-e', 'PYTHONUNBUFFERED=1', '-t', 'testenv-bsc-vamos-osmocom-nightly-20260821-0826-7fdcbfdf-1', 'apt-rdepends', 'osmo-bsc'][0m [0;94m[testenv][vamos] osmo-bsc -> osmo-bsc: installing osmo-bsc-dbg[0m [0;94m[testenv][vamos] osmo-bsc -> libc6: installing libc6-dbg[0m [0;94m[testenv][vamos] osmo-bsc -> libosmo-mgcp-client14: installing libosmo-mgcp-client14-dbgsym[0m [0;94m[testenv][vamos] osmo-bsc -> libosmocore22: installing libosmocore-dbg[0m [0;94m[testenv][vamos] osmo-bsc -> libosmo-sigtran12: installing libosmo-sigtran-dbg[0m [0;94m[testenv][vamos] osmo-bsc -> libosmo-asn1-tcap1: installing libosmo-asn1-tcap-dbg[0m [1;34m[testenv][vamos] Installing packages: osmo-stp, osmo-bts-virtual, osmo-bsc, osmo-stp-dbg, libc6-dbg, libosmo-sigtran-dbg, libosmo-asn1-tcap-dbg, libosmocore-dbg, osmo-bts-virtual-dbg, osmo-bsc-dbg, libosmo-mgcp-client14-dbgsym[0m [0;94m[testenv][vamos] + ['podman', 'exec', '-e', 'CCACHE_DIR=/home/osmocom-build/ccache/testenv', '-e', 'TESTENV_CACHE_DIR=<
https://jenkins.osmocom.org/jenkins/job/ttcn3-bsc-test-vamos/ws/_cache
',> '-e', 'TESTENV_SRC_DIR=/home/osmocom-build/jenkins/workspace', '-e', 'TESTENV_INSTALL_DIR=/', '-e', 'TERM=dumb', '-e', 'PATH=<
https://jenkins.osmocom.org/jenkins/job/ttcn3-bsc-test-vamos/ws/_testenv/da…
>:<
https://jenkins.osmocom.org/jenkins/job/ttcn3-bsc-test-vamos/ws/_testenv/da…
>:<
https://jenkins.osmocom.org/jenkins/job/ttcn3-bsc-test-vamos/ws/bsc
>:/usr/local/bin:/usr/sbin:/usr/bin:/sbin:/bin', '-e', 'HOME=/home/osmocom-build', '-e', 'PYTHONUNBUFFERED=1', '-t', 'testenv-bsc-vamos-osmocom-nightly-20260821-0826-7fdcbfdf-1', 'apt-get', '-q', 'install', '-y', '--no-install-recommends', 'osmo-stp', 'osmo-bts-virtual', 'osmo-bsc', 'osmo-stp-dbg', 'libc6-dbg', 'libosmo-sigtran-dbg', 'libosmo-asn1-tcap-dbg', 'libosmocore-dbg', 'osmo-bts-virtual-dbg', 'osmo-bsc-dbg', 'libosmo-mgcp-client14-dbgsym'][0m Reading package lists... Building dependency tree... Solving dependencies... Some packages could not be installed. This may mean that you have requested an impossible situation or if you are using the unstable distribution that some required packages have not yet been created or been moved out of Incoming. The following information may help to resolve the situation: The following packages have unmet dependencies: libosmo-mgcp-client14 : Depends: osmocom-nightly (= 202608191800) but 202608201800 is to be installed osmo-bsc : Depends: osmocom-nightly (= 202608191800) but 202608201800 is to be installed osmo-bsc-dbg : Depends: osmocom-nightly (= 202608191800) but 202608201800 is to be installed E: Unable to correct problems, you have held broken packages. E: The following information from --solver 3.0 may provide additional context: Unable to satisfy dependencies. Reached two conflicting decisions: 1. osmo-bsc:amd64=1.14.0.40.779dd6.202608191800 is selected for install 2. osmo-bsc:amd64=1.14.0.40.779dd6.202608191800 Depends osmocom-nightly (= 202608191800) but none of the choices are installable: [no choices] [1;91m[testenv][vamos] Command failed unexpectedly[0m [0;94m[testenv][vamos] Command: ['podman', 'exec', '-e', 'CCACHE_DIR=/home/osmocom-build/ccache/testenv', '-e', 'TESTENV_CACHE_DIR=<
https://jenkins.osmocom.org/jenkins/job/ttcn3-bsc-test-vamos/ws/_cache
',> '-e', 'TESTENV_SRC_DIR=/home/osmocom-build/jenkins/workspace', '-e', 'TESTENV_INSTALL_DIR=/', '-e', 'TERM=dumb', '-e', 'PATH=<
https://jenkins.osmocom.org/jenkins/job/ttcn3-bsc-test-vamos/ws/_testenv/da…
>:<
https://jenkins.osmocom.org/jenkins/job/ttcn3-bsc-test-vamos/ws/_testenv/da…
>:<
https://jenkins.osmocom.org/jenkins/job/ttcn3-bsc-test-vamos/ws/bsc
>:/usr/local/bin:/usr/sbin:/usr/bin:/sbin:/bin', '-e', 'HOME=/home/osmocom-build', '-e', 'PYTHONUNBUFFERED=1', '-t', 'testenv-bsc-vamos-osmocom-nightly-20260821-0826-7fdcbfdf-1', 'apt-get', '-q', 'install', '-y', '--no-install-recommends', 'osmo-stp', 'osmo-bts-virtual', 'osmo-bsc', 'osmo-stp-dbg', 'libc6-dbg', 'libosmo-sigtran-dbg', 'libosmo-asn1-tcap-dbg', 'libosmocore-dbg', 'osmo-bts-virtual-dbg', 'osmo-bsc-dbg', 'libosmo-mgcp-client14-dbgsym'][0m [0;94m[testenv][vamos] Returncode: 100[0m [1;34m[testenv][vamos] Stopping podman container[0m [0;94m[testenv][vamos] + ['podman', 'kill', 'testenv-bsc-vamos-osmocom-nightly-20260821-0826-7fdcbfdf-1'][0m testenv-bsc-vamos-osmocom-nightly-20260821-0826-7fdcbfdf-1 Traceback (most recent call last): File "<
https://jenkins.osmocom.org/jenkins/job/ttcn3-bsc-test-vamos/ws/./testenv.py
",> line 135, in <module> main() File "<
https://jenkins.osmocom.org/jenkins/job/ttcn3-bsc-test-vamos/ws/./testenv.py
",> line 124, in main run() File "<
https://jenkins.osmocom.org/jenkins/job/ttcn3-bsc-test-vamos/ws/./testenv.py
",> line 73, in run testenv.podman_install.packages(cfg, cfg_name) File "<
https://jenkins.osmocom.org/jenkins/job/ttcn3-bsc-test-vamos/ws/_testenv/te…
",> line 233, in packages apt_install(packages) File "<
https://jenkins.osmocom.org/jenkins/job/ttcn3-bsc-test-vamos/ws/_testenv/te…
",> line 99, in apt_install testenv.cmd.run(["apt-get", "-q", "install", "-y", "--no-install-recommends"] + pkgs) File "<
https://jenkins.osmocom.org/jenkins/job/ttcn3-bsc-test-vamos/ws/_testenv/te…
",> line 127, in run return testenv.podman.exec_cmd(cmd, check=check, env=env, **kwargs) ^^^^^^^^^^^^^^^^^^^^^^^^^^^^^^^^^^^^^^^^^^^^^^^^^^^^^^^^^^^^ File "<
https://jenkins.osmocom.org/jenkins/job/ttcn3-bsc-test-vamos/ws/_testenv/te…
",> line 156, in exec_cmd return testenv.cmd.run( ^^^^^^^^^^^^^^^^ File "<
https://jenkins.osmocom.org/jenkins/job/ttcn3-bsc-test-vamos/ws/_testenv/te…
",> line 144, in run exit_error_cmd(p, "Command failed unexpectedly") File "<
https://jenkins.osmocom.org/jenkins/job/ttcn3-bsc-test-vamos/ws/_testenv/te…
",> line 88, in exit_error_cmd raise RuntimeError("shell command related error, find details right above this python trace") RuntimeError: shell command related error, find details right above this python trace [0;94m[testenv][vamos] feed_watchdog_loop: podman container has stopped[0m [1;34m[testenv][vamos] Logs saved to:
https://jenkins.osmocom.org/jenkins/job/ttcn3-bsc-test-vamos/1921/artifact/…
[0m + RC=1 + [ 1 = 0 ] + uptime + grep --color=always -o load.* [01;31m[Kload average: 22.89, 13.82, 7.04[m[K + exit 1 Build step 'Execute shell' marked build as failure Recording test results ERROR: Step ‘Publish JUnit test result report’ failed: No test report files were found. Configuration error?
1
1
0
0
Build failed in Jenkins: Osmocom-repo-install-debian11 » latest,qemu #1543
by jenkins@lists.osmocom.org
22 Aug '26
22 Aug '26
See <
https://jenkins.osmocom.org/jenkins/job/Osmocom-repo-install-debian11/feed=…
> Changes: [Oliver Smith] Revert "jobs: run ttcn3-remsim-test-asan with bookworm" ------------------------------------------ [...truncated 19.92 KiB...] rehash: warning: skipping ca-certificates.crt,it does not contain exactly one certificate or CRL 45 added, 24 removed; done. Setting up gnupg-l10n (2.2.27-2+deb11u3) ... Setting up libsigc++-2.0-0v5:amd64 (2.10.4-2) ... Setting up aptitude-common (0.8.13-3) ... Setting up gpgconf (2.2.27-2+deb11u3) ... Setting up gpg (2.2.27-2+deb11u3) ... Setting up gnupg-utils (2.2.27-2+deb11u3) ... Setting up pinentry-curses (1.1.0-4) ... Setting up gpg-agent (2.2.27-2+deb11u3) ... Created symlink /etc/systemd/user/sockets.target.wants/gpg-agent-browser.socket → /usr/lib/systemd/user/gpg-agent-browser.socket. Created symlink /etc/systemd/user/sockets.target.wants/gpg-agent-extra.socket → /usr/lib/systemd/user/gpg-agent-extra.socket. Created symlink /etc/systemd/user/sockets.target.wants/gpg-agent-ssh.socket → /usr/lib/systemd/user/gpg-agent-ssh.socket. Created symlink /etc/systemd/user/sockets.target.wants/gpg-agent.socket → /usr/lib/systemd/user/gpg-agent.socket. Setting up gpgsm (2.2.27-2+deb11u3) ... Setting up dirmngr (2.2.27-2+deb11u3) ... Created symlink /etc/systemd/user/sockets.target.wants/dirmngr.socket → /usr/lib/systemd/user/dirmngr.socket. Setting up libcwidget4:amd64 (0.5.18-5) ... Setting up aptitude (0.8.13-3) ... update-alternatives: using /usr/bin/aptitude-curses to provide /usr/bin/aptitude (aptitude) in auto mode Setting up gpg-wks-server (2.2.27-2+deb11u3) ... Setting up gpg-wks-client (2.2.27-2+deb11u3) ... Setting up gnupg (2.2.27-2+deb11u3) ... Setting up gnupg2 (2.2.27-2+deb11u3) ... Processing triggers for man-db (2.9.4-2) ... Processing triggers for libc-bin (2.31-13+deb11u2) ... Processing triggers for ca-certificates (20250419~deb12u1~deb11u1) ... Updating certificates in /etc/ssl/certs... 0 added, 0 removed; done. Running hooks in /etc/ca-certificates/update.d... done. + configure_osmocom_repo osmocom:latest + configure_osmocom_repo_debian osmocom:latest + local proj=osmocom:latest + proj_with_slashes osmocom:latest + echo osmocom:latest + sed s.:.:/.g Configuring Osmocom repository + local
obs_repo=downloads.osmocom.org/packages/osmocom:/latest/Debian_11/
+ echo Configuring Osmocom repository + [ -e /tmp/Release.key ] + wget -O /tmp/Release.key
https://obs.osmocom.org/projects/osmocom:latest/public_key
--2026-08-21 02:58:49--
https://obs.osmocom.org/projects/osmocom:latest/public_key
Resolving
obs.osmocom.org
(
obs.osmocom.org
)... 148.251.236.141, 2a01:4f8:201:344a::2 Connecting to
obs.osmocom.org
(obs.osmocom.org)|148.251.236.141|:443... connected. HTTP request sent, awaiting response... 200 OK Length: unspecified [application/octet-stream] Saving to: ‘/tmp/Release.key’ 0K . 3.33M=0s 2026-08-21 02:58:49 (3.33 MB/s) - ‘/tmp/Release.key’ saved [1422] + echo deb [signed-by=/tmp/Release.key]
http://downloads.osmocom.org/packages/osmocom:/latest/Debian_11/
./ + apt-get update Hit:1
http://deb.debian.org/debian
bullseye InRelease Hit:2
http://security.debian.org/debian-security
bullseye-security InRelease Hit:3
http://deb.debian.org/debian
bullseye-updates InRelease Get:4
https://downloads.osmocom.org/packages/osmocom:/latest/Debian_11
./ InRelease [1,621 B] Get:5
https://downloads.osmocom.org/packages/osmocom:/latest/Debian_11
./ Packages [170 kB] Fetched 172 kB in 1s (209 kB/s) Reading package lists... + uname -a Linux unassigned-hostname 5.10.0-9-amd64 #1 SMP Debian 5.10.70-1 (2021-09-30) x86_64 GNU/Linux ### Running test: test_conflict ### + set +x + test_conflict + test_conflict_debian + [ debian11 = debian10 ] + apt-get -y install libosmocore osmocom-latest Reading package lists... Building dependency tree... Reading state information... The following additional packages will be installed: libosmocodec4 libosmocoding0 libosmocore22 libosmoctrl0 libosmogb14 libosmogsm20 libosmoisdn0 libosmosim2 libosmousb0 libosmovty13 libpcsclite1 libsctp1 libtalloc2 osmocom-keyring Suggested packages: pcscd lksctp-tools The following NEW packages will be installed: libosmocodec4 libosmocoding0 libosmocore libosmocore22 libosmoctrl0 libosmogb14 libosmogsm20 libosmoisdn0 libosmosim2 libosmousb0 libosmovty13 libpcsclite1 libsctp1 libtalloc2 osmocom-keyring osmocom-latest 0 upgraded, 16 newly installed, 0 to remove and 149 not upgraded. Need to get 1,421 kB of archives. After this operation, 3,119 kB of additional disk space will be used. Get:14
http://deb.debian.org/debian
bullseye/main amd64 libsctp1 amd64 1.0.18+dfsg-1 [28.3 kB] Get:15
http://deb.debian.org/debian
bullseye/main amd64 libtalloc2 amd64 2.3.1-2+b1 [29.3 kB] Get:16
http://deb.debian.org/debian
bullseye/main amd64 libpcsclite1 amd64 1.9.1-1 [60.2 kB] Get:1
https://downloads.osmocom.org/packages/osmocom:/latest/Debian_11
./ osmocom-keyring 1.1.1 [3,084 B] Get:2
https://downloads.osmocom.org/packages/osmocom:/latest/Debian_11
./ osmocom-latest 1.1.0 [1,184 B] Get:3
https://downloads.osmocom.org/packages/osmocom:/latest/Debian_11
./ libosmocore22 1.14.2 [192 kB] Get:4
https://downloads.osmocom.org/packages/osmocom:/latest/Debian_11
./ libosmocodec4 1.14.2 [70.8 kB] Get:5
https://downloads.osmocom.org/packages/osmocom:/latest/Debian_11
./ libosmoisdn0 1.14.2 [89.3 kB] Get:6
https://downloads.osmocom.org/packages/osmocom:/latest/Debian_11
./ libosmogsm20 1.14.2 [246 kB] Get:7
https://downloads.osmocom.org/packages/osmocom:/latest/Debian_11
./ libosmocoding0 1.14.2 [90.3 kB] Get:8
https://downloads.osmocom.org/packages/osmocom:/latest/Debian_11
./ libosmovty13 1.14.2 [123 kB] Get:9
https://downloads.osmocom.org/packages/osmocom:/latest/Debian_11
./ libosmogb14 1.14.2 [196 kB] Get:10
https://downloads.osmocom.org/packages/osmocom:/latest/Debian_11
./ libosmoctrl0 1.14.2 [78.7 kB] Get:11
https://downloads.osmocom.org/packages/osmocom:/latest/Debian_11
./ libosmosim2 1.14.2 [82.4 kB] Get:12
https://downloads.osmocom.org/packages/osmocom:/latest/Debian_11
./ libosmousb0 1.14.2 [68.9 kB] Get:13
https://downloads.osmocom.org/packages/osmocom:/latest/Debian_11
./ libosmocore 1.14.2 [62.3 kB] debconf: unable to initialize frontend: Dialog debconf: (TERM is not set, so the dialog frontend is not usable.) debconf: falling back to frontend: Readline debconf: unable to initialize frontend: Readline debconf: (This frontend requires a controlling tty.) debconf: falling back to frontend: Teletype dpkg-preconfigure: unable to re-open stdin: Fetched 1,421 kB in 0s (25.8 MB/s) Selecting previously unselected package osmocom-keyring. (Reading database ... (Reading database ... 5%(Reading database ... 10%(Reading database ... 15%(Reading database ... 20%(Reading database ... 25%(Reading database ... 30%(Reading database ... 35%(Reading database ... 40%(Reading database ... 45%(Reading database ... 50%(Reading database ... 55%(Reading database ... 60%(Reading database ... 65%(Reading database ... 70%(Reading database ... 75%(Reading database ... 80%(Reading database ... 85%(Reading database ... 90%(Reading database ... 95%(Reading database ... 100%(Reading database ... 28393 files and directories currently installed.) Preparing to unpack .../00-osmocom-keyring_1.1.1_amd64.deb ... Unpacking osmocom-keyring (1.1.1) ... Selecting previously unselected package osmocom-latest. Preparing to unpack .../01-osmocom-latest_1.1.0_amd64.deb ... Unpacking osmocom-latest (1.1.0) ... Selecting previously unselected package libsctp1:amd64. Preparing to unpack .../02-libsctp1_1.0.18+dfsg-1_amd64.deb ... Unpacking libsctp1:amd64 (1.0.18+dfsg-1) ... Selecting previously unselected package libtalloc2:amd64. Preparing to unpack .../03-libtalloc2_2.3.1-2+b1_amd64.deb ... Unpacking libtalloc2:amd64 (2.3.1-2+b1) ... Selecting previously unselected package libosmocore22:amd64. Preparing to unpack .../04-libosmocore22_1.14.2_amd64.deb ... Unpacking libosmocore22:amd64 (1.14.2) ... Selecting previously unselected package libosmocodec4:amd64. Preparing to unpack .../05-libosmocodec4_1.14.2_amd64.deb ... Unpacking libosmocodec4:amd64 (1.14.2) ... Selecting previously unselected package libosmoisdn0:amd64. Preparing to unpack .../06-libosmoisdn0_1.14.2_amd64.deb ... Unpacking libosmoisdn0:amd64 (1.14.2) ... Selecting previously unselected package libosmogsm20:amd64. Preparing to unpack .../07-libosmogsm20_1.14.2_amd64.deb ... Unpacking libosmogsm20:amd64 (1.14.2) ... Selecting previously unselected package libosmocoding0:amd64. Preparing to unpack .../08-libosmocoding0_1.14.2_amd64.deb ... Unpacking libosmocoding0:amd64 (1.14.2) ... Selecting previously unselected package libosmovty13:amd64. Preparing to unpack .../09-libosmovty13_1.14.2_amd64.deb ... Unpacking libosmovty13:amd64 (1.14.2) ... Selecting previously unselected package libosmogb14:amd64. Preparing to unpack .../10-libosmogb14_1.14.2_amd64.deb ... Unpacking libosmogb14:amd64 (1.14.2) ... Selecting previously unselected package libosmoctrl0:amd64. Preparing to unpack .../11-libosmoctrl0_1.14.2_amd64.deb ... Unpacking libosmoctrl0:amd64 (1.14.2) ... Selecting previously unselected package libpcsclite1:amd64. Preparing to unpack .../12-libpcsclite1_1.9.1-1_amd64.deb ... Unpacking libpcsclite1:amd64 (1.9.1-1) ... Selecting previously unselected package libosmosim2:amd64. Preparing to unpack .../13-libosmosim2_1.14.2_amd64.deb ... Unpacking libosmosim2:amd64 (1.14.2) ... Selecting previously unselected package libosmousb0:amd64. Preparing to unpack .../14-libosmousb0_1.14.2_amd64.deb ... Unpacking libosmousb0:amd64 (1.14.2) ... Selecting previously unselected package libosmocore. Preparing to unpack .../15-libosmocore_1.14.2_amd64.deb ... Unpacking libosmocore (1.14.2) ... Setting up libtalloc2:amd64 (2.3.1-2+b1) ... Setting up libpcsclite1:amd64 (1.9.1-1) ... Setting up osmocom-keyring (1.1.1) ... Setting up libsctp1:amd64 (1.0.18+dfsg-1) ... Setting up osmocom-latest (1.1.0) ... Setting up libosmocore22:amd64 (1.14.2) ... Setting up libosmocodec4:amd64 (1.14.2) ... Setting up libosmovty13:amd64 (1.14.2) ... Setting up libosmoisdn0:amd64 (1.14.2) ... Setting up libosmousb0:amd64 (1.14.2) ... Setting up libosmogsm20:amd64 (1.14.2) ... Setting up libosmoctrl0:amd64 (1.14.2) ... Setting up libosmogb14:amd64 (1.14.2) ... Setting up libosmocoding0:amd64 (1.14.2) ... Setting up libosmosim2:amd64 (1.14.2) ... Setting up libosmocore (1.14.2) ... Processing triggers for libc-bin (2.31-13+deb11u2) ... + apt-mark hold osmocom-latest osmocom-latest set on hold. + configure_osmocom_repo_debian_remove osmocom:latest + local proj=osmocom:latest + rm /etc/apt/sources.list.d/osmocom:latest.list + configure_osmocom_repo_debian osmocom:nightly + local proj=osmocom:nightly + proj_with_slashes osmocom:nightly + echo osmocom:nightly + sed s.:.:/.g Configuring Osmocom repository + local
obs_repo=downloads.osmocom.org/packages/osmocom:/nightly/Debian_11/
+ echo Configuring Osmocom repository + [ -e /tmp/Release.key ] + echo deb [signed-by=/tmp/Release.key]
http://downloads.osmocom.org/packages/osmocom:/nightly/Debian_11/
./ + apt-get update Hit:2
http://deb.debian.org/debian
bullseye InRelease Hit:3
http://deb.debian.org/debian
bullseye-updates InRelease Hit:4
http://security.debian.org/debian-security
bullseye-security InRelease Get:1
https://downloads.osmocom.org/packages/osmocom:/nightly/Debian_11
./ InRelease [1,617 B] Get:5
https://downloads.osmocom.org/packages/osmocom:/nightly/Debian_11
./ Packages [168 kB] Fetched 170 kB in 1s (233 kB/s) Reading package lists... + apt-get -y install osmo-mgw + tee /tmp/out Reading package lists... Building dependency tree... Reading state information... Some packages could not be installed. This may mean that you have requested an impossible situation or if you are using the unstable distribution that some required packages have not yet been created or been moved out of Incoming. The following information may help to resolve the situation: The following packages have unmet dependencies: osmo-mgw : Depends: osmocom-nightly (= 202608191800) but it is not going to be installed Depends: libosmoabis15 but it is not installable Depends: libosmonetif11 but it is not going to be installed Depends: libosmotrau11 but it is not going to be installed E: Unable to correct problems, you have held broken packages. + [ -e /tmp/fail ] + find_patterns_or_exit /tmp/out requested an impossible situation ^The following packages have unmet dependencies: + local file=/tmp/out + local pattern + shift + grep -q requested an impossible situation /tmp/out + continue + grep -q ^The following packages have unmet dependencies: /tmp/out + continue + find_patterns_or_exit /tmp/out Conflicts: osmocom- + local file=/tmp/out + local pattern + shift + grep -q Conflicts: osmocom- /tmp/out ERROR: could not find pattern 'Conflicts: osmocom-' in file '/tmp/out'! + echo ERROR: could not find pattern 'Conflicts: osmocom-' in file '/tmp/out'! + exit 1 + clean_up_trap + [ -n ] + set +x ### Clean up ### + trap - EXIT INT TERM 0 + clean_up + [ -n ] + [ -e _repo_install_test_data/qemu.pid ] + cat _repo_install_test_data/qemu.pid + kill 1415989 + rm -f _repo_install_test_data/temp.qcow2 Build step 'Execute shell' marked build as failure
1
1
0
0
Build failed in Jenkins: Osmocom-repo-install-debian11 » nightly,qemu #1543
by jenkins@lists.osmocom.org
22 Aug '26
22 Aug '26
See <
https://jenkins.osmocom.org/jenkins/job/Osmocom-repo-install-debian11/feed=…
> Changes: [Oliver Smith] Revert "jobs: run ttcn3-remsim-test-asan with bookworm" ------------------------------------------ [...truncated 19.92 KiB...] rehash: warning: skipping ca-certificates.crt,it does not contain exactly one certificate or CRL 45 added, 24 removed; done. Setting up gnupg-l10n (2.2.27-2+deb11u3) ... Setting up libsigc++-2.0-0v5:amd64 (2.10.4-2) ... Setting up aptitude-common (0.8.13-3) ... Setting up gpgconf (2.2.27-2+deb11u3) ... Setting up gpg (2.2.27-2+deb11u3) ... Setting up gnupg-utils (2.2.27-2+deb11u3) ... Setting up pinentry-curses (1.1.0-4) ... Setting up gpg-agent (2.2.27-2+deb11u3) ... Created symlink /etc/systemd/user/sockets.target.wants/gpg-agent-browser.socket → /usr/lib/systemd/user/gpg-agent-browser.socket. Created symlink /etc/systemd/user/sockets.target.wants/gpg-agent-extra.socket → /usr/lib/systemd/user/gpg-agent-extra.socket. Created symlink /etc/systemd/user/sockets.target.wants/gpg-agent-ssh.socket → /usr/lib/systemd/user/gpg-agent-ssh.socket. Created symlink /etc/systemd/user/sockets.target.wants/gpg-agent.socket → /usr/lib/systemd/user/gpg-agent.socket. Setting up gpgsm (2.2.27-2+deb11u3) ... Setting up dirmngr (2.2.27-2+deb11u3) ... Created symlink /etc/systemd/user/sockets.target.wants/dirmngr.socket → /usr/lib/systemd/user/dirmngr.socket. Setting up libcwidget4:amd64 (0.5.18-5) ... Setting up aptitude (0.8.13-3) ... update-alternatives: using /usr/bin/aptitude-curses to provide /usr/bin/aptitude (aptitude) in auto mode Setting up gpg-wks-server (2.2.27-2+deb11u3) ... Setting up gpg-wks-client (2.2.27-2+deb11u3) ... Setting up gnupg (2.2.27-2+deb11u3) ... Setting up gnupg2 (2.2.27-2+deb11u3) ... Processing triggers for man-db (2.9.4-2) ... Processing triggers for libc-bin (2.31-13+deb11u2) ... Processing triggers for ca-certificates (20250419~deb12u1~deb11u1) ... Updating certificates in /etc/ssl/certs... 0 added, 0 removed; done. Running hooks in /etc/ca-certificates/update.d... done. + configure_osmocom_repo osmocom:nightly + configure_osmocom_repo_debian osmocom:nightly + local proj=osmocom:nightly + proj_with_slashes osmocom:nightly + sed s.:.:/.g + echo osmocom:nightly Configuring Osmocom repository + local
obs_repo=downloads.osmocom.org/packages/osmocom:/nightly/Debian_11/
+ echo Configuring Osmocom repository + [ -e /tmp/Release.key ] + wget -O /tmp/Release.key
https://obs.osmocom.org/projects/osmocom:nightly/public_key
--2026-08-21 02:58:52--
https://obs.osmocom.org/projects/osmocom:nightly/public_key
Resolving
obs.osmocom.org
(
obs.osmocom.org
)... 148.251.236.141, 2a01:4f8:201:344a::2 Connecting to
obs.osmocom.org
(obs.osmocom.org)|148.251.236.141|:443... connected. HTTP request sent, awaiting response... 200 OK Length: unspecified [application/octet-stream] Saving to: ‘/tmp/Release.key’ 0K . 26.3M=0s 2026-08-21 02:58:52 (26.3 MB/s) - ‘/tmp/Release.key’ saved [1422] + echo deb [signed-by=/tmp/Release.key]
http://downloads.osmocom.org/packages/osmocom:/nightly/Debian_11/
./ + apt-get update Hit:2
http://deb.debian.org/debian
bullseye InRelease Hit:3
http://security.debian.org/debian-security
bullseye-security InRelease Hit:4
http://deb.debian.org/debian
bullseye-updates InRelease Get:1
https://downloads.osmocom.org/packages/osmocom:/nightly/Debian_11
./ InRelease [1,617 B] Get:5
https://downloads.osmocom.org/packages/osmocom:/nightly/Debian_11
./ Packages [168 kB] Fetched 170 kB in 1s (214 kB/s) Reading package lists... + uname -a Linux unassigned-hostname 5.10.0-9-amd64 #1 SMP Debian 5.10.70-1 (2021-09-30) x86_64 GNU/Linux ### Running test: test_conflict ### + set +x + test_conflict + test_conflict_debian + [ debian11 = debian10 ] + apt-get -y install libosmocore osmocom-nightly Reading package lists... Building dependency tree... Reading state information... The following additional packages will be installed: libosmocodec4 libosmocoding0 libosmocore22 libosmoctrl0 libosmogb14 libosmogsm20 libosmoisdn0 libosmosim2 libosmousb0 libosmovty13 libpcsclite1 libsctp1 libtalloc2 osmocom-keyring Suggested packages: pcscd lksctp-tools The following NEW packages will be installed: libosmocodec4 libosmocoding0 libosmocore libosmocore22 libosmoctrl0 libosmogb14 libosmogsm20 libosmoisdn0 libosmosim2 libosmousb0 libosmovty13 libpcsclite1 libsctp1 libtalloc2 osmocom-keyring osmocom-nightly 0 upgraded, 16 newly installed, 0 to remove and 149 not upgraded. Need to get 1,422 kB of archives. After this operation, 3,119 kB of additional disk space will be used. Get:14
http://deb.debian.org/debian
bullseye/main amd64 libsctp1 amd64 1.0.18+dfsg-1 [28.3 kB] Get:15
http://deb.debian.org/debian
bullseye/main amd64 libtalloc2 amd64 2.3.1-2+b1 [29.3 kB] Get:16
http://deb.debian.org/debian
bullseye/main amd64 libpcsclite1 amd64 1.9.1-1 [60.2 kB] Get:1
https://downloads.osmocom.org/packages/osmocom:/nightly/Debian_11
./ osmocom-keyring 1.1.1.8.7873.202608201800 [3,196 B] Get:2
https://downloads.osmocom.org/packages/osmocom:/nightly/Debian_11
./ osmocom-nightly 202608201800 [1,192 B] Get:3
https://downloads.osmocom.org/packages/osmocom:/nightly/Debian_11
./ libosmocore22 1.14.2.0.202608201800 [192 kB] Get:4
https://downloads.osmocom.org/packages/osmocom:/nightly/Debian_11
./ libosmocodec4 1.14.2.0.202608201800 [71.0 kB] Get:5
https://downloads.osmocom.org/packages/osmocom:/nightly/Debian_11
./ libosmoisdn0 1.14.2.0.202608201800 [89.4 kB] Get:6
https://downloads.osmocom.org/packages/osmocom:/nightly/Debian_11
./ libosmogsm20 1.14.2.0.202608201800 [246 kB] Get:7
https://downloads.osmocom.org/packages/osmocom:/nightly/Debian_11
./ libosmocoding0 1.14.2.0.202608201800 [90.3 kB] Get:8
https://downloads.osmocom.org/packages/osmocom:/nightly/Debian_11
./ libosmovty13 1.14.2.0.202608201800 [123 kB] Get:9
https://downloads.osmocom.org/packages/osmocom:/nightly/Debian_11
./ libosmogb14 1.14.2.0.202608201800 [196 kB] Get:10
https://downloads.osmocom.org/packages/osmocom:/nightly/Debian_11
./ libosmoctrl0 1.14.2.0.202608201800 [78.7 kB] Get:11
https://downloads.osmocom.org/packages/osmocom:/nightly/Debian_11
./ libosmosim2 1.14.2.0.202608201800 [82.5 kB] Get:12
https://downloads.osmocom.org/packages/osmocom:/nightly/Debian_11
./ libosmousb0 1.14.2.0.202608201800 [69.0 kB] Get:13
https://downloads.osmocom.org/packages/osmocom:/nightly/Debian_11
./ libosmocore 1.14.2.0.202608201800 [62.4 kB] debconf: unable to initialize frontend: Dialog debconf: (TERM is not set, so the dialog frontend is not usable.) debconf: falling back to frontend: Readline debconf: unable to initialize frontend: Readline debconf: (This frontend requires a controlling tty.) debconf: falling back to frontend: Teletype dpkg-preconfigure: unable to re-open stdin: Fetched 1,422 kB in 1s (1,711 kB/s) Selecting previously unselected package osmocom-keyring. (Reading database ... (Reading database ... 5%(Reading database ... 10%(Reading database ... 15%(Reading database ... 20%(Reading database ... 25%(Reading database ... 30%(Reading database ... 35%(Reading database ... 40%(Reading database ... 45%(Reading database ... 50%(Reading database ... 55%(Reading database ... 60%(Reading database ... 65%(Reading database ... 70%(Reading database ... 75%(Reading database ... 80%(Reading database ... 85%(Reading database ... 90%(Reading database ... 95%(Reading database ... 100%(Reading database ... 28393 files and directories currently installed.) Preparing to unpack .../00-osmocom-keyring_1.1.1.8.7873.202608201800_amd64.deb ... Unpacking osmocom-keyring (1.1.1.8.7873.202608201800) ... Selecting previously unselected package osmocom-nightly. Preparing to unpack .../01-osmocom-nightly_202608201800_amd64.deb ... Unpacking osmocom-nightly (202608201800) ... Selecting previously unselected package libsctp1:amd64. Preparing to unpack .../02-libsctp1_1.0.18+dfsg-1_amd64.deb ... Unpacking libsctp1:amd64 (1.0.18+dfsg-1) ... Selecting previously unselected package libtalloc2:amd64. Preparing to unpack .../03-libtalloc2_2.3.1-2+b1_amd64.deb ... Unpacking libtalloc2:amd64 (2.3.1-2+b1) ... Selecting previously unselected package libosmocore22:amd64. Preparing to unpack .../04-libosmocore22_1.14.2.0.202608201800_amd64.deb ... Unpacking libosmocore22:amd64 (1.14.2.0.202608201800) ... Selecting previously unselected package libosmocodec4:amd64. Preparing to unpack .../05-libosmocodec4_1.14.2.0.202608201800_amd64.deb ... Unpacking libosmocodec4:amd64 (1.14.2.0.202608201800) ... Selecting previously unselected package libosmoisdn0:amd64. Preparing to unpack .../06-libosmoisdn0_1.14.2.0.202608201800_amd64.deb ... Unpacking libosmoisdn0:amd64 (1.14.2.0.202608201800) ... Selecting previously unselected package libosmogsm20:amd64. Preparing to unpack .../07-libosmogsm20_1.14.2.0.202608201800_amd64.deb ... Unpacking libosmogsm20:amd64 (1.14.2.0.202608201800) ... Selecting previously unselected package libosmocoding0:amd64. Preparing to unpack .../08-libosmocoding0_1.14.2.0.202608201800_amd64.deb ... Unpacking libosmocoding0:amd64 (1.14.2.0.202608201800) ... Selecting previously unselected package libosmovty13:amd64. Preparing to unpack .../09-libosmovty13_1.14.2.0.202608201800_amd64.deb ... Unpacking libosmovty13:amd64 (1.14.2.0.202608201800) ... Selecting previously unselected package libosmogb14:amd64. Preparing to unpack .../10-libosmogb14_1.14.2.0.202608201800_amd64.deb ... Unpacking libosmogb14:amd64 (1.14.2.0.202608201800) ... Selecting previously unselected package libosmoctrl0:amd64. Preparing to unpack .../11-libosmoctrl0_1.14.2.0.202608201800_amd64.deb ... Unpacking libosmoctrl0:amd64 (1.14.2.0.202608201800) ... Selecting previously unselected package libpcsclite1:amd64. Preparing to unpack .../12-libpcsclite1_1.9.1-1_amd64.deb ... Unpacking libpcsclite1:amd64 (1.9.1-1) ... Selecting previously unselected package libosmosim2:amd64. Preparing to unpack .../13-libosmosim2_1.14.2.0.202608201800_amd64.deb ... Unpacking libosmosim2:amd64 (1.14.2.0.202608201800) ... Selecting previously unselected package libosmousb0:amd64. Preparing to unpack .../14-libosmousb0_1.14.2.0.202608201800_amd64.deb ... Unpacking libosmousb0:amd64 (1.14.2.0.202608201800) ... Selecting previously unselected package libosmocore. Preparing to unpack .../15-libosmocore_1.14.2.0.202608201800_amd64.deb ... Unpacking libosmocore (1.14.2.0.202608201800) ... Setting up libtalloc2:amd64 (2.3.1-2+b1) ... Setting up libpcsclite1:amd64 (1.9.1-1) ... Setting up osmocom-keyring (1.1.1.8.7873.202608201800) ... Setting up libsctp1:amd64 (1.0.18+dfsg-1) ... Setting up osmocom-nightly (202608201800) ... Setting up libosmocore22:amd64 (1.14.2.0.202608201800) ... Setting up libosmocodec4:amd64 (1.14.2.0.202608201800) ... Setting up libosmovty13:amd64 (1.14.2.0.202608201800) ... Setting up libosmoisdn0:amd64 (1.14.2.0.202608201800) ... Setting up libosmousb0:amd64 (1.14.2.0.202608201800) ... Setting up libosmogsm20:amd64 (1.14.2.0.202608201800) ... Setting up libosmoctrl0:amd64 (1.14.2.0.202608201800) ... Setting up libosmogb14:amd64 (1.14.2.0.202608201800) ... Setting up libosmocoding0:amd64 (1.14.2.0.202608201800) ... Setting up libosmosim2:amd64 (1.14.2.0.202608201800) ... Setting up libosmocore (1.14.2.0.202608201800) ... Processing triggers for libc-bin (2.31-13+deb11u2) ... + apt-mark hold osmocom-nightly osmocom-nightly set on hold. + configure_osmocom_repo_debian_remove osmocom:nightly + local proj=osmocom:nightly + rm /etc/apt/sources.list.d/osmocom:nightly.list + configure_osmocom_repo_debian osmocom:latest + local proj=osmocom:latest + proj_with_slashes osmocom:latest + echo osmocom:latest + sed s.:.:/.g + local
obs_repo=downloads.osmocom.org/packages/osmocom:/latest/Debian_11/
+ echo Configuring Osmocom repository Configuring Osmocom repository + [ -e /tmp/Release.key ] + echo deb [signed-by=/tmp/Release.key]
http://downloads.osmocom.org/packages/osmocom:/latest/Debian_11/
./ + apt-get update Hit:2
http://deb.debian.org/debian
bullseye InRelease Hit:3
http://deb.debian.org/debian
bullseye-updates InRelease Hit:4
http://security.debian.org/debian-security
bullseye-security InRelease Get:1
https://downloads.osmocom.org/packages/osmocom:/latest/Debian_11
./ InRelease [1,621 B] Get:5
https://downloads.osmocom.org/packages/osmocom:/latest/Debian_11
./ Packages [170 kB] Fetched 172 kB in 1s (257 kB/s) Reading package lists... + apt-get -y install osmo-mgw + tee /tmp/out Reading package lists... Building dependency tree... Reading state information... Some packages could not be installed. This may mean that you have requested an impossible situation or if you are using the unstable distribution that some required packages have not yet been created or been moved out of Incoming. The following information may help to resolve the situation: The following packages have unmet dependencies: osmo-mgw : Depends: osmocom-latest but it is not going to be installed Depends: libosmoabis15 but it is not installable Depends: libosmonetif11 but it is not going to be installed Depends: libosmotrau11 but it is not going to be installed E: Unable to correct problems, you have held broken packages. + [ -e /tmp/fail ] + find_patterns_or_exit /tmp/out requested an impossible situation ^The following packages have unmet dependencies: + local file=/tmp/out + local pattern + shift + grep -q requested an impossible situation /tmp/out + continue + grep -q ^The following packages have unmet dependencies: /tmp/out + continue + find_patterns_or_exit /tmp/out Conflicts: osmocom- + local file=/tmp/out + local pattern + shift + grep -q Conflicts: osmocom- /tmp/out ERROR: could not find pattern 'Conflicts: osmocom-' in file '/tmp/out'! + echo ERROR: could not find pattern 'Conflicts: osmocom-' in file '/tmp/out'! + exit 1 + clean_up_trap + [ -n ] + set +x ### Clean up ### + trap - EXIT INT TERM 0 + clean_up + [ -n ] + [ -e _repo_install_test_data/qemu.pid ] + cat _repo_install_test_data/qemu.pid + kill 788855 + rm -f _repo_install_test_data/temp.qcow2 Build step 'Execute shell' marked build as failure
1
1
0
0
Build failed in Jenkins: Osmocom-repo-install-debian13 » nightly,qemu #177
by jenkins@lists.osmocom.org
22 Aug '26
22 Aug '26
See <
https://jenkins.osmocom.org/jenkins/job/Osmocom-repo-install-debian13/feed=…
> Changes: [Oliver Smith] Revert "jobs: run ttcn3-remsim-test-asan with bookworm" ------------------------------------------ [...truncated 54.98 KiB...] libosmo-sigtran12 libosmo-sigtran-dbg libosmo-sigtran-dev libosmo-sigtran-doc libosmosim2 libosmosim-doc libosmo-simtrace2-1 libosmo-simtrace2-1-dbgsym libosmo-simtrace2-dev libosmotrau11 libosmousb0 libosmousb-doc libosmovty13 libosmovty-doc librtlsdr0 librtlsdr-dev libsmpp1 libsmpp34-dbg libsmpp34-dev libsmpp34-utils libstrongswan libstrongswan-dbgsym libstrongswan-extra-plugins libstrongswan-extra-plugins-dbgsym libstrongswan-standard-plugins libstrongswan-standard-plugins-dbgsym libusrp1 libusrp1-dbgsym libusrp-dev libusrp-doc libusrp-firmware libusrp-utils libusrp-utils-dbgsym neocon neocon-dbgsym osmo-bsc osmo-bsc-bs11-utils osmo-bsc-dbg osmo-bsc-doc osmo-bsc-ipaccess-utils osmo-bsc-meas-utils osmo-bsc-nat osmo-bsc-nat-dbg osmo-bsc-nat-doc osmo-bts osmo-bts-doc osmo-bts-trx osmo-bts-trx-dbg osmo-bts-virtual osmo-bts-virtual-dbg osmo-cbc osmo-cbc-dbg osmo-cbc-doc osmo-cbc-utils osmocom-bb-doc osmocom-bb-gprsdecode osmocom-bb-gprsdecode-dbgsym osmocom-bb-layer23 osmocom-bb-layer23-dbgsym osmocom-bb-osmocon osmocom-bb-osmocon-dbgsym osmocom-bb-trxcon osmocom-bb-trxcon-dbgsym osmocom-bb-trx-toolkit osmocom-bb-virtphy osmocom-bb-virtphy-dbgsym osmocom-keyring osmocom-nightly osmo-diameter2gsup osmo-e1d osmo-e1d-dbgsym osmo-epdg osmo-epdg-dbgsym osmo-epdg-doc osmo-fl2k osmo-fl2k-dbgsym osmo-gbproxy osmo-gbproxy-dbg osmo-gbproxy-doc osmo-ggsn osmo-ggsn-dbg osmo-ggsn-doc osmo-gsm-manuals-dev osmo-gtphub osmo-gtphub-dbg osmo-hlr osmo-hlr-dbg osmo-hlr-doc osmo-hnbgw osmo-hnbgw-dbg osmo-hnbgw-doc osmo-hnodeb osmo-hnodeb-dbg osmo-hnodeb-doc osmo-mgw osmo-mgw-dbgsym osmo-mgw-doc osmo-msc osmo-msc-dbg osmo-msc-doc osmo-mslookup-utils osmo-pcap-client osmo-pcap-client-dbg osmo-pcap-server osmo-pcap-server-dbg osmo-pcu osmo-pcu-dbg osmo-pcu-doc osmo-remsim-apitool osmo-remsim-bankd osmo-remsim-bankd-dbgsym osmo-remsim-client-shell osmo-remsim-client-shell-dbgsym osmo-remsim-client-st2 osmo-remsim-client-st2-dbgsym osmo-remsim-doc osmo-remsim-server osmo-remsim-server-dbgsym osmo-s1gw osmo-s1gw-cli osmo-s1gw-dbgsym osmo-sgsn osmo-sgsn-dbg osmo-sgsn-doc osmo-sip-connector osmo-sip-connector-dbg osmo-sip-connector-doc osmo-smlc osmo-smlc-dbg osmo-smlc-doc osmo-stp osmo-stp-dbg osmo-stp-doc osmo-sysmon osmo-sysmon-dbg osmo-trx osmo-trx-dbg osmo-trx-doc osmo-trx-ipc osmo-trx-lms osmo-trx-ms-blade osmo-trx-uhd osmo-trx-usrp1 osmo-uecups osmo-uecups-dbgsym osmo-upf osmo-upf-dbg osmo-upf-doc python3-osmopy-libs python3-osmopy-utils python3-pyosmocom python3-pyosmocom-doc rtl-sdr sdcc sdcc-libraries sdcc-ucsim simtrace2-firmware simtrace2-utils simtrace2-utils-dbgsym strongswan strongswan-charon strongswan-charon-dbgsym strongswan-libcharon strongswan-libcharon-dbgsym strongswan-nm strongswan-nm-dbgsym strongswan-pki strongswan-pki-dbgsym strongswan-starter strongswan-starter-dbgsym strongswan-swanctl strongswan-swanctl-dbgsym + apt-get install -y --no-install-recommends -- abisip-find charon-cmd charon-cmd-dbgsym eclipse-titan eclipse-titan-dbgsym gapk gapk-dbgsym gtp-echo-responder gtp-echo-responder-dbg libasn1c1 libasn1c-dbg libasn1c-dev libcharon-extauth-plugins libcharon-extauth-plugins-dbgsym libcharon-extra-plugins libcharon-extra-plugins-dbgsym libgtp11 libgtp-dbg libgtp-dev libgtpnl0 libgtpnl-dbg libgtpnl-dev libgtpnl-tools libifd-osmo-remsim-client0 libifd-osmo-remsim-client0-dbgsym libosmo-abis libosmoabis17 libosmo-abis-dbg libosmo-abis-dev libosmo-asn1-tcap1 libosmo-asn1-tcap-dbg libosmo-asn1-tcap-dev libosmocodec4 libosmocodec-doc libosmocoding0 libosmocoding-doc libosmocore libosmocore22 libosmocore-dbg libosmocore-dev libosmocore-doc libosmocore-utils libosmo-csn1-1 libosmo-csn1-1-dbgsym libosmo-csn1-dbg libosmo-csn1-dev libosmoctrl0 libosmoctrl-doc libosmodsp0 libosmodsp-dbg libosmodsp-dev libosmodsp-doc libosmo-e1d3 libosmo-e1d3-dbgsym libosmo-e1d-dev libosmo-fl2k0 libosmo-fl2k0-dbgsym libosmo-fl2k-dev libosmogapk0 libosmogapk0-dbgsym libosmogapk-dev libosmogb14 libosmogb-doc libosmo-gprs-gmm1 libosmo-gprs-gmm1-dbgsym libosmo-gprs-gmm-dbg libosmo-gprs-gmm-dev libosmo-gprs-llc1 libosmo-gprs-llc1-dbgsym libosmo-gprs-llc-dbg libosmo-gprs-llc-dev libosmo-gprs-rlcmac1 libosmo-gprs-rlcmac1-dbgsym libosmo-gprs-rlcmac-dbg libosmo-gprs-rlcmac-dev libosmo-gprs-sm1 libosmo-gprs-sm1-dbgsym libosmo-gprs-sm-dbg libosmo-gprs-sm-dev libosmo-gprs-sndcp1 libosmo-gprs-sndcp1-dbgsym libosmo-gprs-sndcp-dbg libosmo-gprs-sndcp-dev libosmogsm20 libosmogsm-doc libosmo-gsup-client0 libosmo-gsup-client-dev libosmo-gtlv1 libosmo-gtlv-dbg libosmo-gtlv-dev libosmo-hnbap0 libosmo-hnbap-dbg libosmo-hnbap-dev libosmoisdn0 libosmoisdn-doc libosmo-iuh-dev libosmo-mgcp-client14 libosmo-mgcp-client14-dbgsym libosmo-mgcp-client-dev libosmo-mslookup1 libosmo-mslookup-dev libosmonetif11 libosmo-netif-dbg libosmo-netif-dev libosmo-netif-doc libosmo-octoi3 libosmo-octoi3-dbgsym libosmo-octoi-dev libosmo-pfcp libosmo-pfcp4 libosmo-pfcp-dbg libosmo-pfcp-dev libosmo-ranap7 libosmo-ranap-dbg libosmo-ranap-dev libosmo-rspro2 libosmo-rspro2-dbgsym libosmo-rspro-dev libosmo-rua0 libosmo-rua-dbg libosmo-rua-dev libosmo-sabp1 libosmo-sabp-dbg libosmo-sabp-dev libosmo-sbcap2 libosmo-sbcap-dev libosmo-sigtran12 libosmo-sigtran-dbg libosmo-sigtran-dev libosmo-sigtran-doc libosmosim2 libosmosim-doc libosmo-simtrace2-1 libosmo-simtrace2-1-dbgsym libosmo-simtrace2-dev libosmotrau11 libosmousb0 libosmousb-doc libosmovty13 libosmovty-doc librtlsdr0 librtlsdr-dev libsmpp1 libsmpp34-dbg libsmpp34-dev libsmpp34-utils libstrongswan libstrongswan-dbgsym libstrongswan-extra-plugins libstrongswan-extra-plugins-dbgsym libstrongswan-standard-plugins libstrongswan-standard-plugins-dbgsym libusrp1 libusrp1-dbgsym libusrp-dev libusrp-doc libusrp-firmware libusrp-utils libusrp-utils-dbgsym neocon neocon-dbgsym osmo-bsc osmo-bsc-bs11-utils osmo-bsc-dbg osmo-bsc-doc osmo-bsc-ipaccess-utils osmo-bsc-meas-utils osmo-bsc-nat osmo-bsc-nat-dbg osmo-bsc-nat-doc osmo-bts osmo-bts-doc osmo-bts-trx osmo-bts-trx-dbg osmo-bts-virtual osmo-bts-virtual-dbg osmo-cbc osmo-cbc-dbg osmo-cbc-doc osmo-cbc-utils osmocom-bb-doc osmocom-bb-gprsdecode osmocom-bb-gprsdecode-dbgsym osmocom-bb-layer23 osmocom-bb-layer23-dbgsym osmocom-bb-osmocon osmocom-bb-osmocon-dbgsym osmocom-bb-trxcon osmocom-bb-trxcon-dbgsym osmocom-bb-trx-toolkit osmocom-bb-virtphy osmocom-bb-virtphy-dbgsym osmocom-keyring osmocom-nightly osmo-diameter2gsup osmo-e1d osmo-e1d-dbgsym osmo-epdg osmo-epdg-dbgsym osmo-epdg-doc osmo-fl2k osmo-fl2k-dbgsym osmo-gbproxy osmo-gbproxy-dbg osmo-gbproxy-doc osmo-ggsn osmo-ggsn-dbg osmo-ggsn-doc osmo-gsm-manuals-dev osmo-gtphub osmo-gtphub-dbg osmo-hlr osmo-hlr-dbg osmo-hlr-doc osmo-hnbgw osmo-hnbgw-dbg osmo-hnbgw-doc osmo-hnodeb osmo-hnodeb-dbg osmo-hnodeb-doc osmo-mgw osmo-mgw-dbgsym osmo-mgw-doc osmo-msc osmo-msc-dbg osmo-msc-doc osmo-mslookup-utils osmo-pcap-client osmo-pcap-client-dbg osmo-pcap-server osmo-pcap-server-dbg osmo-pcu osmo-pcu-dbg osmo-pcu-doc osmo-remsim-apitool osmo-remsim-bankd osmo-remsim-bankd-dbgsym osmo-remsim-client-shell osmo-remsim-client-shell-dbgsym osmo-remsim-client-st2 osmo-remsim-client-st2-dbgsym osmo-remsim-doc osmo-remsim-server osmo-remsim-server-dbgsym osmo-s1gw osmo-s1gw-cli osmo-s1gw-dbgsym osmo-sgsn osmo-sgsn-dbg osmo-sgsn-doc osmo-sip-connector osmo-sip-connector-dbg osmo-sip-connector-doc osmo-smlc osmo-smlc-dbg osmo-smlc-doc osmo-stp osmo-stp-dbg osmo-stp-doc osmo-sysmon osmo-sysmon-dbg osmo-trx osmo-trx-dbg osmo-trx-doc osmo-trx-ipc osmo-trx-lms osmo-trx-ms-blade osmo-trx-uhd osmo-trx-usrp1 osmo-uecups osmo-uecups-dbgsym osmo-upf osmo-upf-dbg osmo-upf-doc python3-osmopy-libs python3-osmopy-utils python3-pyosmocom python3-pyosmocom-doc rtl-sdr sdcc sdcc-libraries sdcc-ucsim simtrace2-firmware simtrace2-utils simtrace2-utils-dbgsym strongswan strongswan-charon strongswan-charon-dbgsym strongswan-libcharon strongswan-libcharon-dbgsym strongswan-nm strongswan-nm-dbgsym strongswan-pki strongswan-pki-dbgsym strongswan-starter strongswan-starter-dbgsym strongswan-swanctl strongswan-swanctl-dbgsym Reading package lists... Building dependency tree... Reading state information... libosmocodec4 is already the newest version (1.14.2.0.202608201800). libosmocodec4 set to manually installed. libosmocoding0 is already the newest version (1.14.2.0.202608201800). libosmocoding0 set to manually installed. libosmocore is already the newest version (1.14.2.0.202608201800). libosmocore22 is already the newest version (1.14.2.0.202608201800). libosmocore22 set to manually installed. libosmoctrl0 is already the newest version (1.14.2.0.202608201800). libosmoctrl0 set to manually installed. libosmogb14 is already the newest version (1.14.2.0.202608201800). libosmogb14 set to manually installed. libosmogsm20 is already the newest version (1.14.2.0.202608201800). libosmogsm20 set to manually installed. libosmoisdn0 is already the newest version (1.14.2.0.202608201800). libosmoisdn0 set to manually installed. libosmosim2 is already the newest version (1.14.2.0.202608201800). libosmosim2 set to manually installed. libosmousb0 is already the newest version (1.14.2.0.202608201800). libosmousb0 set to manually installed. libosmovty13 is already the newest version (1.14.2.0.202608201800). libosmovty13 set to manually installed. osmocom-keyring is already the newest version (1.1.1.8.7873.202608201800). osmocom-keyring set to manually installed. osmocom-nightly is already the newest version (202608201800). Solving dependencies... Some packages could not be installed. This may mean that you have requested an impossible situation or if you are using the unstable distribution that some required packages have not yet been created or been moved out of Incoming. The following information may help to resolve the situation: The following packages have unmet dependencies: abisip-find : Depends: osmocom-nightly (= 202608191800) but 202608201800 is to be installed libosmo-mgcp-client-dev : Depends: osmocom-nightly (= 202608191800) but 202608201800 is to be installed libosmo-mgcp-client14 : Depends: osmocom-nightly (= 202608191800) but 202608201800 is to be installed osmo-bsc : Depends: osmocom-nightly (= 202608191800) but 202608201800 is to be installed osmo-bsc-bs11-utils : Depends: osmocom-nightly (= 202608191800) but 202608201800 is to be installed osmo-bsc-dbg : Depends: osmocom-nightly (= 202608191800) but 202608201800 is to be installed osmo-bsc-doc : Depends: osmocom-nightly (= 202608191800) but 202608201800 is to be installed osmo-bsc-ipaccess-utils : Depends: osmocom-nightly (= 202608191800) but 202608201800 is to be installed osmo-bsc-meas-utils : Depends: osmocom-nightly (= 202608191800) but 202608201800 is to be installed osmo-bsc-nat : Depends: osmocom-nightly (= 202608191800) but 202608201800 is to be installed osmo-bsc-nat-dbg : Depends: osmocom-nightly (= 202608191800) but 202608201800 is to be installed osmo-bsc-nat-doc : Depends: osmocom-nightly (= 202608191800) but 202608201800 is to be installed osmo-hnbgw : Depends: osmocom-nightly (= 202608191800) but 202608201800 is to be installed osmo-hnbgw-dbg : Depends: osmocom-nightly (= 202608191800) but 202608201800 is to be installed osmo-hnbgw-doc : Depends: osmocom-nightly (= 202608191800) but 202608201800 is to be installed osmo-mgw : Depends: osmocom-nightly (= 202608191800) but 202608201800 is to be installed osmo-mgw-doc : Depends: osmocom-nightly (= 202608191800) but 202608201800 is to be installed osmo-msc : Depends: osmocom-nightly (= 202608191800) but 202608201800 is to be installed osmo-msc-dbg : Depends: osmocom-nightly (= 202608191800) but 202608201800 is to be installed osmo-msc-doc : Depends: osmocom-nightly (= 202608191800) but 202608201800 is to be installed E: Unable to correct problems, you have held broken packages. E: The following information from --solver 3.0 may provide additional context: Unable to satisfy dependencies. Reached two conflicting decisions: 1. osmo-bsc:amd64=1.14.0.40.779dd6.202608191800 is selected for install 2. osmo-bsc:amd64=1.14.0.40.779dd6.202608191800 Depends osmocom-nightly (= 202608191800) but none of the choices are installable: [no choices] + clean_up_trap + [ -n ] + set +x ### Clean up ### + trap - EXIT INT TERM 0 + clean_up + [ -n ] + [ -e _repo_install_test_data/qemu.pid ] + cat _repo_install_test_data/qemu.pid + kill 737805 + rm -f _repo_install_test_data/temp.qcow2 Build step 'Execute shell' marked build as failure
1
1
0
0
Build failed in Jenkins: Osmocom-repo-install-debian12 » nightly,qemu #1148
by jenkins@lists.osmocom.org
22 Aug '26
22 Aug '26
See <
https://jenkins.osmocom.org/jenkins/job/Osmocom-repo-install-debian12/feed=…
> Changes: [Oliver Smith] Revert "jobs: run ttcn3-remsim-test-asan with bookworm" ------------------------------------------ [...truncated 19.49 KiB...] rehash: warning: skipping ca-certificates.crt,it does not contain exactly one certificate or CRL 23 added, 13 removed; done. Setting up gnupg-l10n (2.2.40-1.1+deb12u2) ... Setting up libsigc++-2.0-0v5:amd64 (2.12.0-1) ... Setting up aptitude-common (0.8.13-5) ... Setting up gpgconf (2.2.40-1.1+deb12u2) ... Setting up gpg (2.2.40-1.1+deb12u2) ... Setting up gnupg-utils (2.2.40-1.1+deb12u2) ... Setting up pinentry-curses (1.2.1-1) ... Setting up gpg-agent (2.2.40-1.1+deb12u2) ... Created symlink /etc/systemd/user/sockets.target.wants/gpg-agent-browser.socket → /usr/lib/systemd/user/gpg-agent-browser.socket. Created symlink /etc/systemd/user/sockets.target.wants/gpg-agent-extra.socket → /usr/lib/systemd/user/gpg-agent-extra.socket. Created symlink /etc/systemd/user/sockets.target.wants/gpg-agent-ssh.socket → /usr/lib/systemd/user/gpg-agent-ssh.socket. Created symlink /etc/systemd/user/sockets.target.wants/gpg-agent.socket → /usr/lib/systemd/user/gpg-agent.socket. Setting up gpgsm (2.2.40-1.1+deb12u2) ... Setting up dirmngr (2.2.40-1.1+deb12u2) ... Created symlink /etc/systemd/user/sockets.target.wants/dirmngr.socket → /usr/lib/systemd/user/dirmngr.socket. Setting up libcwidget4:amd64 (0.5.18-6) ... Setting up aptitude (0.8.13-5) ... update-alternatives: using /usr/bin/aptitude-curses to provide /usr/bin/aptitude (aptitude) in auto mode Setting up gpg-wks-server (2.2.40-1.1+deb12u2) ... Setting up gpg-wks-client (2.2.40-1.1+deb12u2) ... Setting up gnupg (2.2.40-1.1+deb12u2) ... Setting up gnupg2 (2.2.40-1.1+deb12u2) ... Processing triggers for man-db (2.11.2-2) ... Processing triggers for libc-bin (2.36-9) ... Processing triggers for ca-certificates (20250419~deb12u1) ... Updating certificates in /etc/ssl/certs... 0 added, 0 removed; done. Running hooks in /etc/ca-certificates/update.d... done. + configure_osmocom_repo osmocom:nightly + configure_osmocom_repo_debian osmocom:nightly + local proj=osmocom:nightly + proj_with_slashes osmocom:nightly + echo osmocom:nightly + sed s.:.:/.g Configuring Osmocom repository + local
obs_repo=downloads.osmocom.org/packages/osmocom:/nightly/Debian_12/
+ echo Configuring Osmocom repository + [ -e /tmp/Release.key ] + wget -O /tmp/Release.key
https://obs.osmocom.org/projects/osmocom:nightly/public_key
--2026-08-21 02:32:35--
https://obs.osmocom.org/projects/osmocom:nightly/public_key
Resolving
obs.osmocom.org
(
obs.osmocom.org
)... 148.251.236.141, 2a01:4f8:201:344a::2 Connecting to
obs.osmocom.org
(obs.osmocom.org)|148.251.236.141|:443... connected. HTTP request sent, awaiting response... 200 OK Length: unspecified [application/octet-stream] Saving to: ‘/tmp/Release.key’ 0K . 5.72M=0s 2026-08-21 02:32:35 (5.72 MB/s) - ‘/tmp/Release.key’ saved [1422] + echo deb [signed-by=/tmp/Release.key]
http://downloads.osmocom.org/packages/osmocom:/nightly/Debian_12/
./ + apt-get update Hit:1
http://deb.debian.org/debian
bookworm InRelease Hit:2
http://security.debian.org/debian-security
bookworm-security InRelease Hit:3
http://deb.debian.org/debian
bookworm-updates InRelease Get:4
https://downloads.osmocom.org/packages/osmocom:/nightly/Debian_12
./ InRelease [1,623 B] Get:5
https://downloads.osmocom.org/packages/osmocom:/nightly/Debian_12
./ Packages [212 kB] Fetched 214 kB in 0s (676 kB/s) Reading package lists... + uname -a Linux unassigned-hostname 6.1.0-9-amd64 #1 SMP PREEMPT_DYNAMIC Debian 6.1.27-1 (2023-05-08) x86_64 GNU/Linux ### Running test: test_conflict ### + set +x + test_conflict + test_conflict_debian + [ debian12 = debian10 ] + apt-get -y install libosmocore osmocom-nightly Reading package lists... Building dependency tree... Reading state information... The following additional packages will be installed: libosmocodec4 libosmocoding0 libosmocore22 libosmoctrl0 libosmogb14 libosmogsm20 libosmoisdn0 libosmosim2 libosmousb0 libosmovty13 libpcsclite1 libsctp1 libtalloc2 osmocom-keyring Suggested packages: pcscd lksctp-tools The following NEW packages will be installed: libosmocodec4 libosmocoding0 libosmocore libosmocore22 libosmoctrl0 libosmogb14 libosmogsm20 libosmoisdn0 libosmosim2 libosmousb0 libosmovty13 libpcsclite1 libsctp1 libtalloc2 osmocom-keyring osmocom-nightly 0 upgraded, 16 newly installed, 0 to remove and 128 not upgraded. Need to get 1,252 kB of archives. After this operation, 2,935 kB of additional disk space will be used. Get:14
http://deb.debian.org/debian
bookworm/main amd64 libsctp1 amd64 1.0.19+dfsg-2 [29.7 kB] Get:15
http://deb.debian.org/debian
bookworm/main amd64 libtalloc2 amd64 2.4.0-f2 [25.6 kB] Get:1
https://downloads.osmocom.org/packages/osmocom:/nightly/Debian_12
./ osmocom-keyring 1.1.1.8.7873.202608201800 [3,196 B] Get:16
http://deb.debian.org/debian
bookworm/main amd64 libpcsclite1 amd64 1.9.9-2 [49.7 kB] Get:2
https://downloads.osmocom.org/packages/osmocom:/nightly/Debian_12
./ osmocom-nightly 202608201800 [1,192 B] Get:3
https://downloads.osmocom.org/packages/osmocom:/nightly/Debian_12
./ libosmocore22 1.14.2.0.202608201800 [179 kB] Get:4
https://downloads.osmocom.org/packages/osmocom:/nightly/Debian_12
./ libosmocodec4 1.14.2.0.202608201800 [56.2 kB] Get:5
https://downloads.osmocom.org/packages/osmocom:/nightly/Debian_12
./ libosmoisdn0 1.14.2.0.202608201800 [74.6 kB] Get:6
https://downloads.osmocom.org/packages/osmocom:/nightly/Debian_12
./ libosmogsm20 1.14.2.0.202608201800 [233 kB] Get:7
https://downloads.osmocom.org/packages/osmocom:/nightly/Debian_12
./ libosmocoding0 1.14.2.0.202608201800 [75.1 kB] Get:8
https://downloads.osmocom.org/packages/osmocom:/nightly/Debian_12
./ libosmovty13 1.14.2.0.202608201800 [109 kB] Get:9
https://downloads.osmocom.org/packages/osmocom:/nightly/Debian_12
./ libosmogb14 1.14.2.0.202608201800 [182 kB] Get:10
https://downloads.osmocom.org/packages/osmocom:/nightly/Debian_12
./ libosmoctrl0 1.14.2.0.202608201800 [63.8 kB] Get:11
https://downloads.osmocom.org/packages/osmocom:/nightly/Debian_12
./ libosmosim2 1.14.2.0.202608201800 [67.8 kB] Get:12
https://downloads.osmocom.org/packages/osmocom:/nightly/Debian_12
./ libosmousb0 1.14.2.0.202608201800 [54.4 kB] Get:13
https://downloads.osmocom.org/packages/osmocom:/nightly/Debian_12
./ libosmocore 1.14.2.0.202608201800 [47.7 kB] debconf: unable to initialize frontend: Dialog debconf: (TERM is not set, so the dialog frontend is not usable.) debconf: falling back to frontend: Readline debconf: unable to initialize frontend: Readline debconf: (This frontend requires a controlling tty.) debconf: falling back to frontend: Teletype dpkg-preconfigure: unable to re-open stdin: Fetched 1,252 kB in 0s (33.4 MB/s) Selecting previously unselected package osmocom-keyring. (Reading database ... (Reading database ... 5%(Reading database ... 10%(Reading database ... 15%(Reading database ... 20%(Reading database ... 25%(Reading database ... 30%(Reading database ... 35%(Reading database ... 40%(Reading database ... 45%(Reading database ... 50%(Reading database ... 55%(Reading database ... 60%(Reading database ... 65%(Reading database ... 70%(Reading database ... 75%(Reading database ... 80%(Reading database ... 85%(Reading database ... 90%(Reading database ... 95%(Reading database ... 100%(Reading database ... 28765 files and directories currently installed.) Preparing to unpack .../00-osmocom-keyring_1.1.1.8.7873.202608201800_amd64.deb ... Unpacking osmocom-keyring (1.1.1.8.7873.202608201800) ... Selecting previously unselected package osmocom-nightly. Preparing to unpack .../01-osmocom-nightly_202608201800_amd64.deb ... Unpacking osmocom-nightly (202608201800) ... Selecting previously unselected package libsctp1:amd64. Preparing to unpack .../02-libsctp1_1.0.19+dfsg-2_amd64.deb ... Unpacking libsctp1:amd64 (1.0.19+dfsg-2) ... Selecting previously unselected package libtalloc2:amd64. Preparing to unpack .../03-libtalloc2_2.4.0-f2_amd64.deb ... Unpacking libtalloc2:amd64 (2.4.0-f2) ... Selecting previously unselected package libosmocore22:amd64. Preparing to unpack .../04-libosmocore22_1.14.2.0.202608201800_amd64.deb ... Unpacking libosmocore22:amd64 (1.14.2.0.202608201800) ... Selecting previously unselected package libosmocodec4:amd64. Preparing to unpack .../05-libosmocodec4_1.14.2.0.202608201800_amd64.deb ... Unpacking libosmocodec4:amd64 (1.14.2.0.202608201800) ... Selecting previously unselected package libosmoisdn0:amd64. Preparing to unpack .../06-libosmoisdn0_1.14.2.0.202608201800_amd64.deb ... Unpacking libosmoisdn0:amd64 (1.14.2.0.202608201800) ... Selecting previously unselected package libosmogsm20:amd64. Preparing to unpack .../07-libosmogsm20_1.14.2.0.202608201800_amd64.deb ... Unpacking libosmogsm20:amd64 (1.14.2.0.202608201800) ... Selecting previously unselected package libosmocoding0:amd64. Preparing to unpack .../08-libosmocoding0_1.14.2.0.202608201800_amd64.deb ... Unpacking libosmocoding0:amd64 (1.14.2.0.202608201800) ... Selecting previously unselected package libosmovty13:amd64. Preparing to unpack .../09-libosmovty13_1.14.2.0.202608201800_amd64.deb ... Unpacking libosmovty13:amd64 (1.14.2.0.202608201800) ... Selecting previously unselected package libosmogb14:amd64. Preparing to unpack .../10-libosmogb14_1.14.2.0.202608201800_amd64.deb ... Unpacking libosmogb14:amd64 (1.14.2.0.202608201800) ... Selecting previously unselected package libosmoctrl0:amd64. Preparing to unpack .../11-libosmoctrl0_1.14.2.0.202608201800_amd64.deb ... Unpacking libosmoctrl0:amd64 (1.14.2.0.202608201800) ... Selecting previously unselected package libpcsclite1:amd64. Preparing to unpack .../12-libpcsclite1_1.9.9-2_amd64.deb ... Unpacking libpcsclite1:amd64 (1.9.9-2) ... Selecting previously unselected package libosmosim2:amd64. Preparing to unpack .../13-libosmosim2_1.14.2.0.202608201800_amd64.deb ... Unpacking libosmosim2:amd64 (1.14.2.0.202608201800) ... Selecting previously unselected package libosmousb0:amd64. Preparing to unpack .../14-libosmousb0_1.14.2.0.202608201800_amd64.deb ... Unpacking libosmousb0:amd64 (1.14.2.0.202608201800) ... Selecting previously unselected package libosmocore. Preparing to unpack .../15-libosmocore_1.14.2.0.202608201800_amd64.deb ... Unpacking libosmocore (1.14.2.0.202608201800) ... Setting up libtalloc2:amd64 (2.4.0-f2) ... Setting up libpcsclite1:amd64 (1.9.9-2) ... Setting up osmocom-keyring (1.1.1.8.7873.202608201800) ... Setting up libsctp1:amd64 (1.0.19+dfsg-2) ... Setting up osmocom-nightly (202608201800) ... Setting up libosmocore22:amd64 (1.14.2.0.202608201800) ... Setting up libosmocodec4:amd64 (1.14.2.0.202608201800) ... Setting up libosmovty13:amd64 (1.14.2.0.202608201800) ... Setting up libosmoisdn0:amd64 (1.14.2.0.202608201800) ... Setting up libosmousb0:amd64 (1.14.2.0.202608201800) ... Setting up libosmogsm20:amd64 (1.14.2.0.202608201800) ... Setting up libosmoctrl0:amd64 (1.14.2.0.202608201800) ... Setting up libosmogb14:amd64 (1.14.2.0.202608201800) ... Setting up libosmocoding0:amd64 (1.14.2.0.202608201800) ... Setting up libosmosim2:amd64 (1.14.2.0.202608201800) ... Setting up libosmocore (1.14.2.0.202608201800) ... Processing triggers for libc-bin (2.36-9) ... + apt-mark hold osmocom-nightly osmocom-nightly set on hold. + configure_osmocom_repo_debian_remove osmocom:nightly + local proj=osmocom:nightly + rm /etc/apt/sources.list.d/osmocom:nightly.list + configure_osmocom_repo_debian osmocom:latest + local proj=osmocom:latest + proj_with_slashes osmocom:latest + echo osmocom:latest + sed s.:.:/.g + local
obs_repo=downloads.osmocom.org/packages/osmocom:/latest/Debian_12/
+ echo Configuring Osmocom repository Configuring Osmocom repository + [ -e /tmp/Release.key ] + echo deb [signed-by=/tmp/Release.key]
http://downloads.osmocom.org/packages/osmocom:/latest/Debian_12/
./ + apt-get update Hit:2
http://security.debian.org/debian-security
bookworm-security InRelease Hit:3
http://deb.debian.org/debian
bookworm InRelease Hit:4
http://deb.debian.org/debian
bookworm-updates InRelease Get:1
https://downloads.osmocom.org/packages/osmocom:/latest/Debian_12
./ InRelease [1,624 B] Get:5
https://downloads.osmocom.org/packages/osmocom:/latest/Debian_12
./ Packages [202 kB] Fetched 204 kB in 0s (817 kB/s) Reading package lists... + apt-get -y install osmo-mgw + tee /tmp/out Reading package lists... Building dependency tree... Reading state information... Some packages could not be installed. This may mean that you have requested an impossible situation or if you are using the unstable distribution that some required packages have not yet been created or been moved out of Incoming. The following information may help to resolve the situation: The following packages have unmet dependencies: osmo-mgw : Depends: osmocom-latest but it is not going to be installed Depends: libosmoabis15 but it is not installable Depends: libosmonetif11 but it is not going to be installed Depends: libosmotrau11 but it is not going to be installed E: Unable to correct problems, you have held broken packages. + [ -e /tmp/fail ] + find_patterns_or_exit /tmp/out requested an impossible situation ^The following packages have unmet dependencies: + local file=/tmp/out + local pattern + shift + grep -q requested an impossible situation /tmp/out + continue + grep -q ^The following packages have unmet dependencies: /tmp/out + continue + find_patterns_or_exit /tmp/out Conflicts: osmocom- + local file=/tmp/out + local pattern + shift + grep -q Conflicts: osmocom- /tmp/out ERROR: could not find pattern 'Conflicts: osmocom-' in file '/tmp/out'! + echo ERROR: could not find pattern 'Conflicts: osmocom-' in file '/tmp/out'! + exit 1 + clean_up_trap + [ -n ] + set +x ### Clean up ### + trap - EXIT INT TERM 0 + clean_up + [ -n ] + [ -e _repo_install_test_data/qemu.pid ] + cat _repo_install_test_data/qemu.pid + kill 703212 + rm -f _repo_install_test_data/temp.qcow2 Build step 'Execute shell' marked build as failure
1
1
0
0
Build failed in Jenkins: Osmocom-repo-install-debian12 » latest,qemu #1148
by jenkins@lists.osmocom.org
22 Aug '26
22 Aug '26
See <
https://jenkins.osmocom.org/jenkins/job/Osmocom-repo-install-debian12/feed=…
> Changes: [Oliver Smith] Revert "jobs: run ttcn3-remsim-test-asan with bookworm" ------------------------------------------ [...truncated 19.49 KiB...] rehash: warning: skipping ca-certificates.crt,it does not contain exactly one certificate or CRL 23 added, 13 removed; done. Setting up gnupg-l10n (2.2.40-1.1+deb12u2) ... Setting up libsigc++-2.0-0v5:amd64 (2.12.0-1) ... Setting up aptitude-common (0.8.13-5) ... Setting up gpgconf (2.2.40-1.1+deb12u2) ... Setting up gpg (2.2.40-1.1+deb12u2) ... Setting up gnupg-utils (2.2.40-1.1+deb12u2) ... Setting up pinentry-curses (1.2.1-1) ... Setting up gpg-agent (2.2.40-1.1+deb12u2) ... Created symlink /etc/systemd/user/sockets.target.wants/gpg-agent-browser.socket → /usr/lib/systemd/user/gpg-agent-browser.socket. Created symlink /etc/systemd/user/sockets.target.wants/gpg-agent-extra.socket → /usr/lib/systemd/user/gpg-agent-extra.socket. Created symlink /etc/systemd/user/sockets.target.wants/gpg-agent-ssh.socket → /usr/lib/systemd/user/gpg-agent-ssh.socket. Created symlink /etc/systemd/user/sockets.target.wants/gpg-agent.socket → /usr/lib/systemd/user/gpg-agent.socket. Setting up gpgsm (2.2.40-1.1+deb12u2) ... Setting up dirmngr (2.2.40-1.1+deb12u2) ... Created symlink /etc/systemd/user/sockets.target.wants/dirmngr.socket → /usr/lib/systemd/user/dirmngr.socket. Setting up libcwidget4:amd64 (0.5.18-6) ... Setting up aptitude (0.8.13-5) ... update-alternatives: using /usr/bin/aptitude-curses to provide /usr/bin/aptitude (aptitude) in auto mode Setting up gpg-wks-server (2.2.40-1.1+deb12u2) ... Setting up gpg-wks-client (2.2.40-1.1+deb12u2) ... Setting up gnupg (2.2.40-1.1+deb12u2) ... Setting up gnupg2 (2.2.40-1.1+deb12u2) ... Processing triggers for man-db (2.11.2-2) ... Processing triggers for libc-bin (2.36-9) ... Processing triggers for ca-certificates (20250419~deb12u1) ... Updating certificates in /etc/ssl/certs... 0 added, 0 removed; done. Running hooks in /etc/ca-certificates/update.d... done. + configure_osmocom_repo osmocom:latest + configure_osmocom_repo_debian osmocom:latest + local proj=osmocom:latest + proj_with_slashes osmocom:latest + echo osmocom:latest + sed s.:.:/.g Configuring Osmocom repository + local
obs_repo=downloads.osmocom.org/packages/osmocom:/latest/Debian_12/
+ echo Configuring Osmocom repository + [ -e /tmp/Release.key ] + wget -O /tmp/Release.key
https://obs.osmocom.org/projects/osmocom:latest/public_key
--2026-08-21 02:32:39--
https://obs.osmocom.org/projects/osmocom:latest/public_key
Resolving
obs.osmocom.org
(
obs.osmocom.org
)... 148.251.236.141, 2a01:4f8:201:344a::2 Connecting to
obs.osmocom.org
(obs.osmocom.org)|148.251.236.141|:443... connected. HTTP request sent, awaiting response... 200 OK Length: unspecified [application/octet-stream] Saving to: ‘/tmp/Release.key’ 0K . 23.9M=0s 2026-08-21 02:32:39 (23.9 MB/s) - ‘/tmp/Release.key’ saved [1422] + echo deb [signed-by=/tmp/Release.key]
http://downloads.osmocom.org/packages/osmocom:/latest/Debian_12/
./ + apt-get update Hit:1
http://security.debian.org/debian-security
bookworm-security InRelease Hit:2
http://deb.debian.org/debian
bookworm InRelease Hit:3
http://deb.debian.org/debian
bookworm-updates InRelease Get:4
https://downloads.osmocom.org/packages/osmocom:/latest/Debian_12
./ InRelease [1,624 B] Get:5
https://downloads.osmocom.org/packages/osmocom:/latest/Debian_12
./ Packages [202 kB] Fetched 204 kB in 1s (225 kB/s) Reading package lists... + uname -a Linux unassigned-hostname 6.1.0-9-amd64 #1 SMP PREEMPT_DYNAMIC Debian 6.1.27-1 (2023-05-08) x86_64 GNU/Linux ### Running test: test_conflict ### + set +x + test_conflict + test_conflict_debian + [ debian12 = debian10 ] + apt-get -y install libosmocore osmocom-latest Reading package lists... Building dependency tree... Reading state information... The following additional packages will be installed: libosmocodec4 libosmocoding0 libosmocore22 libosmoctrl0 libosmogb14 libosmogsm20 libosmoisdn0 libosmosim2 libosmousb0 libosmovty13 libpcsclite1 libsctp1 libtalloc2 osmocom-keyring Suggested packages: pcscd lksctp-tools The following NEW packages will be installed: libosmocodec4 libosmocoding0 libosmocore libosmocore22 libosmoctrl0 libosmogb14 libosmogsm20 libosmoisdn0 libosmosim2 libosmousb0 libosmovty13 libpcsclite1 libsctp1 libtalloc2 osmocom-keyring osmocom-latest 0 upgraded, 16 newly installed, 0 to remove and 128 not upgraded. Need to get 1,250 kB of archives. After this operation, 2,924 kB of additional disk space will be used. Get:14
http://deb.debian.org/debian
bookworm/main amd64 libsctp1 amd64 1.0.19+dfsg-2 [29.7 kB] Get:15
http://deb.debian.org/debian
bookworm/main amd64 libtalloc2 amd64 2.4.0-f2 [25.6 kB] Get:16
http://deb.debian.org/debian
bookworm/main amd64 libpcsclite1 amd64 1.9.9-2 [49.7 kB] Get:1
https://downloads.osmocom.org/packages/osmocom:/latest/Debian_12
./ osmocom-keyring 1.1.1 [3,084 B] Get:2
https://downloads.osmocom.org/packages/osmocom:/latest/Debian_12
./ osmocom-latest 1.1.0 [1,184 B] Get:3
https://downloads.osmocom.org/packages/osmocom:/latest/Debian_12
./ libosmocore22 1.14.2 [179 kB] Get:4
https://downloads.osmocom.org/packages/osmocom:/latest/Debian_12
./ libosmocodec4 1.14.2 [56.1 kB] Get:5
https://downloads.osmocom.org/packages/osmocom:/latest/Debian_12
./ libosmoisdn0 1.14.2 [74.6 kB] Get:6
https://downloads.osmocom.org/packages/osmocom:/latest/Debian_12
./ libosmogsm20 1.14.2 [233 kB] Get:7
https://downloads.osmocom.org/packages/osmocom:/latest/Debian_12
./ libosmocoding0 1.14.2 [75.0 kB] Get:8
https://downloads.osmocom.org/packages/osmocom:/latest/Debian_12
./ libosmovty13 1.14.2 [109 kB] Get:9
https://downloads.osmocom.org/packages/osmocom:/latest/Debian_12
./ libosmogb14 1.14.2 [182 kB] Get:10
https://downloads.osmocom.org/packages/osmocom:/latest/Debian_12
./ libosmoctrl0 1.14.2 [63.7 kB] Get:11
https://downloads.osmocom.org/packages/osmocom:/latest/Debian_12
./ libosmosim2 1.14.2 [67.6 kB] Get:12
https://downloads.osmocom.org/packages/osmocom:/latest/Debian_12
./ libosmousb0 1.14.2 [54.3 kB] Get:13
https://downloads.osmocom.org/packages/osmocom:/latest/Debian_12
./ libosmocore 1.14.2 [47.6 kB] debconf: unable to initialize frontend: Dialog debconf: (TERM is not set, so the dialog frontend is not usable.) debconf: falling back to frontend: Readline debconf: unable to initialize frontend: Readline debconf: (This frontend requires a controlling tty.) debconf: falling back to frontend: Teletype dpkg-preconfigure: unable to re-open stdin: Fetched 1,250 kB in 0s (23.0 MB/s) Selecting previously unselected package osmocom-keyring. (Reading database ... (Reading database ... 5%(Reading database ... 10%(Reading database ... 15%(Reading database ... 20%(Reading database ... 25%(Reading database ... 30%(Reading database ... 35%(Reading database ... 40%(Reading database ... 45%(Reading database ... 50%(Reading database ... 55%(Reading database ... 60%(Reading database ... 65%(Reading database ... 70%(Reading database ... 75%(Reading database ... 80%(Reading database ... 85%(Reading database ... 90%(Reading database ... 95%(Reading database ... 100%(Reading database ... 28765 files and directories currently installed.) Preparing to unpack .../00-osmocom-keyring_1.1.1_amd64.deb ... Unpacking osmocom-keyring (1.1.1) ... Selecting previously unselected package osmocom-latest. Preparing to unpack .../01-osmocom-latest_1.1.0_amd64.deb ... Unpacking osmocom-latest (1.1.0) ... Selecting previously unselected package libsctp1:amd64. Preparing to unpack .../02-libsctp1_1.0.19+dfsg-2_amd64.deb ... Unpacking libsctp1:amd64 (1.0.19+dfsg-2) ... Selecting previously unselected package libtalloc2:amd64. Preparing to unpack .../03-libtalloc2_2.4.0-f2_amd64.deb ... Unpacking libtalloc2:amd64 (2.4.0-f2) ... Selecting previously unselected package libosmocore22:amd64. Preparing to unpack .../04-libosmocore22_1.14.2_amd64.deb ... Unpacking libosmocore22:amd64 (1.14.2) ... Selecting previously unselected package libosmocodec4:amd64. Preparing to unpack .../05-libosmocodec4_1.14.2_amd64.deb ... Unpacking libosmocodec4:amd64 (1.14.2) ... Selecting previously unselected package libosmoisdn0:amd64. Preparing to unpack .../06-libosmoisdn0_1.14.2_amd64.deb ... Unpacking libosmoisdn0:amd64 (1.14.2) ... Selecting previously unselected package libosmogsm20:amd64. Preparing to unpack .../07-libosmogsm20_1.14.2_amd64.deb ... Unpacking libosmogsm20:amd64 (1.14.2) ... Selecting previously unselected package libosmocoding0:amd64. Preparing to unpack .../08-libosmocoding0_1.14.2_amd64.deb ... Unpacking libosmocoding0:amd64 (1.14.2) ... Selecting previously unselected package libosmovty13:amd64. Preparing to unpack .../09-libosmovty13_1.14.2_amd64.deb ... Unpacking libosmovty13:amd64 (1.14.2) ... Selecting previously unselected package libosmogb14:amd64. Preparing to unpack .../10-libosmogb14_1.14.2_amd64.deb ... Unpacking libosmogb14:amd64 (1.14.2) ... Selecting previously unselected package libosmoctrl0:amd64. Preparing to unpack .../11-libosmoctrl0_1.14.2_amd64.deb ... Unpacking libosmoctrl0:amd64 (1.14.2) ... Selecting previously unselected package libpcsclite1:amd64. Preparing to unpack .../12-libpcsclite1_1.9.9-2_amd64.deb ... Unpacking libpcsclite1:amd64 (1.9.9-2) ... Selecting previously unselected package libosmosim2:amd64. Preparing to unpack .../13-libosmosim2_1.14.2_amd64.deb ... Unpacking libosmosim2:amd64 (1.14.2) ... Selecting previously unselected package libosmousb0:amd64. Preparing to unpack .../14-libosmousb0_1.14.2_amd64.deb ... Unpacking libosmousb0:amd64 (1.14.2) ... Selecting previously unselected package libosmocore. Preparing to unpack .../15-libosmocore_1.14.2_amd64.deb ... Unpacking libosmocore (1.14.2) ... Setting up libtalloc2:amd64 (2.4.0-f2) ... Setting up libpcsclite1:amd64 (1.9.9-2) ... Setting up osmocom-keyring (1.1.1) ... Setting up libsctp1:amd64 (1.0.19+dfsg-2) ... Setting up osmocom-latest (1.1.0) ... Setting up libosmocore22:amd64 (1.14.2) ... Setting up libosmocodec4:amd64 (1.14.2) ... Setting up libosmovty13:amd64 (1.14.2) ... Setting up libosmoisdn0:amd64 (1.14.2) ... Setting up libosmousb0:amd64 (1.14.2) ... Setting up libosmogsm20:amd64 (1.14.2) ... Setting up libosmoctrl0:amd64 (1.14.2) ... Setting up libosmogb14:amd64 (1.14.2) ... Setting up libosmocoding0:amd64 (1.14.2) ... Setting up libosmosim2:amd64 (1.14.2) ... Setting up libosmocore (1.14.2) ... Processing triggers for libc-bin (2.36-9) ... + apt-mark hold osmocom-latest osmocom-latest set on hold. + configure_osmocom_repo_debian_remove osmocom:latest + local proj=osmocom:latest + rm /etc/apt/sources.list.d/osmocom:latest.list + configure_osmocom_repo_debian osmocom:nightly + local proj=osmocom:nightly + proj_with_slashes osmocom:nightly + + echo osmocom:nightly sed s.:.:/.g Configuring Osmocom repository + local
obs_repo=downloads.osmocom.org/packages/osmocom:/nightly/Debian_12/
+ echo Configuring Osmocom repository + [ -e /tmp/Release.key ] + echo deb [signed-by=/tmp/Release.key]
http://downloads.osmocom.org/packages/osmocom:/nightly/Debian_12/
./ + apt-get update Hit:2
http://deb.debian.org/debian
bookworm InRelease Hit:3
http://security.debian.org/debian-security
bookworm-security InRelease Hit:4
http://deb.debian.org/debian
bookworm-updates InRelease Get:1
https://downloads.osmocom.org/packages/osmocom:/nightly/Debian_12
./ InRelease [1,623 B] Get:5
https://downloads.osmocom.org/packages/osmocom:/nightly/Debian_12
./ Packages [212 kB] Fetched 214 kB in 1s (236 kB/s) Reading package lists... + apt-get -y install osmo-mgw + tee /tmp/out Reading package lists... Building dependency tree... Reading state information... Some packages could not be installed. This may mean that you have requested an impossible situation or if you are using the unstable distribution that some required packages have not yet been created or been moved out of Incoming. The following information may help to resolve the situation: The following packages have unmet dependencies: osmo-mgw : Depends: osmocom-nightly (= 202608191800) but it is not going to be installed Depends: libosmoabis15 but it is not installable Depends: libosmonetif11 but it is not going to be installed Depends: libosmotrau11 but it is not going to be installed E: Unable to correct problems, you have held broken packages. + [ -e /tmp/fail ] + find_patterns_or_exit /tmp/out requested an impossible situation ^The following packages have unmet dependencies: + local file=/tmp/out + local pattern + shift + grep -q requested an impossible situation /tmp/out + continue + grep -q ^The following packages have unmet dependencies: /tmp/out + continue + find_patterns_or_exit /tmp/out Conflicts: osmocom- + local file=/tmp/out + local pattern + shift + grep -q Conflicts: osmocom- /tmp/out ERROR: could not find pattern 'Conflicts: osmocom-' in file '/tmp/out'! + echo ERROR: could not find pattern 'Conflicts: osmocom-' in file '/tmp/out'! + exit 1 + clean_up_trap + [ -n ] + set +x ### Clean up ### + trap - EXIT INT TERM 0 + clean_up + [ -n ] + [ -e _repo_install_test_data/qemu.pid ] + cat _repo_install_test_data/qemu.pid + kill 1348164 + rm -f _repo_install_test_data/temp.qcow2 Build step 'Execute shell' marked build as failure
1
1
0
0
← Newer
1
...
8
9
10
11
12
13
14
...
670
Older →
Jump to page:
1
2
3
4
5
6
7
8
9
10
11
12
13
14
15
16
17
18
19
20
21
22
23
24
25
26
27
28
29
30
31
32
33
34
35
36
37
38
39
40
41
42
43
44
45
46
47
48
49
50
51
52
53
54
55
56
57
58
59
60
61
62
63
64
65
66
67
68
69
70
71
72
73
74
75
76
77
78
79
80
81
82
83
84
85
86
87
88
89
90
91
92
93
94
95
96
97
98
99
100
101
102
103
104
105
106
107
108
109
110
111
112
113
114
115
116
117
118
119
120
121
122
123
124
125
126
127
128
129
130
131
132
133
134
135
136
137
138
139
140
141
142
143
144
145
146
147
148
149
150
151
152
153
154
155
156
157
158
159
160
161
162
163
164
165
166
167
168
169
170
171
172
173
174
175
176
177
178
179
180
181
182
183
184
185
186
187
188
189
190
191
192
193
194
195
196
197
198
199
200
201
202
203
204
205
206
207
208
209
210
211
212
213
214
215
216
217
218
219
220
221
222
223
224
225
226
227
228
229
230
231
232
233
234
235
236
237
238
239
240
241
242
243
244
245
246
247
248
249
250
251
252
253
254
255
256
257
258
259
260
261
262
263
264
265
266
267
268
269
270
271
272
273
274
275
276
277
278
279
280
281
282
283
284
285
286
287
288
289
290
291
292
293
294
295
296
297
298
299
300
301
302
303
304
305
306
307
308
309
310
311
312
313
314
315
316
317
318
319
320
321
322
323
324
325
326
327
328
329
330
331
332
333
334
335
336
337
338
339
340
341
342
343
344
345
346
347
348
349
350
351
352
353
354
355
356
357
358
359
360
361
362
363
364
365
366
367
368
369
370
371
372
373
374
375
376
377
378
379
380
381
382
383
384
385
386
387
388
389
390
391
392
393
394
395
396
397
398
399
400
401
402
403
404
405
406
407
408
409
410
411
412
413
414
415
416
417
418
419
420
421
422
423
424
425
426
427
428
429
430
431
432
433
434
435
436
437
438
439
440
441
442
443
444
445
446
447
448
449
450
451
452
453
454
455
456
457
458
459
460
461
462
463
464
465
466
467
468
469
470
471
472
473
474
475
476
477
478
479
480
481
482
483
484
485
486
487
488
489
490
491
492
493
494
495
496
497
498
499
500
501
502
503
504
505
506
507
508
509
510
511
512
513
514
515
516
517
518
519
520
521
522
523
524
525
526
527
528
529
530
531
532
533
534
535
536
537
538
539
540
541
542
543
544
545
546
547
548
549
550
551
552
553
554
555
556
557
558
559
560
561
562
563
564
565
566
567
568
569
570
571
572
573
574
575
576
577
578
579
580
581
582
583
584
585
586
587
588
589
590
591
592
593
594
595
596
597
598
599
600
601
602
603
604
605
606
607
608
609
610
611
612
613
614
615
616
617
618
619
620
621
622
623
624
625
626
627
628
629
630
631
632
633
634
635
636
637
638
639
640
641
642
643
644
645
646
647
648
649
650
651
652
653
654
655
656
657
658
659
660
661
662
663
664
665
666
667
668
669
670
Results per page:
10
25
50
100
200