lists.osmocom.org
Sign In
Sign Up
Sign In
Sign Up
Manage this list
×
Keyboard Shortcuts
Thread View
j
: Next unread message
k
: Previous unread message
j a
: Jump to all threads
j l
: Jump to MailingList overview
2026
September
August
July
June
May
April
March
February
January
2025
December
November
October
September
August
July
June
May
April
March
February
January
2024
December
November
October
September
August
July
June
May
April
March
February
January
2023
December
November
October
September
August
July
June
May
April
March
February
January
2022
December
November
October
September
August
July
June
May
April
March
February
January
2021
December
November
October
September
August
July
June
May
April
March
February
January
2020
December
November
October
September
August
July
June
May
April
March
February
January
2019
December
November
October
September
August
July
June
May
April
March
List overview
Download
jenkins-notifications
September 2026
----- 2026 -----
September 2026
August 2026
July 2026
June 2026
May 2026
April 2026
March 2026
February 2026
January 2026
----- 2025 -----
December 2025
November 2025
October 2025
September 2025
August 2025
July 2025
June 2025
May 2025
April 2025
March 2025
February 2025
January 2025
----- 2024 -----
December 2024
November 2024
October 2024
September 2024
August 2024
July 2024
June 2024
May 2024
April 2024
March 2024
February 2024
January 2024
----- 2023 -----
December 2023
November 2023
October 2023
September 2023
August 2023
July 2023
June 2023
May 2023
April 2023
March 2023
February 2023
January 2023
----- 2022 -----
December 2022
November 2022
October 2022
September 2022
August 2022
July 2022
June 2022
May 2022
April 2022
March 2022
February 2022
January 2022
----- 2021 -----
December 2021
November 2021
October 2021
September 2021
August 2021
July 2021
June 2021
May 2021
April 2021
March 2021
February 2021
January 2021
----- 2020 -----
December 2020
November 2020
October 2020
September 2020
August 2020
July 2020
June 2020
May 2020
April 2020
March 2020
February 2020
January 2020
----- 2019 -----
December 2019
November 2019
October 2019
September 2019
August 2019
July 2019
June 2019
May 2019
April 2019
March 2019
jenkins-notifications@lists.osmocom.org
1 participants
59 discussions
Start a n
N
ew thread
Build failed in Jenkins: osmo-gsm-tester_build-osmo-stp #13758
by jenkins@lists.osmocom.org
02 Sep '26
02 Sep '26
See <
https://jenkins.osmocom.org/jenkins/job/osmo-gsm-tester_build-osmo-stp/1375…
> Changes: ------------------------------------------ [...truncated 3.39 KiB...] --build-arg OSMOCOM_REPO_VERSION=latest \ --build-arg
OSMOCOM_REPO_TESTSUITE_MIRROR=https://downloads.osmocom.org
\ --build-arg ASTERISK_BRANCH=sysmocom/20.7.0 \ --build-arg LIBOSMOCORE_BRANCH=master \ --build-arg M3UA_TESTTOOL_BRANCH=osmocom/master \ --build-arg OSMO_BB_BRANCH=master \ --build-arg OSMO_BSC_BRANCH=master \ --build-arg OSMO_BTS_BRANCH=master \ --build-arg OSMO_CBC_BRANCH=master \ --build-arg OSMO_DIA2GSUP_BRANCH=master \ --build-arg OSMO_EPDG_BRANCH=master \ --build-arg OSMO_GBPROXY_BRANCH=master \ --build-arg OSMO_GGSN_BRANCH=master \ --build-arg OSMO_GSM_TESTER_BRANCH=master \ --build-arg OSMO_HLR_BRANCH=master \ --build-arg OSMO_HNBGW_BRANCH=master \ --build-arg OSMO_HNODEB_BRANCH=master \ --build-arg OSMO_IUH_BRANCH=master \ --build-arg OSMO_MGW_BRANCH=master \ --build-arg OSMO_MSC_BRANCH=master \ --build-arg OSMO_NITB_BRANCH=master \ --build-arg OSMO_PCU_BRANCH=master \ --build-arg OSMO_REMSIM_BRANCH=master \ --build-arg OSMO_S1GW_BRANCH=master \ --build-arg OSMO_SGSN_BRANCH=master \ --build-arg OSMO_SIP_BRANCH=master \ --build-arg OSMO_STP_BRANCH=master \ --build-arg OSMO_UECUPS_BRANCH=master \ --build-arg OPEN5GS_BRANCH=main \ --build-arg PJPROJECT_BRANCH=sysmocom/2.14 \ -t docker.io/osmocom-build/osmo-gsm-tester:latest . #0 building with "default" instance using docker driver #1 [internal] load build definition from Dockerfile #1 transferring dockerfile: 4.84kB done #1 WARN: InvalidDefaultArgInFrom: Default value for ARG $USER/debian-bookworm-build results in empty or invalid base image name (line 2) #1 DONE 0.1s #2 [internal] load metadata for docker.io/osmocom-build/debian-bookworm-build:latest #2 DONE 0.0s #3 [internal] load .dockerignore #3 transferring context: 2B done #3 DONE 0.1s #4 [internal] load build context #4 transferring context: 5.76kB done #4 DONE 0.1s #5 [22/28] ADD
HTTPS://GERRIT.OSMOCOM.ORG/PLUGINS/GITILES/OSMO-GSM-TESTER/+/MASTER?FORMAT=…
/tmp/commit #5 DONE 0.2s #6 [ 1/28] FROM docker.io/osmocom-build/debian-bookworm-build:latest #6 DONE 0.4s #7 [ 2/28] RUN useradd -ms /bin/bash jenkins #7 DONE 0.6s #8 [ 3/28] RUN groupadd osmo-gsm-tester #8 DONE 0.4s #9 [ 4/28] RUN usermod -a -G osmo-gsm-tester jenkins #9 DONE 0.6s #10 [ 5/28] RUN APT-GET update && apt-get install -y --no-install-recommends cpio dbus tcpdump sqlite3 python3 python3-setuptools python3-yaml python3-mako python3-gi python3-numpy python3-wheel python3-watchdog ofono patchelf rpm2cpio sudo libcap2-bin python3-pip udhcpc iperf3 locales #10 0.375 Hit:1
http://deb.debian.org/debian
bookworm InRelease #10 0.375 Hit:2
http://deb.debian.org/debian
bookworm-updates InRelease #10 0.375 Hit:3
http://deb.debian.org/debian-security
bookworm-security InRelease #10 0.375 Hit:4
https://downloads.osmocom.org/packages/osmocom:/nightly/Debian_12
./ InRelease #10 0.545 Reading package lists... #10 0.875 Reading package lists... #10 1.152 Building dependency tree... #10 1.208 Reading state information... #10 1.273 dbus is already the newest version (1.14.10-1~deb12u1). #10 1.273 tcpdump is already the newest version (4.99.3-1). #10 1.273 sqlite3 is already the newest version (3.40.1-2+deb12u2). #10 1.273 python3 is already the newest version (3.11.2-1+b1). #10 1.273 python3-setuptools is already the newest version (66.1.1-1+deb12u2). #10 1.273 python3-yaml is already the newest version (6.0-3+b2). #10 1.273 python3-mako is already the newest version (1.2.4+ds-1). #10 1.273 python3-gi is already the newest version (3.42.2-3+b1). #10 1.273 python3-wheel is already the newest version (0.38.4-2). #10 1.273 python3-wheel set to manually installed. #10 1.273 ofono is already the newest version (1.31-3+b1). #10 1.273 patchelf is already the newest version (0.14.3-1+b1). #10 1.273 sudo is already the newest version (1.9.13p3-1+deb12u4). #10 1.273 libcap2-bin is already the newest version (1:2.66-4+deb12u3+b1). #10 1.273 libcap2-bin set to manually installed. #10 1.273 python3-pip is already the newest version (23.0.1+dfsg-1). #10 1.273 locales is already the newest version (2.36-9+deb12u14). #10 1.273 The following additional packages will be installed: #10 1.274 busybox libblas3 libiperf0 liblapack3 librpm9 librpmio9 rpm-common #10 1.274 Suggested packages: #10 1.274 libarchive-dev gfortran rpm-i18n #10 1.327 The following NEW packages will be installed: #10 1.327 busybox cpio iperf3 libblas3 libiperf0 liblapack3 librpm9 librpmio9 #10 1.327 python3-numpy python3-watchdog rpm-common rpm2cpio udhcpc #10 1.344 0 upgraded, 13 newly installed, 0 to remove and 5 not upgraded. #10 1.344 Need to get 14.8 MB of archives. #10 1.344 After this operation, 45.5 MB of additional disk space will be used. #10 1.344 Get:1
http://deb.debian.org/debian
bookworm/main amd64 libiperf0 amd64 3.12-1+deb12u2 [91.2 kB] #10 1.356 Get:2
http://deb.debian.org/debian
bookworm/main amd64 iperf3 amd64 3.12-1+deb12u2 [34.0 kB] #10 1.358 Get:3
http://deb.debian.org/debian
bookworm/main amd64 cpio amd64 2.13+dfsg-7.1 [245 kB] #10 1.371 Get:4
http://deb.debian.org/debian
bookworm/main amd64 busybox amd64 1:1.35.0-4+deb12u1+b1 [452 kB] #10 1.385 Get:5
http://deb.debian.org/debian
bookworm/main amd64 libblas3 amd64 3.11.0-2 [149 kB] #10 1.399 Get:6
http://deb.debian.org/debian
bookworm/main amd64 liblapack3 amd64 3.11.0-2 [2323 kB] #10 1.427 Get:7
http://deb.debian.org/debian
bookworm/main amd64 librpmio9 amd64 4.18.0+dfsg-1+deb12u1 [1625 kB] #10 1.446 Get:8
http://deb.debian.org/debian
bookworm/main amd64 librpm9 amd64 4.18.0+dfsg-1+deb12u1 [1720 kB] #10 1.452 Get:9
http://deb.debian.org/debian
bookworm/main amd64 python3-numpy amd64 1:1.24.2-1+deb12u1 [4960 kB] #10 1.505 Get:10
http://deb.debian.org/debian
bookworm/main amd64 python3-watchdog all 2.2.1-1 [124 kB] #10 1.516 Get:11
http://deb.debian.org/debian
bookworm/main amd64 rpm-common amd64 4.18.0+dfsg-1+deb12u1 [1571 kB] #10 1.529 Get:12
http://deb.debian.org/debian
bookworm/main amd64 rpm2cpio amd64 4.18.0+dfsg-1+deb12u1 [1547 kB] #10 1.532 Get:13
http://deb.debian.org/debian
bookworm/main amd64 udhcpc amd64 1:1.35.0-4+deb12u1+b1 [6500 B] #10 1.654 debconf: delaying package configuration, since apt-utils is not installed #10 1.702 Fetched 14.8 MB in 0s (73.3 MB/s) #10 1.782 Selecting previously unselected package libiperf0:amd64. #10 1.782 (Reading database ... (Reading database ... 5%(Reading database ... 10%(Reading database ... 15%(Reading database ... 20%(Reading database ... 25%(Reading database ... 30%(Reading database ... 35%(Reading database ... 40%(Reading database ... 45%(Reading database ... 50%(Reading database ... 55%(Reading database ... 60%(Reading database ... 65%(Reading database ... 70%(Reading database ... 75%(Reading database ... 80%(Reading database ... 85%(Reading database ... 90%(Reading database ... 95%(Reading database ... 100%(Reading database ... 118641 files and directories currently installed.) #10 1.857 Preparing to unpack .../00-libiperf0_3.12-1+deb12u2_amd64.deb ... #10 1.881 Unpacking libiperf0:amd64 (3.12-1+deb12u2) ... #10 2.053 Selecting previously unselected package iperf3. #10 2.061 Preparing to unpack .../01-iperf3_3.12-1+deb12u2_amd64.deb ... #10 2.078 Unpacking iperf3 (3.12-1+deb12u2) ... #10 2.198 Selecting previously unselected package cpio. #10 2.203 Preparing to unpack .../02-cpio_2.13+dfsg-7.1_amd64.deb ... #10 2.215 Unpacking cpio (2.13+dfsg-7.1) ... #10 2.309 Selecting previously unselected package busybox. #10 2.316 Preparing to unpack .../03-busybox_1%3a1.35.0-4+deb12u1+b1_amd64.deb ... #10 2.328 Unpacking busybox (1:1.35.0-4+deb12u1+b1) ... #10 2.445 Selecting previously unselected package libblas3:amd64. #10 2.455 Preparing to unpack .../04-libblas3_3.11.0-2_amd64.deb ... #10 2.469 Unpacking libblas3:amd64 (3.11.0-2) ... #10 2.571 Selecting previously unselected package liblapack3:amd64. #10 2.580 Preparing to unpack .../05-liblapack3_3.11.0-2_amd64.deb ... #10 2.593 Unpacking liblapack3:amd64 (3.11.0-2) ... #10 2.781 Selecting previously unselected package librpmio9. #10 2.786 Preparing to unpack .../06-librpmio9_4.18.0+dfsg-1+deb12u1_amd64.deb ... #10 2.805 Unpacking librpmio9 (4.18.0+dfsg-1+deb12u1) ... #10 2.902 Selecting previously unselected package librpm9. #10 2.906 Preparing to unpack .../07-librpm9_4.18.0+dfsg-1+deb12u1_amd64.deb ... #10 2.917 Unpacking librpm9 (4.18.0+dfsg-1+deb12u1) ... #10 3.022 Selecting previously unselected package python3-numpy. #10 3.027 Preparing to unpack .../08-python3-numpy_1%3a1.24.2-1+deb12u1_amd64.deb ... #10 3.041 Unpacking python3-numpy (1:1.24.2-1+deb12u1) ... #10 3.341 Selecting previously unselected package python3-watchdog. #10 3.346 Preparing to unpack .../09-python3-watchdog_2.2.1-1_all.deb ... #10 3.357 Unpacking python3-watchdog (2.2.1-1) ... #10 3.441 Selecting previously unselected package rpm-common. #10 3.446 Preparing to unpack .../10-rpm-common_4.18.0+dfsg-1+deb12u1_amd64.deb ... #10 3.458 Unpacking rpm-common (4.18.0+dfsg-1+deb12u1) ... #10 3.551 Selecting previously unselected package rpm2cpio. #10 3.556 Preparing to unpack .../11-rpm2cpio_4.18.0+dfsg-1+deb12u1_amd64.deb ... #10 3.567 Unpacking rpm2cpio (4.18.0+dfsg-1+deb12u1) ... #10 3.649 Selecting previously unselected package udhcpc:amd64. #10 3.654 Preparing to unpack .../12-udhcpc_1%3a1.35.0-4+deb12u1+b1_amd64.deb ... #10 3.666 Unpacking udhcpc:amd64 (1:1.35.0-4+deb12u1+b1) ... #10 3.779 Setting up cpio (2.13+dfsg-7.1) ... #10 3.814 update-alternatives: using /bin/mt-gnu to provide /bin/mt (mt) in auto mode #10 3.814 update-alternatives: warning: skip creation of /usr/share/man/man1/mt.1.gz because associated file /usr/share/man/man1/mt-gnu.1.gz (of link group mt) doesn't exist #10 3.831 Setting up python3-watchdog (2.2.1-1) ... #10 3.954 Setting up busybox (1:1.35.0-4+deb12u1+b1) ... #10 3.993 Setting up libblas3:amd64 (3.11.0-2) ... #10 4.018 update-alternatives: using /usr/lib/x86_64-linux-gnu/blas/libblas.so.3 to provide /usr/lib/x86_64-linux-gnu/libblas.so.3 (libblas.so.3-x86_64-linux-gnu) in auto mode #10 4.036 Setting up libiperf0:amd64 (3.12-1+deb12u2) ... #10 4.071 Setting up udhcpc:amd64 (1:1.35.0-4+deb12u1+b1) ... #10 4.119 Setting up librpmio9 (4.18.0+dfsg-1+deb12u1) ... #10 4.153 Setting up librpm9 (4.18.0+dfsg-1+deb12u1) ... #10 4.199 Setting up liblapack3:amd64 (3.11.0-2) ... #10 4.226 update-alternatives: using /usr/lib/x86_64-linux-gnu/lapack/liblapack.so.3 to provide /usr/lib/x86_64-linux-gnu/liblapack.so.3 (liblapack.so.3-x86_64-linux-gnu) in auto mode #10 4.245 Setting up iperf3 (3.12-1+deb12u2) ... #10 4.344 debconf: unable to initialize frontend: Dialog #10 4.344 debconf: (TERM is not set, so the dialog frontend is not usable.) #10 4.344 debconf: falling back to frontend: Readline #10 4.348 debconf: unable to initialize frontend: Readline #10 4.348 debconf: (This frontend requires a controlling tty.) #10 4.348 debconf: falling back to frontend: Teletype #10 4.355 Configuring iperf3 #10 4.355 ------------------ #10 4.355 #10 4.355 Choose this option if Iperf3 should start automatically as a daemon, now and at #10 4.355 boot time. #10 4.355 #10 4.355 Start Iperf3 as a daemon automatically? [yes/no] #10 4.355 Use of uninitialized value $_[1] in join or string at /usr/share/perl5/Debconf/DbDriver/Stack.pm line 111. #10 4.414 invoke-rc.d: could not determine current runlevel #10 4.416 invoke-rc.d: policy-rc.d denied execution of stop. #10 4.562 Use of uninitialized value $val in substitution (s///) at /usr/share/perl5/Debconf/Format/822.pm line 83, <GEN6> line 1. #10 4.562 Use of uninitialized value $val in concatenation (.) or string at /usr/share/perl5/Debconf/Format/822.pm line 84, <GEN6> line 1. #10 4.597 Setting up rpm-common (4.18.0+dfsg-1+deb12u1) ... #10 4.643 Setting up python3-numpy (1:1.24.2-1+deb12u1) ... #10 5.459 Setting up rpm2cpio (4.18.0+dfsg-1+deb12u1) ... #10 5.493 Processing triggers for man-db (2.11.2-2) ... #10 5.527 Processing triggers for dbus (1.14.10-1~deb12u1) ... #10 5.550 Processing triggers for libc-bin (2.36-9+deb12u14) ... #10 DONE 6.2s #11 [ 6/28] RUN PIP3 install --break-system-packages "
git+https://github.com/podshumok/python-smpplib.git@master#egg=smpplib
" pydbus pyusb pysispm pymongo #11 0.556 Collecting smpplib #11 0.556 Cloning
https://github.com/podshumok/python-smpplib.git
(to revision master) to /tmp/pip-install-s1mnlnnd/smpplib_b54f980aa3774eb581f5a6f41bcdb290 #11 0.557 Running command git clone --filter=blob:none --quiet
https://github.com/podshumok/python-smpplib.git
/tmp/pip-install-s1mnlnnd/smpplib_b54f980aa3774eb581f5a6f41bcdb290 #11 0.777 fatal: could not read Username for '
https://github.com
': No such device or address #11 0.778 fatal: expected flush after ref listing #11 0.780 error: subprocess-exited-with-error #11 0.780 #11 0.780 × git clone --filter=blob:none --quiet
https://github.com/podshumok/python-smpplib.git
/tmp/pip-install-s1mnlnnd/smpplib_b54f980aa3774eb581f5a6f41bcdb290 did not run successfully. #11 0.780 │ exit code: 128 #11 0.780 ╰─> See above for output. #11 0.780 #11 0.780 note: This error originates from a subprocess, and is likely not a problem with pip. #11 0.781 error: subprocess-exited-with-error #11 0.781 #11 0.781 × git clone --filter=blob:none --quiet
https://github.com/podshumok/python-smpplib.git
/tmp/pip-install-s1mnlnnd/smpplib_b54f980aa3774eb581f5a6f41bcdb290 did not run successfully. #11 0.781 │ exit code: 128 #11 0.781 ╰─> See above for output. #11 0.781 #11 0.781 note: This error originates from a subprocess, and is likely not a problem with pip. #11 ERROR: process "/bin/sh -c pip3 install --break-system-packages \t\t\"
git+https://github.com/podshumok/python-smpplib.git@master#egg=smpplib\
" \t\tpydbus \t\tpyusb \t\tpysispm \t\tpymongo" did not complete successfully: exit code: 1 ------ > [ 6/28] RUN PIP3 install --break-system-packages "
git+https://github.com/podshumok/python-smpplib.git@master#egg=smpplib
" pydbus pyusb pysispm pymongo: 0.780 ╰─> See above for output. 0.780 0.780 note: This error originates from a subprocess, and is likely not a problem with pip. 0.781 error: subprocess-exited-with-error 0.781 0.781 × git clone --filter=blob:none --quiet
https://github.com/podshumok/python-smpplib.git
/tmp/pip-install-s1mnlnnd/smpplib_b54f980aa3774eb581f5a6f41bcdb290 did not run successfully. 0.781 │ exit code: 128 0.781 ╰─> See above for output. 0.781 0.781 note: This error originates from a subprocess, and is likely not a problem with pip. ------ [33m2 warnings found (use docker --debug to expand): [0m - InvalidDefaultArgInFrom: Default value for ARG $USER/debian-bookworm-build results in empty or invalid base image name (line 2) - LegacyKeyValueFormat: "ENV key=value" should be used instead of legacy "ENV key value" format (line 65) Dockerfile:37 -------------------- 36 | # install osmo-gsm-tester pip dependencies 37 | >>> RUN pip3 install --break-system-packages \ 38 | >>> "
git+https://github.com/podshumok/python-smpplib.git@master#egg=smpplib
" \ 39 | >>> pydbus \ 40 | >>> pyusb \ 41 | >>> pysispm \ 42 | >>> pymongo 43 | -------------------- ERROR: failed to solve: process "/bin/sh -c pip3 install --break-system-packages \t\t\"
git+https://github.com/podshumok/python-smpplib.git@master#egg=smpplib\
" \t\tpydbus \t\tpyusb \t\tpysispm \t\tpymongo" did not complete successfully: exit code: 1 make: *** [../make/Makefile:97: docker-build] Error 1 make: Leaving directory '<
https://jenkins.osmocom.org/jenkins/job/osmo-gsm-tester_build-osmo-stp/ws/d…
'> Build step 'Execute shell' marked build as failure Skipped archiving because build is not successful
1
1
0
0
Jenkins build became unstable: ttcn3-stp-test-latest #2481
by jenkins@lists.osmocom.org
02 Sep '26
02 Sep '26
See <
https://jenkins.osmocom.org/jenkins/job/ttcn3-stp-test-latest/2481/display/…
>
1
0
0
0
Build failed in Jenkins: ttcn3-sgsn-test-latest #2893
by jenkins@lists.osmocom.org
02 Sep '26
02 Sep '26
See <
https://jenkins.osmocom.org/jenkins/job/ttcn3-sgsn-test-latest/2893/display…
> Changes: [Pau Espin Pedrol] smf: Implement TC_gy_ccr_update_rejected [Pau Espin Pedrol] smf: Introduce test TC_gy_charging_cc_time [jolly] IPAd: A test to verify proper session cancellation by eIM [jolly] IPAd: Run pkill with exact binary name [Oliver Smith] eim: set mp_restop_path using TESTENV_SRC_DIR [Pau Espin Pedrol] stp: Support configuring M3UA ASPs serving multiple AS [Pau Espin Pedrol] stp: Fix expectations of TC_rkm_unreg_active [Pau Espin Pedrol] stp: Introduce test TC_asp_act_multias [Pau Espin Pedrol] stp: Introduce test TC_ssnm_distribution_scon_asp_multias [lynxis] SGSN: Iu: ensure every test uses a new subscriber [lynxis] SGSN: TC_attach_gmm_attach_req_while_gmm_attach: fix test case [lynxis] SGSN: add TC_attach_gmm_attach_req_while_gmm_attach_retransmit [lynxis] SGSN: add as_fail_on_gmm_att_reject() [lynxis] SGSN: add TC_attach_gmm_attach_req_while_gmm_attach_changed [lynxis] SGSN: TC_attach_timeout_after_pdp_act: expect SAI when doing auth [lynxis] SGSN: remove TC_attach_no_imei_response [lynxis] SGSN: Remove unsupported acl test cases [lynxis] SGSN: f_routing_area_update(): expect a Location Update by default [lynxis] SGSN: as_service_request(): use as_ciph_utran() to parse the Security [lynxis] SGSN: f_service_request: fix required authentication when doing Service [lynxis] SGSN: ensure every tests use a new subscriber [lynxis] SGSN: Iu: follow Service Request according to ETSI PMM IDLE exception [lynxis] SGSN: osmo-sgsn.cfg: assign gummei to test-mme0 [lynxis] SGSN: raiv_to_gtp_rai(): fix copy-paste error [lynxis] SGSN: TC_sgsn_context_req_out(): rework TC and make it work [pmaier(a)sysmocom.de] eim/prepare.sh: re-align path to restop.py ------------------------------------------ [...truncated 212.74 KiB...] [1;31m------ SGSN_Tests.TC_attach_auth_sai_reject fail ------[0m Saving talloc report from 127.0.0.10:4245 to SGSN_Tests.TC_attach_auth_sai_reject.talloc Traceback (most recent call last): File "/usr/local/lib/python3.13/dist-packages/osmopy/osmo_interact/common.py", line 434, in main_run_commands interact.connect() ~~~~~~~~~~~~~~~~^^ File "/usr/local/lib/python3.13/dist-packages/osmopy/osmo_interact/vty.py", line 84, in connect super().connect() ~~~~~~~~~~~~~~~^^ File "/usr/local/lib/python3.13/dist-packages/osmopy/osmo_interact/common.py", line 88, in connect self.socket.connect((self.host, int(self.port))) ~~~~~~~~~~~~~~~~~~~^^^^^^^^^^^^^^^^^^^^^^^^^^^^^ ConnectionRefusedError: [Errno 111] Connection refused Waiting for packet dumper to finish... 0 (prev_count=-1, count=5712) Waiting for packet dumper to finish... 1 (prev_count=5712, count=6300) MTC@cf82007b9067: External command `<
https://jenkins.osmocom.org/jenkins/job/ttcn3-sgsn-test-latest/ws/src/osmo-…
> SGSN_Tests.TC_attach_auth_sai_reject fail' was executed successfully (exit status: 0). MTC@cf82007b9067: Starting external command `<
https://jenkins.osmocom.org/jenkins/job/ttcn3-sgsn-test-latest/ws/src/osmo-…
> SGSN_Tests.TC_attach_gsup_lu_timeout'. ------ SGSN_Tests.TC_attach_gsup_lu_timeout ------ (12:40:38) load average: 2.57, 2.28, 1.89 /usr/bin/dumpcap -q -s 1520 -n -i any -w "<
https://jenkins.osmocom.org/jenkins/job/ttcn3-sgsn-test-latest/2893/artifac…
"> ><
https://jenkins.osmocom.org/jenkins/job/ttcn3-sgsn-test-latest/2893/artifac…
> 2>/tmp/cmderr & Waiting for packet dumper to start... 0 MTC@cf82007b9067: External command `<
https://jenkins.osmocom.org/jenkins/job/ttcn3-sgsn-test-latest/ws/src/osmo-…
> SGSN_Tests.TC_attach_gsup_lu_timeout' was executed successfully (exit status: 0). MTC@cf82007b9067: Test case TC_attach_gsup_lu_timeout started. MTC@cf82007b9067: setverdict(fail): none -> fail reason: ""VTY Timeout for prompt: enable"", new component reason: ""VTY Timeout for prompt: enable"" MTC@cf82007b9067: Setting final verdict of the test case. MTC@cf82007b9067: Local verdict of MTC: fail reason: ""VTY Timeout for prompt: enable"" MTC@cf82007b9067: No PTCs were created. MTC@cf82007b9067: Test case TC_attach_gsup_lu_timeout finished. Verdict: fail reason: "VTY Timeout for prompt: enable" MTC@cf82007b9067: Starting external command `<
https://jenkins.osmocom.org/jenkins/job/ttcn3-sgsn-test-latest/ws/src/osmo-…
> SGSN_Tests.TC_attach_gsup_lu_timeout fail'. (12:40:41) load average: 2.57, 2.28, 1.89 [1;31m------ SGSN_Tests.TC_attach_gsup_lu_timeout fail ------[0m Saving talloc report from 127.0.0.10:4245 to SGSN_Tests.TC_attach_gsup_lu_timeout.talloc Traceback (most recent call last): File "/usr/local/lib/python3.13/dist-packages/osmopy/osmo_interact/common.py", line 434, in main_run_commands interact.connect() ~~~~~~~~~~~~~~~~^^ File "/usr/local/lib/python3.13/dist-packages/osmopy/osmo_interact/vty.py", line 84, in connect super().connect() ~~~~~~~~~~~~~~~^^ File "/usr/local/lib/python3.13/dist-packages/osmopy/osmo_interact/common.py", line 88, in connect self.socket.connect((self.host, int(self.port))) ~~~~~~~~~~~~~~~~~~~^^^^^^^^^^^^^^^^^^^^^^^^^^^^^ ConnectionRefusedError: [Errno 111] Connection refused Waiting for packet dumper to finish... 0 (prev_count=-1, count=5712) Waiting for packet dumper to finish... 1 (prev_count=5712, count=6300) MTC@cf82007b9067: External command `<
https://jenkins.osmocom.org/jenkins/job/ttcn3-sgsn-test-latest/ws/src/osmo-…
> SGSN_Tests.TC_attach_gsup_lu_timeout fail' was executed successfully (exit status: 0). MTC@cf82007b9067: Starting external command `<
https://jenkins.osmocom.org/jenkins/job/ttcn3-sgsn-test-latest/ws/src/osmo-…
> SGSN_Tests.TC_attach_gsup_lu_reject'. ------ SGSN_Tests.TC_attach_gsup_lu_reject ------ (12:40:46) load average: 2.44, 2.26, 1.88 /usr/bin/dumpcap -q -s 1520 -n -i any -w "<
https://jenkins.osmocom.org/jenkins/job/ttcn3-sgsn-test-latest/2893/artifac…
"> ><
https://jenkins.osmocom.org/jenkins/job/ttcn3-sgsn-test-latest/2893/artifac…
> 2>/tmp/cmderr & Waiting for packet dumper to start... 0 MTC@cf82007b9067: External command `<
https://jenkins.osmocom.org/jenkins/job/ttcn3-sgsn-test-latest/ws/src/osmo-…
> SGSN_Tests.TC_attach_gsup_lu_reject' was executed successfully (exit status: 0). MTC@cf82007b9067: Test case TC_attach_gsup_lu_reject started. MTC@cf82007b9067: setverdict(fail): none -> fail reason: ""VTY Timeout for prompt: enable"", new component reason: ""VTY Timeout for prompt: enable"" MTC@cf82007b9067: Setting final verdict of the test case. MTC@cf82007b9067: Local verdict of MTC: fail reason: ""VTY Timeout for prompt: enable"" MTC@cf82007b9067: No PTCs were created. MTC@cf82007b9067: Test case TC_attach_gsup_lu_reject finished. Verdict: fail reason: "VTY Timeout for prompt: enable" MTC@cf82007b9067: Starting external command `<
https://jenkins.osmocom.org/jenkins/job/ttcn3-sgsn-test-latest/ws/src/osmo-…
> SGSN_Tests.TC_attach_gsup_lu_reject fail'. (12:40:49) load average: 2.24, 2.22, 1.87 [1;31m------ SGSN_Tests.TC_attach_gsup_lu_reject fail ------[0m Saving talloc report from 127.0.0.10:4245 to SGSN_Tests.TC_attach_gsup_lu_reject.talloc Traceback (most recent call last): File "/usr/local/lib/python3.13/dist-packages/osmopy/osmo_interact/common.py", line 434, in main_run_commands interact.connect() ~~~~~~~~~~~~~~~~^^ File "/usr/local/lib/python3.13/dist-packages/osmopy/osmo_interact/vty.py", line 84, in connect super().connect() ~~~~~~~~~~~~~~~^^ File "/usr/local/lib/python3.13/dist-packages/osmopy/osmo_interact/common.py", line 88, in connect self.socket.connect((self.host, int(self.port))) ~~~~~~~~~~~~~~~~~~~^^^^^^^^^^^^^^^^^^^^^^^^^^^^^ ConnectionRefusedError: [Errno 111] Connection refused Waiting for packet dumper to finish... 0 (prev_count=-1, count=5712) Waiting for packet dumper to finish... 1 (prev_count=5712, count=6300) MTC@cf82007b9067: External command `<
https://jenkins.osmocom.org/jenkins/job/ttcn3-sgsn-test-latest/ws/src/osmo-…
> SGSN_Tests.TC_attach_gsup_lu_reject fail' was executed successfully (exit status: 0). MTC@cf82007b9067: Starting external command `<
https://jenkins.osmocom.org/jenkins/job/ttcn3-sgsn-test-latest/ws/src/osmo-…
> SGSN_Tests.TC_attach_combined'. ------ SGSN_Tests.TC_attach_combined ------ (12:40:54) load average: 2.14, 2.20, 1.87 /usr/bin/dumpcap -q -s 1520 -n -i any -w "<
https://jenkins.osmocom.org/jenkins/job/ttcn3-sgsn-test-latest/2893/artifac…
"> ><
https://jenkins.osmocom.org/jenkins/job/ttcn3-sgsn-test-latest/2893/artifac…
> 2>/tmp/cmderr & Waiting for packet dumper to start... 0 MTC@cf82007b9067: External command `<
https://jenkins.osmocom.org/jenkins/job/ttcn3-sgsn-test-latest/ws/src/osmo-…
> SGSN_Tests.TC_attach_combined' was executed successfully (exit status: 0). MTC@cf82007b9067: Test case TC_attach_combined started. MTC@cf82007b9067: setverdict(fail): none -> fail reason: ""VTY Timeout for prompt: enable"", new component reason: ""VTY Timeout for prompt: enable"" MTC@cf82007b9067: Setting final verdict of the test case. MTC@cf82007b9067: Local verdict of MTC: fail reason: ""VTY Timeout for prompt: enable"" MTC@cf82007b9067: No PTCs were created. MTC@cf82007b9067: Test case TC_attach_combined finished. Verdict: fail reason: "VTY Timeout for prompt: enable" MTC@cf82007b9067: Starting external command `<
https://jenkins.osmocom.org/jenkins/job/ttcn3-sgsn-test-latest/ws/src/osmo-…
> SGSN_Tests.TC_attach_combined fail'. (12:40:57) load average: 2.14, 2.20, 1.87 [1;31m------ SGSN_Tests.TC_attach_combined fail ------[0m Saving talloc report from 127.0.0.10:4245 to SGSN_Tests.TC_attach_combined.talloc Traceback (most recent call last): File "/usr/local/lib/python3.13/dist-packages/osmopy/osmo_interact/common.py", line 434, in main_run_commands interact.connect() ~~~~~~~~~~~~~~~~^^ File "/usr/local/lib/python3.13/dist-packages/osmopy/osmo_interact/vty.py", line 84, in connect super().connect() ~~~~~~~~~~~~~~~^^ File "/usr/local/lib/python3.13/dist-packages/osmopy/osmo_interact/common.py", line 88, in connect self.socket.connect((self.host, int(self.port))) ~~~~~~~~~~~~~~~~~~~^^^^^^^^^^^^^^^^^^^^^^^^^^^^^ ConnectionRefusedError: [Errno 111] Connection refused Waiting for packet dumper to finish... 0 (prev_count=-1, count=5320) Waiting for packet dumper to finish... 1 (prev_count=5320, count=6300) MTC@cf82007b9067: External command `<
https://jenkins.osmocom.org/jenkins/job/ttcn3-sgsn-test-latest/ws/src/osmo-…
> SGSN_Tests.TC_attach_combined fail' was executed successfully (exit status: 0). MTC@cf82007b9067: Starting external command `<
https://jenkins.osmocom.org/jenkins/job/ttcn3-sgsn-test-latest/ws/src/osmo-…
> SGSN_Tests.TC_attach_no_imsi_response'. ------ SGSN_Tests.TC_attach_no_imsi_response ------ (12:41:02) load average: 1.97, 2.16, 1.86 /usr/bin/dumpcap -q -s 1520 -n -i any -w "<
https://jenkins.osmocom.org/jenkins/job/ttcn3-sgsn-test-latest/2893/artifac…
"> ><
https://jenkins.osmocom.org/jenkins/job/ttcn3-sgsn-test-latest/2893/artifac…
> 2>/tmp/cmderr & Waiting for packet dumper to start... 0 MTC@cf82007b9067: External command `<
https://jenkins.osmocom.org/jenkins/job/ttcn3-sgsn-test-latest/ws/src/osmo-…
> SGSN_Tests.TC_attach_no_imsi_response' was executed successfully (exit status: 0). MTC@cf82007b9067: Test case TC_attach_no_imsi_response started. MTC@cf82007b9067: setverdict(fail): none -> fail reason: ""VTY Timeout for prompt: enable"", new component reason: ""VTY Timeout for prompt: enable"" MTC@cf82007b9067: Setting final verdict of the test case. MTC@cf82007b9067: Local verdict of MTC: fail reason: ""VTY Timeout for prompt: enable"" MTC@cf82007b9067: No PTCs were created. MTC@cf82007b9067: Test case TC_attach_no_imsi_response finished. Verdict: fail reason: "VTY Timeout for prompt: enable" MTC@cf82007b9067: Starting external command `<
https://jenkins.osmocom.org/jenkins/job/ttcn3-sgsn-test-latest/ws/src/osmo-…
> SGSN_Tests.TC_attach_no_imsi_response fail'. (12:41:05) load average: 1.89, 2.14, 1.85 [1;31m------ SGSN_Tests.TC_attach_no_imsi_response fail ------[0m Saving talloc report from 127.0.0.10:4245 to SGSN_Tests.TC_attach_no_imsi_response.talloc Traceback (most recent call last): File "/usr/local/lib/python3.13/dist-packages/osmopy/osmo_interact/common.py", line 434, in main_run_commands interact.connect() ~~~~~~~~~~~~~~~~^^ File "/usr/local/lib/python3.13/dist-packages/osmopy/osmo_interact/vty.py", line 84, in connect super().connect() ~~~~~~~~~~~~~~~^^ File "/usr/local/lib/python3.13/dist-packages/osmopy/osmo_interact/common.py", line 88, in connect self.socket.connect((self.host, int(self.port))) ~~~~~~~~~~~~~~~~~~~^^^^^^^^^^^^^^^^^^^^^^^^^^^^^ ConnectionRefusedError: [Errno 111] Connection refused Waiting for packet dumper to finish... 0 (prev_count=-1, count=5516) Waiting for packet dumper to finish... 1 (prev_count=5516, count=6300) MTC@cf82007b9067: External command `<
https://jenkins.osmocom.org/jenkins/job/ttcn3-sgsn-test-latest/ws/src/osmo-…
> SGSN_Tests.TC_attach_no_imsi_response fail' was executed successfully (exit status: 0). MTC@cf82007b9067: Starting external command `<
https://jenkins.osmocom.org/jenkins/job/ttcn3-sgsn-test-latest/ws/src/osmo-…
> SGSN_Tests.TC_attach_check_complete_resend'. ------ SGSN_Tests.TC_attach_check_complete_resend ------ (12:41:10) load average: 1.74, 2.11, 1.84 /usr/bin/dumpcap -q -s 1520 -n -i any -w "<
https://jenkins.osmocom.org/jenkins/job/ttcn3-sgsn-test-latest/2893/artifac…
"> ><
https://jenkins.osmocom.org/jenkins/job/ttcn3-sgsn-test-latest/2893/artifac…
> 2>/tmp/cmderr & Waiting for packet dumper to start... 0 MTC@cf82007b9067: External command `<
https://jenkins.osmocom.org/jenkins/job/ttcn3-sgsn-test-latest/ws/src/osmo-…
> SGSN_Tests.TC_attach_check_complete_resend' was executed successfully (exit status: 0). MTC@cf82007b9067: Test case TC_attach_check_complete_resend started. MTC@cf82007b9067: setverdict(fail): none -> fail reason: ""VTY Timeout for prompt: enable"", new component reason: ""VTY Timeout for prompt: enable"" MTC@cf82007b9067: Setting final verdict of the test case. MTC@cf82007b9067: Local verdict of MTC: fail reason: ""VTY Timeout for prompt: enable"" MTC@cf82007b9067: No PTCs were created. MTC@cf82007b9067: Test case TC_attach_check_complete_resend finished. Verdict: fail reason: "VTY Timeout for prompt: enable" MTC@cf82007b9067: Starting external command `<
https://jenkins.osmocom.org/jenkins/job/ttcn3-sgsn-test-latest/ws/src/osmo-…
> SGSN_Tests.TC_attach_check_complete_resend fail'. (12:41:13) load average: 1.76, 2.11, 1.84 [1;31m------ SGSN_Tests.TC_attach_check_complete_resend fail ------[0m Saving talloc report from 127.0.0.10:4245 to SGSN_Tests.TC_attach_check_complete_resend.talloc Traceback (most recent call last): File "/usr/local/lib/python3.13/dist-packages/osmopy/osmo_interact/common.py", line 434, in main_run_commands interact.connect() ~~~~~~~~~~~~~~~~^^ File "/usr/local/lib/python3.13/dist-packages/osmopy/osmo_interact/vty.py", line 84, in connect super().connect() ~~~~~~~~~~~~~~~^^ File "/usr/local/lib/python3.13/dist-packages/osmopy/osmo_interact/common.py", line 88, in connect self.socket.connect((self.host, int(self.port))) ~~~~~~~~~~~~~~~~~~~^^^^^^^^^^^^^^^^^^^^^^^^^^^^^ ConnectionRefusedError: [Errno 111] Connection refused Waiting for packet dumper to finish... 0 (prev_count=-1, count=5712) Waiting for packet dumper to finish... 1 (prev_count=5712, count=6300) MTC@cf82007b9067: External command `<
https://jenkins.osmocom.org/jenkins/job/ttcn3-sgsn-test-latest/ws/src/osmo-…
> SGSN_Tests.TC_attach_check_complete_resend fail' was executed successfully (exit status: 0). MTC@cf82007b9067: Starting external command `<
https://jenkins.osmocom.org/jenkins/job/ttcn3-sgsn-test-latest/ws/src/osmo-…
> SGSN_Tests.TC_hlr_location_cancel_request_update'. ------ SGSN_Tests.TC_hlr_location_cancel_request_update ------ (12:41:18) load average: 1.70, 2.09, 1.84 /usr/bin/dumpcap -q -s 1520 -n -i any -w "<
https://jenkins.osmocom.org/jenkins/job/ttcn3-sgsn-test-latest/2893/artifac…
"> ><
https://jenkins.osmocom.org/jenkins/job/ttcn3-sgsn-test-latest/2893/artifac…
> 2>/tmp/cmderr & Waiting for packet dumper to start... 0 MTC@cf82007b9067: External command `<
https://jenkins.osmocom.org/jenkins/job/ttcn3-sgsn-test-latest/ws/src/osmo-…
> SGSN_Tests.TC_hlr_location_cancel_request_update' was executed successfully (exit status: 0). MTC@cf82007b9067: Test case TC_hlr_location_cancel_request_update started. MTC@cf82007b9067: setverdict(fail): none -> fail reason: ""VTY Timeout for prompt: enable"", new component reason: ""VTY Timeout for prompt: enable"" MTC@cf82007b9067: Setting final verdict of the test case. MTC@cf82007b9067: Local verdict of MTC: fail reason: ""VTY Timeout for prompt: enable"" MTC@cf82007b9067: No PTCs were created. MTC@cf82007b9067: Test case TC_hlr_location_cancel_request_update finished. Verdict: fail reason: "VTY Timeout for prompt: enable" MTC@cf82007b9067: Starting external command `<
https://jenkins.osmocom.org/jenkins/job/ttcn3-sgsn-test-latest/ws/src/osmo-…
> SGSN_Tests.TC_hlr_location_cancel_request_update fail'. (12:41:22) load average: 1.70, 2.09, 1.84 [1;31m------ SGSN_Tests.TC_hlr_location_cancel_request_update fail ------[0m Saving talloc report from 127.0.0.10:4245 to SGSN_Tests.TC_hlr_location_cancel_request_update.talloc Traceback (most recent call last): File "/usr/local/lib/python3.13/dist-packages/osmopy/osmo_interact/common.py", line 434, in main_run_commands interact.connect() ~~~~~~~~~~~~~~~~^^ File "/usr/local/lib/python3.13/dist-packages/osmopy/osmo_interact/vty.py", line 84, in connect super().connect() ~~~~~~~~~~~~~~~^^ File "/usr/local/lib/python3.13/dist-packages/osmopy/osmo_interact/common.py", line 88, in connect self.socket.connect((self.host, int(self.port))) ~~~~~~~~~~~~~~~~~~~^^^^^^^^^^^^^^^^^^^^^^^^^^^^^ ConnectionRefusedError: [Errno 111] Connection refused Waiting for packet dumper to finish... 0 (prev_count=-1, count=5320) Waiting for packet dumper to finish... 1 (prev_count=5320, count=6300) MTC@cf82007b9067: External command `<
https://jenkins.osmocom.org/jenkins/job/ttcn3-sgsn-test-latest/ws/src/osmo-…
> SGSN_Tests.TC_hlr_location_cancel_request_update fail' was executed successfully (exit status: 0). MTC@cf82007b9067: Starting external command `<
https://jenkins.osmocom.org/jenkins/job/ttcn3-sgsn-test-latest/ws/src/osmo-…
> SGSN_Tests.TC_hlr_location_cancel_request_withdraw'. ------ SGSN_Tests.TC_hlr_location_cancel_request_withdraw ------ (12:41:27) load average: 1.57, 2.05, 1.83 /usr/bin/dumpcap -q -s 1520 -n -i any -w "<
https://jenkins.osmocom.org/jenkins/job/ttcn3-sgsn-test-latest/2893/artifac…
"> ><
https://jenkins.osmocom.org/jenkins/job/ttcn3-sgsn-test-latest/2893/artifac…
> 2>/tmp/cmderr & Waiting for packet dumper to start... 0 MTC@cf82007b9067: External command `<
https://jenkins.osmocom.org/jenkins/job/ttcn3-sgsn-test-latest/ws/src/osmo-…
> SGSN_Tests.TC_hlr_location_cancel_request_withdraw' was executed successfully (exit status: 0). MTC@cf82007b9067: Test case TC_hlr_location_cancel_request_withdraw started. MTC@cf82007b9067: setverdict(fail): none -> fail reason: ""VTY Timeout for prompt: enable"", new component reason: ""VTY Timeout for prompt: enable"" MTC@cf82007b9067: Setting final verdict of the test case. MTC@cf82007b9067: Local verdict of MTC: fail reason: ""VTY Timeout for prompt: enable"" MTC@cf82007b9067: No PTCs were created. MTC@cf82007b9067: Test case TC_hlr_location_cancel_request_withdraw finished. Verdict: fail reason: "VTY Timeout for prompt: enable" MTC@cf82007b9067: Starting external command `<
https://jenkins.osmocom.org/jenkins/job/ttcn3-sgsn-test-latest/ws/src/osmo-…
> SGSN_Tests.TC_hlr_location_cancel_request_withdraw fail'. (12:41:30) load average: 1.52, 2.04, 1.82 [1;31m------ SGSN_Tests.TC_hlr_location_cancel_request_withdraw fail ------[0m Saving talloc report from 127.0.0.10:4245 to SGSN_Tests.TC_hlr_location_cancel_request_withdraw.talloc Traceback (most recent call last): File "/usr/local/lib/python3.13/dist-packages/osmopy/osmo_interact/common.py", line 434, in main_run_commands interact.connect() ~~~~~~~~~~~~~~~~^^ File "/usr/local/lib/python3.13/dist-packages/osmopy/osmo_interact/vty.py", line 84, in connect super().connect() ~~~~~~~~~~~~~~~^^ File "/usr/local/lib/python3.13/dist-packages/osmopy/osmo_interact/common.py", line 88, in connect self.socket.connect((self.host, int(self.port))) ~~~~~~~~~~~~~~~~~~~^^^^^^^^^^^^^^^^^^^^^^^^^^^^^ ConnectionRefusedError: [Errno 111] Connection refused Waiting for packet dumper to finish... 0 (prev_count=-1, count=5712) Waiting for packet dumper to finish... 1 (prev_count=5712, count=6300) [1;91m[testenv][generic] Timeout in wait_until_test_stopped()[0m [1;34m[testenv][generic] Stopping podman container[0m [0;94m[testenv][generic] + ['podman', 'kill', 'testenv-sgsn-generic-osmocom-latest-20260902-1239-e1f74094-1'][0m testenv-sgsn-generic-osmocom-latest-20260902-1239-e1f74094-1 [1;34m[testenv][generic] Stopping testsuite (2580698)[0m [0;94m[testenv][generic] feed_watchdog_loop: podman container has stopped[0m [1;34m[testenv][generic] Logs saved to:
https://jenkins.osmocom.org/jenkins/job/ttcn3-sgsn-test-latest/2893/artifac…
[0m + RC=1 + [ 1 = 0 ] + uptime + grep --color=always -o load.* [01;31m[Kload average: 1.40, 2.00, 1.81[m[K + exit 1 Build step 'Execute shell' marked build as failure Recording test results [Checks API] No suitable checks publisher found.
1
0
0
0
Jenkins build is back to stable : ttcn3-smf-test-ogs #3
by jenkins@lists.osmocom.org
02 Sep '26
02 Sep '26
See <
https://jenkins.osmocom.org/jenkins/job/ttcn3-smf-test-ogs/3/display/redire…
>
1
0
0
0
Build failed in Jenkins: osmo-gsm-tester_build-osmo-sgsn #46449
by jenkins@lists.osmocom.org
02 Sep '26
02 Sep '26
See <
https://jenkins.osmocom.org/jenkins/job/osmo-gsm-tester_build-osmo-sgsn/464…
> Changes: ------------------------------------------ Started by upstream project "master-osmo-sgsn" build number 58415 originally caused by: Started by upstream project "master-libosmo-sigtran" build number 1427 originally caused by: Started by an SCM change Running as SYSTEM Building remotely on build4-deb12build-ansible (ttcn3 obs osmo-gsm-tester-build qemu io_uring linux-shallow-clone osmocom-gerrit coverity osmocom-master) in workspace <
https://jenkins.osmocom.org/jenkins/job/osmo-gsm-tester_build-osmo-sgsn/ws/
> The recommended git tool is: NONE No credentials specified > git rev-parse --resolve-git-dir <
https://jenkins.osmocom.org/jenkins/job/osmo-gsm-tester_build-osmo-sgsn/ws/…
> # timeout=10 Fetching changes from the remote Git repository > git config remote.origin.url
https://gerrit.osmocom.org/osmo-gsm-tester
# timeout=10 Fetching upstream changes from
https://gerrit.osmocom.org/osmo-gsm-tester
> git --version # timeout=10 > git --version # 'git version 2.39.5' > git fetch --tags --force --progress --
https://gerrit.osmocom.org/osmo-gsm-tester
+refs/heads/*:refs/remotes/origin/* # timeout=10 > git rev-parse origin/master^{commit} # timeout=10 Checking out Revision 14e2cf8b779ffdfff66777ba7e81b38d4e8b2fee (origin/master) > git config core.sparsecheckout # timeout=10 > git checkout -f 14e2cf8b779ffdfff66777ba7e81b38d4e8b2fee # timeout=10 Commit message: "contrib/jenkins-build-osmo-ggsn.sh: Depend on libosmo-netif" > git rev-list --no-walk 14e2cf8b779ffdfff66777ba7e81b38d4e8b2fee # timeout=10 [osmo-gsm-tester_build-osmo-sgsn] $ /bin/sh -xe /tmp/jenkins16550221930287275787.sh + rm -rf docker-playground + git clone --depth=1 --branch=master
https://gerrit.osmocom.org/docker-playground
docker-playground Cloning into 'docker-playground'... + git -C docker-playground log --oneline f69f41a ttcn3-asterisk-ims-ue-test: set execfn + make -C docker-playground/osmo-gsm-tester make: Entering directory '<
https://jenkins.osmocom.org/jenkins/job/osmo-gsm-tester_build-osmo-sgsn/ws/…
'> awk: fatal: cannot open file `.release' for reading: No such file or directory awk: fatal: cannot open file `.release' for reading: No such file or directory awk: fatal: cannot open file `.release' for reading: No such file or directory rm -rf .common cp -r <
https://jenkins.osmocom.org/jenkins/job/osmo-gsm-tester_build-osmo-sgsn/ws/…
> .common INFO: .release created release=0.0.0 docker build \ --build-arg USER=osmocom-build \ --build-arg UID=1000 \ --build-arg REGISTRY=docker.io \ --build-arg OSMO_TTCN3_BRANCH=master \ --build-arg UPSTREAM_DISTRO=debian:bookworm \ --build-arg DISTRO=debian-bookworm \ --build-arg
OSMOCOM_REPO_MIRROR=https://downloads.osmocom.org
\ --build-arg OSMOCOM_REPO_PATH=packages/osmocom: \ --build-arg OSMOCOM_REPO_VERSION=latest \ --build-arg
OSMOCOM_REPO_TESTSUITE_MIRROR=https://downloads.osmocom.org
\ --build-arg ASTERISK_BRANCH=sysmocom/20.7.0 \ --build-arg LIBOSMOCORE_BRANCH=master \ --build-arg M3UA_TESTTOOL_BRANCH=osmocom/master \ --build-arg OSMO_BB_BRANCH=master \ --build-arg OSMO_BSC_BRANCH=master \ --build-arg OSMO_BTS_BRANCH=master \ --build-arg OSMO_CBC_BRANCH=master \ --build-arg OSMO_DIA2GSUP_BRANCH=master \ --build-arg OSMO_EPDG_BRANCH=master \ --build-arg OSMO_GBPROXY_BRANCH=master \ --build-arg OSMO_GGSN_BRANCH=master \ --build-arg OSMO_GSM_TESTER_BRANCH=master \ --build-arg OSMO_HLR_BRANCH=master \ --build-arg OSMO_HNBGW_BRANCH=master \ --build-arg OSMO_HNODEB_BRANCH=master \ --build-arg OSMO_IUH_BRANCH=master \ --build-arg OSMO_MGW_BRANCH=master \ --build-arg OSMO_MSC_BRANCH=master \ --build-arg OSMO_NITB_BRANCH=master \ --build-arg OSMO_PCU_BRANCH=master \ --build-arg OSMO_REMSIM_BRANCH=master \ --build-arg OSMO_S1GW_BRANCH=master \ --build-arg OSMO_SGSN_BRANCH=master \ --build-arg OSMO_SIP_BRANCH=master \ --build-arg OSMO_STP_BRANCH=master \ --build-arg OSMO_UECUPS_BRANCH=master \ --build-arg OPEN5GS_BRANCH=main \ --build-arg PJPROJECT_BRANCH=sysmocom/2.14 \ -t docker.io/osmocom-build/osmo-gsm-tester:latest . #0 building with "default" instance using docker driver #1 [internal] load build definition from Dockerfile #1 transferring dockerfile: 4.84kB done #1 WARN: InvalidDefaultArgInFrom: Default value for ARG $USER/debian-bookworm-build results in empty or invalid base image name (line 2) #1 DONE 0.1s #2 [internal] load metadata for docker.io/osmocom-build/debian-bookworm-build:latest #2 DONE 0.0s #3 [internal] load .dockerignore #3 transferring context: 2B done #3 DONE 0.1s #4 [ 1/28] FROM docker.io/osmocom-build/debian-bookworm-build:latest #4 DONE 0.0s #5 [ 4/28] RUN usermod -a -G osmo-gsm-tester jenkins #5 CACHED #6 [ 3/28] RUN groupadd osmo-gsm-tester #6 CACHED #7 [ 2/28] RUN useradd -ms /bin/bash jenkins #7 CACHED #8 [ 5/28] RUN APT-GET update && apt-get install -y --no-install-recommends cpio dbus tcpdump sqlite3 python3 python3-setuptools python3-yaml python3-mako python3-gi python3-numpy python3-wheel python3-watchdog ofono patchelf rpm2cpio sudo libcap2-bin python3-pip udhcpc iperf3 locales #8 CACHED #9 [internal] load build context #9 transferring context: 5.76kB done #9 DONE 0.2s #10 [ 6/28] RUN PIP3 install --break-system-packages "
git+https://github.com/podshumok/python-smpplib.git@master#egg=smpplib
" pydbus pyusb pysispm pymongo #10 ... #11 [22/28] ADD
HTTPS://GERRIT.OSMOCOM.ORG/PLUGINS/GITILES/OSMO-GSM-TESTER/+/MASTER?FORMAT=…
/tmp/commit #11 DONE 0.4s #11 [22/28] ADD
HTTPS://GERRIT.OSMOCOM.ORG/PLUGINS/GITILES/OSMO-GSM-TESTER/+/MASTER?FORMAT=…
/tmp/commit #11 CACHED #10 [ 6/28] RUN PIP3 install --break-system-packages "
git+https://github.com/podshumok/python-smpplib.git@master#egg=smpplib
" pydbus pyusb pysispm pymongo #10 0.851 Collecting smpplib #10 0.851 Cloning
https://github.com/podshumok/python-smpplib.git
(to revision master) to /tmp/pip-install-pjxycofe/smpplib_58ed5a652f6c4269a5173fe52cabaf5c #10 0.852 Running command git clone --filter=blob:none --quiet
https://github.com/podshumok/python-smpplib.git
/tmp/pip-install-pjxycofe/smpplib_58ed5a652f6c4269a5173fe52cabaf5c #10 1.155 fatal: could not read Username for '
https://github.com
': No such device or address #10 1.156 fatal: expected flush after ref listing #10 1.158 error: subprocess-exited-with-error #10 1.158 #10 1.158 × git clone --filter=blob:none --quiet
https://github.com/podshumok/python-smpplib.git
/tmp/pip-install-pjxycofe/smpplib_58ed5a652f6c4269a5173fe52cabaf5c did not run successfully. #10 1.158 │ exit code: 128 #10 1.158 ╰─> See above for output. #10 1.158 #10 1.158 note: This error originates from a subprocess, and is likely not a problem with pip. #10 1.159 error: subprocess-exited-with-error #10 1.159 #10 1.159 × git clone --filter=blob:none --quiet
https://github.com/podshumok/python-smpplib.git
/tmp/pip-install-pjxycofe/smpplib_58ed5a652f6c4269a5173fe52cabaf5c did not run successfully. #10 1.159 │ exit code: 128 #10 1.159 ╰─> See above for output. #10 1.159 #10 1.159 note: This error originates from a subprocess, and is likely not a problem with pip. #10 ERROR: process "/bin/sh -c pip3 install --break-system-packages \t\t\"
git+https://github.com/podshumok/python-smpplib.git@master#egg=smpplib\
" \t\tpydbus \t\tpyusb \t\tpysispm \t\tpymongo" did not complete successfully: exit code: 1 ------ > [ 6/28] RUN PIP3 install --break-system-packages "
git+https://github.com/podshumok/python-smpplib.git@master#egg=smpplib
" pydbus pyusb pysispm pymongo: 1.158 ╰─> See above for output. 1.158 1.158 note: This error originates from a subprocess, and is likely not a problem with pip. 1.159 error: subprocess-exited-with-error 1.159 1.159 × git clone --filter=blob:none --quiet
https://github.com/podshumok/python-smpplib.git
/tmp/pip-install-pjxycofe/smpplib_58ed5a652f6c4269a5173fe52cabaf5c did not run successfully. 1.159 │ exit code: 128 1.159 ╰─> See above for output. 1.159 1.159 note: This error originates from a subprocess, and is likely not a problem with pip. ------ Dockerfile:37 -------------------- 36 | # install osmo-gsm-tester pip dependencies 37 | >>> RUN pip3 install --break-system-packages \ 38 | >>> "
git+https://github.com/podshumok/python-smpplib.git@master#egg=smpplib
" \ 39 | >>> pydbus \ 40 | >>> pyusb \ 41 | >>> pysispm \ 42 | >>> pymongo 43 | -------------------- ERROR: failed to solve: process "/bin/sh -c pip3 install --break-system-packages \t\t\"
git+https://github.com/podshumok/python-smpplib.git@master#egg=smpplib\
" \t\tpydbus \t\tpyusb \t\tpysispm \t\tpymongo" did not complete successfully: exit code: 1 make: *** [../make/Makefile:97: docker-build] Error 1 make: Leaving directory '<
https://jenkins.osmocom.org/jenkins/job/osmo-gsm-tester_build-osmo-sgsn/ws/…
'> Build step 'Execute shell' marked build as failure Skipped archiving because build is not successful
1
1
0
0
Build failed in Jenkins: ttcn3-5gc-test-ogs #466
by jenkins@lists.osmocom.org
02 Sep '26
02 Sep '26
See <
https://jenkins.osmocom.org/jenkins/job/ttcn3-5gc-test-ogs/466/display/redi…
> Changes: [jolly] IPAd: Add EuiccPackageResultList to TC_proc_euicc_data_req [Andreas Eversberg] IPAd: Add eimTransactionId to TC_proc_euicc_data_req [Andreas Eversberg] IPAd: Add eimTransactionId to TC_proc_indirect_prfle_dwnld [Andreas Eversberg] IPAd: Add eimTransactionId to TC_proc_euicc_pkg_dwnld_exec [Andreas Eversberg] IPAd: A test to verify proper session cancellation by eUICC ------------------------------------------ [...truncated 158.31 MiB...] [32m09/01 09:32:03.794[0m: [[33mamf[0m] [1;37mDEBUG[0m: amf_state_operational(): AMF_EVENT_NGAP_LO_SCTP_COMM_UP (../src/amf/amf-sm.c:84) [32m09/01 09:32:03.794[0m: [[33mamf[0m] [1;32mINFO[0m: gNB-N2[127.0.0.202] max_num_of_ostreams : 30 (../src/amf/amf-sm.c:869) TC_connection_inactive-NGAP1(596)@afc778007346: Warning: sizes of 'struct sctp_event_subscribe': compile-time 14, kernel: 14 [32m09/01 09:32:03.799[0m: [[33mamf[0m] [1;32mINFO[0m: gNB-N2 accepted[127.0.0.202]:50001 in ng-path module (../src/amf/ngap-sctp.c:113) [32m09/01 09:32:03.799[0m: [[33mamf[0m] [1;37mDEBUG[0m: amf_state_operational(): AMF_EVENT_NGAP_LO_ACCEPT (../src/amf/amf-sm.c:84) [32m09/01 09:32:03.799[0m: [[33mamf[0m] [1;32mINFO[0m: gNB-N2 accepted[127.0.0.202] in master_sm module (../src/amf/amf-sm.c:822) [32m09/01 09:32:03.803[0m: [[33mamf[0m] [1;37mDEBUG[0m: ngap_state_initial(): ENTRY (../src/amf/ngap-sm.c:28) [32m09/01 09:32:03.803[0m: [[33mamf[0m] [1;37mDEBUG[0m: ngap_state_operational(): ENTRY (../src/amf/ngap-sm.c:55) [32m09/01 09:32:03.803[0m: [[33mamf[0m] [1;32mINFO[0m: [Added] Number of gNBs is now 2 (../src/amf/context.c:1277) [32m09/01 09:32:03.803[0m: [[33mamf[0m] [1;37mDEBUG[0m: SCTP_ASSOC_CHANGE:[T:32769, F:0x0, S:0, I/O:64/30] (../src/amf/ngap-sctp.c:152) [32m09/01 09:32:03.803[0m: [[33mamf[0m] [1;37mDEBUG[0m: SCTP_COMM_UP (../src/amf/ngap-sctp.c:161) [32m09/01 09:32:03.803[0m: [[33mamf[0m] [1;37mDEBUG[0m: amf_state_operational(): AMF_EVENT_NGAP_LO_SCTP_COMM_UP (../src/amf/amf-sm.c:84) [32m09/01 09:32:03.803[0m: [[33mamf[0m] [1;32mINFO[0m: gNB-N2[127.0.0.202] max_num_of_ostreams : 30 (../src/amf/amf-sm.c:869) [32m09/01 09:32:03.808[0m: [[33mamf[0m] [1;37mDEBUG[0m: amf_state_operational(): AMF_EVENT_NGAP_MESSAGE (../src/amf/amf-sm.c:84) [32m09/01 09:32:03.808[0m: [[33mamf[0m] [1;37mDEBUG[0m: ngap_state_operational(): AMF_EVENT_NGAP_MESSAGE (../src/amf/ngap-sm.c:55) [32m09/01 09:32:03.808[0m: [[33mamf[0m] [1;37mDEBUG[0m: NGSetupRequest (../src/amf/ngap-handler.c:288) [32m09/01 09:32:03.808[0m: [[33mamf[0m] [1;37mDEBUG[0m: IP[127.0.0.202] GNB_ID[0x0] GNB_ID_LENGTH[22] (../src/amf/ngap-handler.c:386) [32m09/01 09:32:03.808[0m: [[33mamf[0m] [1;37mDEBUG[0m: PLMN_ID[MCC:999 MNC:70] (../src/amf/ngap-handler.c:391) [32m09/01 09:32:03.808[0m: [[33mamf[0m] [1;37mDEBUG[0m: PagingDRX[0] (../src/amf/ngap-handler.c:395) [32m09/01 09:32:03.808[0m: [[33mamf[0m] [1;37mDEBUG[0m: TAC[1] (../src/amf/ngap-handler.c:439) [32m09/01 09:32:03.808[0m: [[33mamf[0m] [1;37mDEBUG[0m: PLMN_ID[MCC:999 MNC:70] (../src/amf/ngap-handler.c:501) [32m09/01 09:32:03.808[0m: [[33mamf[0m] [1;37mDEBUG[0m: S_NSSAI[SST:1 SD:0xffffff] (../src/amf/ngap-handler.c:562) [32m09/01 09:32:03.808[0m: [[33mamf[0m] [1;37mDEBUG[0m: TAC[1] (../src/amf/ngap-handler.c:72) [32m09/01 09:32:03.808[0m: [[33mamf[0m] [1;37mDEBUG[0m: PLMN_ID[MCC:999 MNC:70] (../src/amf/ngap-handler.c:73) [32m09/01 09:32:03.808[0m: [[33mamf[0m] [1;37mDEBUG[0m: SERVED_TAI_INDEX[0] (../src/amf/ngap-handler.c:78) [32m09/01 09:32:03.808[0m: [[33mamf[0m] [1;37mDEBUG[0m: PLMN_ID[MCC:999 MNC:70] (../src/amf/ngap-handler.c:100) [32m09/01 09:32:03.808[0m: [[33mamf[0m] [1;37mDEBUG[0m: S_NSSAI[SST:1 SD:0xffffff] (../src/amf/ngap-handler.c:105) [32m09/01 09:32:03.808[0m: [[33mamf[0m] [1;37mDEBUG[0m: NG-Setup response (../src/amf/ngap-path.c:356) [32m09/01 09:32:03.808[0m: [[33mamf[0m] [1;37mDEBUG[0m: NGSetupResponse (../src/amf/ngap-build.c:91) [32m09/01 09:32:03.808[0m: [[33mamf[0m] [1;37mDEBUG[0m: IP[127.0.0.202] RAN_ID[0] (../src/amf/ngap-path.c:64) MTC@afc778007346: setverdict(pass): none -> pass MTC@afc778007346: Dynamic test case error: Error message was received from MC: The connect operation refers to test component with component reference 594, which has already terminated. MTC@afc778007346: setverdict(error): pass -> error TC_connection_inactive0(597)@afc778007346: Final verdict of PTC: none [32m09/01 09:32:03.818[0m: [[33mamf[0m] [1;37mDEBUG[0m: SCTP_SHUTDOWN_EVENT:[T:32773, F:0x0, L:12] (../src/amf/ngap-sctp.c:193) [32m09/01 09:32:03.818[0m: [[33mamf[0m] [1;37mDEBUG[0m: amf_state_operational(): AMF_EVENT_NGAP_LO_CONNREFUSED (../src/amf/amf-sm.c:84) [32m09/01 09:32:03.818[0m: [[33mamf[0m] [1;32mINFO[0m: gNB-N2[127.0.0.202] connection refused!!! (../src/amf/amf-sm.c:882) [32m09/01 09:32:03.818[0m: [[33mamf[0m] [1;37mDEBUG[0m: ngap_state_operational(): EXIT (../src/amf/ngap-sm.c:55) [32m09/01 09:32:03.818[0m: [[33mamf[0m] [1;37mDEBUG[0m: ngap_state_final(): EXIT (../src/amf/ngap-sm.c:37) [32m09/01 09:32:03.818[0m: [[33mamf[0m] [1;32mINFO[0m: [Removed] Number of gNBs is now 1 (../src/amf/context.c:1305) [32m09/01 09:32:03.818[0m: [[33mamf[0m] [1;37mDEBUG[0m: SCTP_SHUTDOWN_EVENT:[T:32773, F:0x0, L:12] (../src/amf/ngap-sctp.c:193) [32m09/01 09:32:03.818[0m: [[33mamf[0m] [1;37mDEBUG[0m: amf_state_operational(): AMF_EVENT_NGAP_LO_CONNREFUSED (../src/amf/amf-sm.c:84) [32m09/01 09:32:03.818[0m: [[33mamf[0m] [1;32mINFO[0m: gNB-N2[127.0.0.202] connection refused!!! (../src/amf/amf-sm.c:882) [32m09/01 09:32:03.818[0m: [[33mamf[0m] [1;37mDEBUG[0m: ngap_state_operational(): EXIT (../src/amf/ngap-sm.c:55) [32m09/01 09:32:03.818[0m: [[33mamf[0m] [1;37mDEBUG[0m: ngap_state_final(): EXIT (../src/amf/ngap-sm.c:37) [32m09/01 09:32:03.818[0m: [[33mamf[0m] [1;32mINFO[0m: [Removed] Number of gNBs is now 0 (../src/amf/context.c:1305) TC_connection_inactive-NGAP0(595)@afc778007346: Final verdict of PTC: none TC_connection_inactive-NGAP1(596)@afc778007346: Final verdict of PTC: none MTC@afc778007346: Setting final verdict of the test case. MTC@afc778007346: Local verdict of MTC: error MTC@afc778007346: Local verdict of PTC GTP1U_EM(594): error (error -> error) MTC@afc778007346: Local verdict of PTC TC_connection_inactive-NGAP0(595): none (error -> error) MTC@afc778007346: Local verdict of PTC TC_connection_inactive-NGAP1(596): none (error -> error) MTC@afc778007346: Local verdict of PTC TC_connection_inactive0(597): none (error -> error) MTC@afc778007346: Test case TC_connection_inactive finished. Verdict: error MTC@afc778007346: Starting external command `<
https://jenkins.osmocom.org/jenkins/job/ttcn3-5gc-test-ogs/ws/ttcn3-tcpdump…
> C5G_Tests.TC_connection_inactive error'. (09:32:03) load average: 13.29, 15.08, 14.14 [1;31m------ C5G_Tests.TC_connection_inactive error ------[0m Waiting for packet dumper to finish... 0 (prev_count=-1, count=2972) [32m09/01 09:32:04.204[0m: [[33mausf[0m] [1;37mDEBUG[0m: ausf_state_operational(): OGS_EVENT_NAME_SBI_TIMER (../src/ausf/ausf-sm.c:56) [32m09/01 09:32:04.204[0m: [[33msbi[0m] [1;37mDEBUG[0m: ogs_sbi_nf_state_registered(): OGS_EVENT_NAME_SBI_TIMER (../lib/sbi/nf-sm.c:312) [32m09/01 09:32:04.204[0m: [[33msbi[0m] [1;37mDEBUG[0m: [PATCH]
http://127.0.0.200:7777/nnrf-nfm/v1/nf-instances/b072814e-a5e7-41f1-bd0d-67…
(../lib/sbi/client.c:797) [32m09/01 09:32:04.204[0m: [[33msbi[0m] [1;37mDEBUG[0m: SENDING...[101] (../lib/sbi/client.c:546) [32m09/01 09:32:04.204[0m: [[33msbi[0m] [1;37mDEBUG[0m: [{"op":"replace","path":"/nfStatus","value":"REGISTERED"},{"op":"replace","path":"/load","value":25}] (../lib/sbi/client.c:548) [32m09/01 09:32:04.205[0m: [[33msbi[0m] [1;37mDEBUG[0m: STREAM added [3167] (../lib/sbi/nghttp2-server.c:1749) [32m09/01 09:32:04.205[0m: [[33msbi[0m] [1;37mDEBUG[0m: [PATCH] /nnrf-nfm/v1/nf-instances/b072814e-a5e7-41f1-bd0d-674c7bad9a0f (../lib/sbi/nghttp2-server.c:1308) [32m09/01 09:32:04.205[0m: [[33msbi[0m] [1;37mDEBUG[0m: RECEIVED: 101 (../lib/sbi/nghttp2-server.c:1312) [32m09/01 09:32:04.205[0m: [[33msbi[0m] [1;37mDEBUG[0m: [{"op":"replace","path":"/nfStatus","value":"REGISTERED"},{"op":"replace","path":"/load","value":25}] (../lib/sbi/nghttp2-server.c:1314) [32m09/01 09:32:04.205[0m: [[33msbi[0m] [1;37mDEBUG[0m: [PATCH]
http://127.0.0.10:7777/nnrf-nfm/v1/nf-instances/b072814e-a5e7-41f1-bd0d-674…
(../lib/sbi/client.c:797) [32m09/01 09:32:04.205[0m: [[33msbi[0m] [1;37mDEBUG[0m: SENDING...[101] (../lib/sbi/client.c:546) [32m09/01 09:32:04.205[0m: [[33msbi[0m] [1;37mDEBUG[0m: [{"op":"replace","path":"/nfStatus","value":"REGISTERED"},{"op":"replace","path":"/load","value":25}] (../lib/sbi/client.c:548) [32m09/01 09:32:04.205[0m: [[33msbi[0m] [1;37mDEBUG[0m: STREAM added [481] (../lib/sbi/nghttp2-server.c:1749) [32m09/01 09:32:04.205[0m: [[33msbi[0m] [1;37mDEBUG[0m: [PATCH] /nnrf-nfm/v1/nf-instances/b072814e-a5e7-41f1-bd0d-674c7bad9a0f (../lib/sbi/nghttp2-server.c:1308) [32m09/01 09:32:04.205[0m: [[33msbi[0m] [1;37mDEBUG[0m: RECEIVED: 101 (../lib/sbi/nghttp2-server.c:1312) [32m09/01 09:32:04.205[0m: [[33msbi[0m] [1;37mDEBUG[0m: [{"op":"replace","path":"/nfStatus","value":"REGISTERED"},{"op":"replace","path":"/load","value":25}] (../lib/sbi/nghttp2-server.c:1314) [32m09/01 09:32:04.205[0m: [[33mnrf[0m] [1;37mDEBUG[0m: nrf_state_operational(): OGS_EVENT_NAME_SBI_SERVER (../src/nrf/nrf-sm.c:54) [32m09/01 09:32:04.205[0m: [[33mnrf[0m] [1;37mDEBUG[0m: nrf_nf_state_registered(): OGS_EVENT_NAME_SBI_SERVER (../src/nrf/nf-sm.c:201) [32m09/01 09:32:04.205[0m: [[33msbi[0m] [1;37mDEBUG[0m: STATUS [204] (../lib/sbi/nghttp2-server.c:702) [32m09/01 09:32:04.205[0m: [[33msbi[0m] [1;37mDEBUG[0m: STREAM closed [481] (../lib/sbi/nghttp2-server.c:1431) [32m09/01 09:32:04.205[0m: [[33msbi[0m] [1;37mDEBUG[0m: [204:PATCH]
http://127.0.0.10:7777/nnrf-nfm/v1/nf-instances/b072814e-a5e7-41f1-bd0d-674…
(../lib/sbi/client.c:744) [32m09/01 09:32:04.205[0m: [[33msbi[0m] [1;37mDEBUG[0m: RECEIVED[0] (../lib/sbi/client.c:755) [32m09/01 09:32:04.205[0m: [[33msbi[0m] [1;37mDEBUG[0m: STATUS [204] (../lib/sbi/nghttp2-server.c:702) [32m09/01 09:32:04.205[0m: [[33msbi[0m] [1;37mDEBUG[0m: STREAM closed [3167] (../lib/sbi/nghttp2-server.c:1431) 0000: 00001a01 05000001 e189f661 96df697e ...........a..i~ 0010: 940054dc 5ad41004 e2807ee3 22b80694 ..T.Z.....~."... 0020: c5a37f ... 0000: 00001a01 0500000c 5f89f161 96df697e ........_..a..i~ 0010: 940054dc 5ad41004 e2807ee3 22b80694 ..T.Z.....~."... 0020: c5a37f ... [32m09/01 09:32:04.205[0m: [[33msbi[0m] [1;37mDEBUG[0m: [204:PATCH]
http://127.0.0.200:7777/nnrf-nfm/v1/nf-instances/b072814e-a5e7-41f1-bd0d-67…
(../lib/sbi/client.c:744) [32m09/01 09:32:04.205[0m: [[33msbi[0m] [1;37mDEBUG[0m: RECEIVED[0] (../lib/sbi/client.c:755) [32m09/01 09:32:04.205[0m: [[33mausf[0m] [1;37mDEBUG[0m: ausf_state_operational(): OGS_EVENT_NAME_SBI_CLIENT (../src/ausf/ausf-sm.c:56) [32m09/01 09:32:04.205[0m: [[33msbi[0m] [1;37mDEBUG[0m: ogs_sbi_nf_state_registered(): OGS_EVENT_NAME_SBI_CLIENT (../lib/sbi/nf-sm.c:312) [32m09/01 09:32:04.600[0m: [[33mudm[0m] [1;37mDEBUG[0m: udm_state_operational(): OGS_EVENT_NAME_SBI_TIMER (../src/udm/udm-sm.c:61) [32m09/01 09:32:04.600[0m: [[33msbi[0m] [1;37mDEBUG[0m: ogs_sbi_nf_state_registered(): OGS_EVENT_NAME_SBI_TIMER (../lib/sbi/nf-sm.c:312) [32m09/01 09:32:04.600[0m: [[33msbi[0m] [1;37mDEBUG[0m: [PATCH]
http://127.0.0.200:7777/nnrf-nfm/v1/nf-instances/b0af6d98-a5e7-41f1-ba58-35…
(../lib/sbi/client.c:797) [32m09/01 09:32:04.600[0m: [[33msbi[0m] [1;37mDEBUG[0m: SENDING...[101] (../lib/sbi/client.c:546) [32m09/01 09:32:04.600[0m: [[33msbi[0m] [1;37mDEBUG[0m: [{"op":"replace","path":"/nfStatus","value":"REGISTERED"},{"op":"replace","path":"/load","value":25}] (../lib/sbi/client.c:548) [32m09/01 09:32:04.601[0m: [[33msbi[0m] [1;37mDEBUG[0m: STREAM added [8375] (../lib/sbi/nghttp2-server.c:1749) [32m09/01 09:32:04.601[0m: [[33msbi[0m] [1;37mDEBUG[0m: [PATCH] /nnrf-nfm/v1/nf-instances/b0af6d98-a5e7-41f1-ba58-35f5f329bbb7 (../lib/sbi/nghttp2-server.c:1308) [32m09/01 09:32:04.601[0m: [[33msbi[0m] [1;37mDEBUG[0m: RECEIVED: 101 (../lib/sbi/nghttp2-server.c:1312) [32m09/01 09:32:04.601[0m: [[33msbi[0m] [1;37mDEBUG[0m: [{"op":"replace","path":"/nfStatus","value":"REGISTERED"},{"op":"replace","path":"/load","value":25}] (../lib/sbi/nghttp2-server.c:1314) [32m09/01 09:32:04.601[0m: [[33msbi[0m] [1;37mDEBUG[0m: [PATCH]
http://127.0.0.10:7777/nnrf-nfm/v1/nf-instances/b0af6d98-a5e7-41f1-ba58-35f…
(../lib/sbi/client.c:797) [32m09/01 09:32:04.601[0m: [[33msbi[0m] [1;37mDEBUG[0m: SENDING...[101] (../lib/sbi/client.c:546) [32m09/01 09:32:04.601[0m: [[33msbi[0m] [1;37mDEBUG[0m: [{"op":"replace","path":"/nfStatus","value":"REGISTERED"},{"op":"replace","path":"/load","value":25}] (../lib/sbi/client.c:548) 0000: 00000408 00000000 00000080 47 ............G [32m09/01 09:32:04.601[0m: [[33msbi[0m] [1;37mDEBUG[0m: STREAM added [483] (../lib/sbi/nghttp2-server.c:1749) [32m09/01 09:32:04.601[0m: [[33msbi[0m] [1;37mDEBUG[0m: [PATCH] /nnrf-nfm/v1/nf-instances/b0af6d98-a5e7-41f1-ba58-35f5f329bbb7 (../lib/sbi/nghttp2-server.c:1308) [32m09/01 09:32:04.601[0m: [[33msbi[0m] [1;37mDEBUG[0m: RECEIVED: 101 (../lib/sbi/nghttp2-server.c:1312) [32m09/01 09:32:04.601[0m: [[33msbi[0m] [1;37mDEBUG[0m: [{"op":"replace","path":"/nfStatus","value":"REGISTERED"},{"op":"replace","path":"/load","value":25}] (../lib/sbi/nghttp2-server.c:1314) [32m09/01 09:32:04.601[0m: [[33mnrf[0m] [1;37mDEBUG[0m: nrf_state_operational(): OGS_EVENT_NAME_SBI_SERVER (../src/nrf/nrf-sm.c:54) [32m09/01 09:32:04.601[0m: [[33mnrf[0m] [1;37mDEBUG[0m: nrf_nf_state_registered(): OGS_EVENT_NAME_SBI_SERVER (../src/nrf/nf-sm.c:201) [32m09/01 09:32:04.601[0m: [[33msbi[0m] [1;37mDEBUG[0m: STATUS [204] (../lib/sbi/nghttp2-server.c:702) [32m09/01 09:32:04.601[0m: [[33msbi[0m] [1;37mDEBUG[0m: STREAM closed [483] (../lib/sbi/nghttp2-server.c:1431) 0000: 00000301 05000001 e389f7be ............ [32m09/01 09:32:04.601[0m: [[33msbi[0m] [1;37mDEBUG[0m: [204:PATCH]
http://127.0.0.10:7777/nnrf-nfm/v1/nf-instances/b0af6d98-a5e7-41f1-ba58-35f…
(../lib/sbi/client.c:744) [32m09/01 09:32:04.601[0m: [[33msbi[0m] [1;37mDEBUG[0m: RECEIVED[0] (../lib/sbi/client.c:755) [32m09/01 09:32:04.601[0m: [[33msbi[0m] [1;37mDEBUG[0m: STATUS [204] (../lib/sbi/nghttp2-server.c:702) [32m09/01 09:32:04.601[0m: [[33msbi[0m] [1;37mDEBUG[0m: STREAM closed [8375] (../lib/sbi/nghttp2-server.c:1431) 0000: 00001a01 05000020 b789f261 96df697e ....... ...a..i~ 0010: 940054dc 5ad41004 e2807ee3 22b80694 ..T.Z.....~."... 0020: c5a37f ... [32m09/01 09:32:04.601[0m: [[33msbi[0m] [1;37mDEBUG[0m: [204:PATCH]
http://127.0.0.200:7777/nnrf-nfm/v1/nf-instances/b0af6d98-a5e7-41f1-ba58-35…
(../lib/sbi/client.c:744) [32m09/01 09:32:04.601[0m: [[33msbi[0m] [1;37mDEBUG[0m: RECEIVED[0] (../lib/sbi/client.c:755) [32m09/01 09:32:04.601[0m: [[33mudm[0m] [1;37mDEBUG[0m: udm_state_operational(): OGS_EVENT_NAME_SBI_CLIENT (../src/udm/udm-sm.c:61) [32m09/01 09:32:04.601[0m: [[33msbi[0m] [1;37mDEBUG[0m: ogs_sbi_nf_state_registered(): OGS_EVENT_NAME_SBI_CLIENT (../lib/sbi/nf-sm.c:312) [32m09/01 09:32:04.736[0m: [[33mudr[0m] [1;37mDEBUG[0m: udr_state_operational(): OGS_EVENT_NAME_SBI_TIMER (../src/udr/udr-sm.c:53) [32m09/01 09:32:04.736[0m: [[33msbi[0m] [1;37mDEBUG[0m: ogs_sbi_nf_state_registered(): OGS_EVENT_NAME_SBI_TIMER (../lib/sbi/nf-sm.c:312) [32m09/01 09:32:04.736[0m: [[33msbi[0m] [1;37mDEBUG[0m: [PATCH]
http://127.0.0.200:7777/nnrf-nfm/v1/nf-instances/b0c27bcc-a5e7-41f1-9b8f-b5…
(../lib/sbi/client.c:797) [32m09/01 09:32:04.736[0m: [[33msbi[0m] [1;37mDEBUG[0m: SENDING...[100] (../lib/sbi/client.c:546) [32m09/01 09:32:04.736[0m: [[33msbi[0m] [1;37mDEBUG[0m: [{"op":"replace","path":"/nfStatus","value":"REGISTERED"},{"op":"replace","path":"/load","value":0}] (../lib/sbi/client.c:548) [32m09/01 09:32:04.737[0m: [[33msbi[0m] [1;37mDEBUG[0m: STREAM added [49] (../lib/sbi/nghttp2-server.c:1749) [32m09/01 09:32:04.737[0m: [[33msbi[0m] [1;37mDEBUG[0m: [PATCH] /nnrf-nfm/v1/nf-instances/b0c27bcc-a5e7-41f1-9b8f-b5bfa7b8cf7f (../lib/sbi/nghttp2-server.c:1308) [32m09/01 09:32:04.737[0m: [[33msbi[0m] [1;37mDEBUG[0m: RECEIVED: 100 (../lib/sbi/nghttp2-server.c:1312) [32m09/01 09:32:04.737[0m: [[33msbi[0m] [1;37mDEBUG[0m: [{"op":"replace","path":"/nfStatus","value":"REGISTERED"},{"op":"replace","path":"/load","value":0}] (../lib/sbi/nghttp2-server.c:1314) [32m09/01 09:32:04.737[0m: [[33msbi[0m] [1;37mDEBUG[0m: [PATCH]
http://127.0.0.10:7777/nnrf-nfm/v1/nf-instances/b0c27bcc-a5e7-41f1-9b8f-b5b…
(../lib/sbi/client.c:797) [32m09/01 09:32:04.737[0m: [[33msbi[0m] [1;37mDEBUG[0m: SENDING...[100] (../lib/sbi/client.c:546) [32m09/01 09:32:04.737[0m: [[33msbi[0m] [1;37mDEBUG[0m: [{"op":"replace","path":"/nfStatus","value":"REGISTERED"},{"op":"replace","path":"/load","value":0}] (../lib/sbi/client.c:548) [32m09/01 09:32:04.737[0m: [[33msbi[0m] [1;37mDEBUG[0m: STREAM added [485] (../lib/sbi/nghttp2-server.c:1749) [32m09/01 09:32:04.737[0m: [[33msbi[0m] [1;37mDEBUG[0m: [PATCH] /nnrf-nfm/v1/nf-instances/b0c27bcc-a5e7-41f1-9b8f-b5bfa7b8cf7f (../lib/sbi/nghttp2-server.c:1308) [32m09/01 09:32:04.737[0m: [[33msbi[0m] [1;37mDEBUG[0m: RECEIVED: 100 (../lib/sbi/nghttp2-server.c:1312) [32m09/01 09:32:04.737[0m: [[33msbi[0m] [1;37mDEBUG[0m: [{"op":"replace","path":"/nfStatus","value":"REGISTERED"},{"op":"replace","path":"/load","value":0}] (../lib/sbi/nghttp2-server.c:1314) [32m09/01 09:32:04.737[0m: [[33mnrf[0m] [1;37mDEBUG[0m: nrf_state_operational(): OGS_EVENT_NAME_SBI_SERVER (../src/nrf/nrf-sm.c:54) [32m09/01 09:32:04.737[0m: [[33mnrf[0m] [1;37mDEBUG[0m: nrf_nf_state_registered(): OGS_EVENT_NAME_SBI_SERVER (../src/nrf/nf-sm.c:201) [32m09/01 09:32:04.737[0m: [[33msbi[0m] [1;37mDEBUG[0m: STATUS [204] (../lib/sbi/nghttp2-server.c:702) [32m09/01 09:32:04.737[0m: [[33msbi[0m] [1;37mDEBUG[0m: STREAM closed [485] (../lib/sbi/nghttp2-server.c:1431) [32m09/01 09:32:04.737[0m: [[33msbi[0m] [1;37mDEBUG[0m: [204:PATCH]
http://127.0.0.10:7777/nnrf-nfm/v1/nf-instances/b0c27bcc-a5e7-41f1-9b8f-b5b…
(../lib/sbi/client.c:744) [32m09/01 09:32:04.737[0m: [[33msbi[0m] [1;37mDEBUG[0m: RECEIVED[0] (../lib/sbi/client.c:755) [32m09/01 09:32:04.737[0m: [[33msbi[0m] [1;37mDEBUG[0m: STATUS [204] (../lib/sbi/nghttp2-server.c:702) [32m09/01 09:32:04.737[0m: [[33msbi[0m] [1;37mDEBUG[0m: STREAM closed [49] (../lib/sbi/nghttp2-server.c:1431) 0000: 00001a01 05000000 3189cd61 96df697e ........1..a..i~ 0010: 940054dc 5ad41004 e2807ee3 22b80694 ..T.Z.....~."... 0020: c5a37f ... [32m09/01 09:32:04.737[0m: [[33msbi[0m] [1;37mDEBUG[0m: [204:PATCH]
http://127.0.0.200:7777/nnrf-nfm/v1/nf-instances/b0c27bcc-a5e7-41f1-9b8f-b5…
(../lib/sbi/client.c:744) [32m09/01 09:32:04.737[0m: [[33msbi[0m] [1;37mDEBUG[0m: RECEIVED[0] (../lib/sbi/client.c:755) 0000: 00000301 05000001 e589f7be ............ [32m09/01 09:32:04.737[0m: [[33mudr[0m] [1;37mDEBUG[0m: udr_state_operational(): OGS_EVENT_NAME_SBI_CLIENT (../src/udr/udr-sm.c:53) [32m09/01 09:32:04.737[0m: [[33msbi[0m] [1;37mDEBUG[0m: ogs_sbi_nf_state_registered(): OGS_EVENT_NAME_SBI_CLIENT (../lib/sbi/nf-sm.c:312) [32m09/01 09:32:04.804[0m: [[33mpcf[0m] [1;37mDEBUG[0m: pcf_state_operational(): OGS_EVENT_NAME_SBI_TIMER (../src/pcf/pcf-sm.c:64) [32m09/01 09:32:04.804[0m: [[33msbi[0m] [1;37mDEBUG[0m: ogs_sbi_nf_state_registered(): OGS_EVENT_NAME_SBI_TIMER (../lib/sbi/nf-sm.c:312) [32m09/01 09:32:04.804[0m: [[33msbi[0m] [1;37mDEBUG[0m: [PATCH]
http://127.0.0.200:7777/nnrf-nfm/v1/nf-instances/b0ccb1f0-a5e7-41f1-ba0e-f9…
(../lib/sbi/client.c:797) [32m09/01 09:32:04.804[0m: [[33msbi[0m] [1;37mDEBUG[0m: SENDING...[101] (../lib/sbi/client.c:546) [32m09/01 09:32:04.804[0m: [[33msbi[0m] [1;37mDEBUG[0m: [{"op":"replace","path":"/nfStatus","value":"REGISTERED"},{"op":"replace","path":"/load","value":25}] (../lib/sbi/client.c:548) [32m09/01 09:32:04.805[0m: [[33msbi[0m] [1;37mDEBUG[0m: STREAM added [3693] (../lib/sbi/nghttp2-server.c:1749) [32m09/01 09:32:04.805[0m: [[33msbi[0m] [1;37mDEBUG[0m: [PATCH] /nnrf-nfm/v1/nf-instances/b0ccb1f0-a5e7-41f1-ba0e-f9252260cf4e (../lib/sbi/nghttp2-server.c:1308) [32m09/01 09:32:04.805[0m: [[33msbi[0m] [1;37mDEBUG[0m: RECEIVED: 101 (../lib/sbi/nghttp2-server.c:1312) [32m09/01 09:32:04.805[0m: [[33msbi[0m] [1;37mDEBUG[0m: [{"op":"replace","path":"/nfStatus","value":"REGISTERED"},{"op":"replace","path":"/load","value":25}] (../lib/sbi/nghttp2-server.c:1314) [32m09/01 09:32:04.805[0m: [[33msbi[0m] [1;37mDEBUG[0m: [PATCH]
http://127.0.0.10:7777/nnrf-nfm/v1/nf-instances/b0ccb1f0-a5e7-41f1-ba0e-f92…
(../lib/sbi/client.c:797) [32m09/01 09:32:04.805[0m: [[33msbi[0m] [1;37mDEBUG[0m: SENDING...[101] (../lib/sbi/client.c:546) [32m09/01 09:32:04.805[0m: [[33msbi[0m] [1;37mDEBUG[0m: [{"op":"replace","path":"/nfStatus","value":"REGISTERED"},{"op":"replace","path":"/load","value":25}] (../lib/sbi/client.c:548) [32m09/01 09:32:04.805[0m: [[33msbi[0m] [1;37mDEBUG[0m: STREAM added [487] (../lib/sbi/nghttp2-server.c:1749) [32m09/01 09:32:04.805[0m: [[33msbi[0m] [1;37mDEBUG[0m: [PATCH] /nnrf-nfm/v1/nf-instances/b0ccb1f0-a5e7-41f1-ba0e-f9252260cf4e (../lib/sbi/nghttp2-server.c:1308) [32m09/01 09:32:04.805[0m: [[33msbi[0m] [1;37mDEBUG[0m: RECEIVED: 101 (../lib/sbi/nghttp2-server.c:1312) [32m09/01 09:32:04.805[0m: [[33msbi[0m] [1;37mDEBUG[0m: [{"op":"replace","path":"/nfStatus","value":"REGISTERED"},{"op":"replace","path":"/load","value":25}] (../lib/sbi/nghttp2-server.c:1314) [32m09/01 09:32:04.805[0m: [[33mnrf[0m] [1;37mDEBUG[0m: nrf_state_operational(): OGS_EVENT_NAME_SBI_SERVER (../src/nrf/nrf-sm.c:54) [32m09/01 09:32:04.805[0m: [[33mnrf[0m] [1;37mDEBUG[0m: nrf_nf_state_registered(): OGS_EVENT_NAME_SBI_SERVER (../src/nrf/nf-sm.c:201) [32m09/01 09:32:04.805[0m: [[33msbi[0m] [1;37mDEBUG[0m: STATUS [204] (../lib/sbi/nghttp2-server.c:702) [32m09/01 09:32:04.805[0m: [[33msbi[0m] [1;37mDEBUG[0m: STREAM closed [487] (../lib/sbi/nghttp2-server.c:1431) [32m09/01 09:32:04.805[0m: [[33msbi[0m] [1;37mDEBUG[0m: [204:PATCH]
http://127.0.0.10:7777/nnrf-nfm/v1/nf-instances/b0ccb1f0-a5e7-41f1-ba0e-f92…
(../lib/sbi/client.c:744) [32m09/01 09:32:04.805[0m: [[33msbi[0m] [1;37mDEBUG[0m: RECEIVED[0] (../lib/sbi/client.c:755) [32m09/01 09:32:04.805[0m: [[33msbi[0m] [1;37mDEBUG[0m: STATUS [204] (../lib/sbi/nghttp2-server.c:702) [32m09/01 09:32:04.805[0m: [[33msbi[0m] [1;37mDEBUG[0m: STREAM closed [3693] (../lib/sbi/nghttp2-server.c:1431) 0000: 00000301 05000001 e789f7be ............ 0000: 00001a01 0500000e 6d89eb61 96df697e ........m..a..i~ 0010: 940054dc 5ad41004 e2807ee3 22b80694 ..T.Z.....~."... 0020: c5a37f ... [32m09/01 09:32:04.805[0m: [[33msbi[0m] [1;37mDEBUG[0m: [204:PATCH]
http://127.0.0.200:7777/nnrf-nfm/v1/nf-instances/b0ccb1f0-a5e7-41f1-ba0e-f9…
(../lib/sbi/client.c:744) [32m09/01 09:32:04.805[0m: [[33msbi[0m] [1;37mDEBUG[0m: RECEIVED[0] (../lib/sbi/client.c:755) [32m09/01 09:32:04.805[0m: [[33mpcf[0m] [1;37mDEBUG[0m: pcf_state_operational(): OGS_EVENT_NAME_SBI_CLIENT (../src/pcf/pcf-sm.c:64) [32m09/01 09:32:04.805[0m: [[33msbi[0m] [1;37mDEBUG[0m: ogs_sbi_nf_state_registered(): OGS_EVENT_NAME_SBI_CLIENT (../lib/sbi/nf-sm.c:312) Waiting for packet dumper to finish... 1 (prev_count=2972, count=10604) [32m09/01 09:32:05.146[0m: [[33mamf[0m] [1;37mDEBUG[0m: amf_state_operational(): OGS_EVENT_NAME_SBI_TIMER (../src/amf/amf-sm.c:84) [32m09/01 09:32:05.146[0m: [[33msbi[0m] [1;37mDEBUG[0m: ogs_sbi_nf_state_registered(): OGS_EVENT_NAME_SBI_TIMER (../lib/sbi/nf-sm.c:312) [32m09/01 09:32:05.146[0m: [[33msbi[0m] [1;37mDEBUG[0m: [PATCH]
http://127.0.0.200:7777/nnrf-nfm/v1/nf-instances/b106162a-a5e7-41f1-9c4f-9b…
(../lib/sbi/client.c:797) [32m09/01 09:32:05.147[0m: [[33msbi[0m] [1;37mDEBUG[0m: SENDING...[100] (../lib/sbi/client.c:546) [32m09/01 09:32:05.147[0m: [[33msbi[0m] [1;37mDEBUG[0m: [{"op":"replace","path":"/nfStatus","value":"REGISTERED"},{"op":"replace","path":"/load","value":0}] (../lib/sbi/client.c:548) [32m09/01 09:32:05.147[0m: [[33msbi[0m] [1;37mDEBUG[0m: STREAM added [14119] (../lib/sbi/nghttp2-server.c:1749) [32m09/01 09:32:05.147[0m: [[33msbi[0m] [1;37mDEBUG[0m: [PATCH] /nnrf-nfm/v1/nf-instances/b106162a-a5e7-41f1-9c4f-9bb961d38ac8 (../lib/sbi/nghttp2-server.c:1308) [32m09/01 09:32:05.147[0m: [[33msbi[0m] [1;37mDEBUG[0m: RECEIVED: 100 (../lib/sbi/nghttp2-server.c:1312) [32m09/01 09:32:05.147[0m: [[33msbi[0m] [1;37mDEBUG[0m: [{"op":"replace","path":"/nfStatus","value":"REGISTERED"},{"op":"replace","path":"/load","value":0}] (../lib/sbi/nghttp2-server.c:1314) [32m09/01 09:32:05.147[0m: [[33msbi[0m] [1;37mDEBUG[0m: [PATCH]
http://127.0.0.10:7777/nnrf-nfm/v1/nf-instances/b106162a-a5e7-41f1-9c4f-9bb…
(../lib/sbi/client.c:797) [32m09/01 09:32:05.147[0m: [[33msbi[0m] [1;37mDEBUG[0m: SENDING...[100] (../lib/sbi/client.c:546) [32m09/01 09:32:05.147[0m: [[33msbi[0m] [1;37mDEBUG[0m: [{"op":"replace","path":"/nfStatus","value":"REGISTERED"},{"op":"replace","path":"/load","value":0}] (../lib/sbi/client.c:548) [32m09/01 09:32:05.147[0m: [[33msbi[0m] [1;37mDEBUG[0m: STREAM added [489] (../lib/sbi/nghttp2-server.c:1749) [32m09/01 09:32:05.147[0m: [[33msbi[0m] [1;37mDEBUG[0m: [PATCH] /nnrf-nfm/v1/nf-instances/b106162a-a5e7-41f1-9c4f-9bb961d38ac8 (../lib/sbi/nghttp2-server.c:1308) [32m09/01 09:32:05.147[0m: [[33msbi[0m] [1;37mDEBUG[0m: RECEIVED: 100 (../lib/sbi/nghttp2-server.c:1312) [32m09/01 09:32:05.147[0m: [[33msbi[0m] [1;37mDEBUG[0m: [{"op":"replace","path":"/nfStatus","value":"REGISTERED"},{"op":"replace","path":"/load","value":0}] (../lib/sbi/nghttp2-server.c:1314) [32m09/01 09:32:05.147[0m: [[33mnrf[0m] [1;37mDEBUG[0m: nrf_state_operational(): OGS_EVENT_NAME_SBI_SERVER (../src/nrf/nrf-sm.c:54) [32m09/01 09:32:05.147[0m: [[33mnrf[0m] [1;37mDEBUG[0m: nrf_nf_state_registered(): OGS_EVENT_NAME_SBI_SERVER (../src/nrf/nf-sm.c:201) [32m09/01 09:32:05.147[0m: [[33msbi[0m] [1;37mDEBUG[0m: STATUS [204] (../lib/sbi/nghttp2-server.c:702) [32m09/01 09:32:05.147[0m: [[33msbi[0m] [1;37mDEBUG[0m: STREAM closed [489] (../lib/sbi/nghttp2-server.c:1431) 0000: 00001a01 05000001 e989f761 96df697e ...........a..i~ 0010: 940054dc 5ad41004 e2807ee3 22b806d4 ..T.Z.....~."... 0020: c5a37f ... [32m09/01 09:32:05.147[0m: [[33msbi[0m] [1;37mDEBUG[0m: [204:PATCH]
http://127.0.0.10:7777/nnrf-nfm/v1/nf-instances/b106162a-a5e7-41f1-9c4f-9bb…
(../lib/sbi/client.c:744) [32m09/01 09:32:05.147[0m: [[33msbi[0m] [1;37mDEBUG[0m: RECEIVED[0] (../lib/sbi/client.c:755) [32m09/01 09:32:05.147[0m: [[33msbi[0m] [1;37mDEBUG[0m: STATUS [204] (../lib/sbi/nghttp2-server.c:702) [32m09/01 09:32:05.147[0m: [[33msbi[0m] [1;37mDEBUG[0m: STREAM closed [14119] (../lib/sbi/nghttp2-server.c:1431) [32m09/01 09:32:05.147[0m: [[33msbi[0m] [1;37mDEBUG[0m: [204:PATCH]
http://127.0.0.200:7777/nnrf-nfm/v1/nf-instances/b106162a-a5e7-41f1-9c4f-9b…
(../lib/sbi/client.c:744) [32m09/01 09:32:05.147[0m: [[33msbi[0m] [1;37mDEBUG[0m: RECEIVED[0] (../lib/sbi/client.c:755) [32m09/01 09:32:05.147[0m: [[33mamf[0m] [1;37mDEBUG[0m: amf_state_operational(): OGS_EVENT_NAME_SBI_CLIENT (../src/amf/amf-sm.c:84) [32m09/01 09:32:05.147[0m: [[33msbi[0m] [1;37mDEBUG[0m: ogs_sbi_nf_state_registered(): OGS_EVENT_NAME_SBI_CLIENT (../lib/sbi/nf-sm.c:312) 0000: 00001a01 05000037 2789d361 96df697e .......7'..a..i~ 0010: 940054dc 5ad41004 e2807ee3 22b806d4 ..T.Z.....~."... 0020: c5a37f ... MTC@afc778007346: External command `<
https://jenkins.osmocom.org/jenkins/job/ttcn3-5gc-test-ogs/ws/ttcn3-tcpdump…
> C5G_Tests.TC_connection_inactive error' was executed successfully (exit status: 0). MTC@afc778007346: Starting external command `<
https://jenkins.osmocom.org/jenkins/job/ttcn3-5gc-test-ogs/ws/ttcn3-tcpdump…
> C5G_Tests.TC_connection_suspend'. ------ C5G_Tests.TC_connection_suspend ------ (09:32:05) load average: 13.03, 15.00, 14.12 /usr/bin/dumpcap -q -s 1520 -n -i any -w "<
https://jenkins.osmocom.org/jenkins/job/ttcn3-5gc-test-ogs/466/artifact/log…
"> ><
https://jenkins.osmocom.org/jenkins/job/ttcn3-5gc-test-ogs/466/artifact/log…
> 2>/tmp/cmderr & Waiting for packet dumper to start... 0 [1;34m[testenv] Stopping podman container[0m [0;94m[testenv] + ['podman', 'kill', 'testenv-5gc-osmocom-nightly-20260901-0929-1aca1af2-1'][0m testenv-5gc-osmocom-nightly-20260901-0929-1aca1af2-1 [0;94m[testenv] Skipping clean up scripts, podman container has already stopped[0m [1;34m[testenv] Stopping testsuite (3306357)[0m Error: container has already been removed [0;94m[testenv] feed_watchdog_loop: podman container has stopped[0m [1;34m[testenv] Logs saved to:
https://jenkins.osmocom.org/jenkins/job/ttcn3-5gc-test-ogs/466/artifact/log…
[0m + RC=1 + [ 1 = 0 ] + uptime + grep --color=always -o load.* [01;31m[Kload average: 13.03, 15.00, 14.12[m[K + exit 1 Build step 'Execute shell' marked build as failure Recording test results [Checks API] No suitable checks publisher found.
1
1
0
0
Build failed in Jenkins: ttcn3-bts-test #3251
by jenkins@lists.osmocom.org
02 Sep '26
02 Sep '26
See <
https://jenkins.osmocom.org/jenkins/job/ttcn3-bts-test/3251/display/redirect
> Changes: ------------------------------------------ [...truncated 12.59 MiB...] <testcase classname='BTS_Tests:hopping' name='TC_encr_cmd_a53' time='5.248443'/> <testcase classname='BTS_Tests:hopping' name='TC_encr_cmd_a54' time='5.215018'/> <testcase classname='BTS_Tests:hopping' name='TC_err_rep_wrong_mdisc' time='1.262493'/> <testcase classname='BTS_Tests:hopping' name='TC_err_rep_wrong_msg_type' time='1.304273'/> <testcase classname='BTS_Tests:hopping' name='TC_err_rep_wrong_sequence' time='1.255245'/> <testcase classname='BTS_Tests:hopping' name='TC_lapdm_selftest' time='0.024997'/> <testcase classname='BTS_Tests:hopping' name='TC_tch_sign_l2_fill_frame' time='18.422836'/> <testcase classname='BTS_Tests:hopping' name='TC_tch_sign_l2_fill_frame_dtxd' time='2.113120'> <failure type='fail-verdict'>Received DTX TCH fill frame with bad frame number: 175 (mod 104: 71) (mod 26: 19) BTS_Tests.ttcn:9579 BTS_Tests control part BTS_Tests.ttcn:8110 TC_tch_sign_l2_fill_frame_dtxd testcase </failure> </testcase> <testcase classname='BTS_Tests:hopping' name='TC_chopped_ipa_ping' time='24.670781'/> <testcase classname='BTS_Tests:hopping' name='TC_chopped_ipa_payload' time='42.641504'/> <testcase classname='BTS_Tests:hopping' name='TC_ms_pwr_ctrl_constant' time='16.899717'/> <testcase classname='BTS_Tests:hopping' name='TC_ms_pwr_ctrl_pf_ewma' time='32.018857'/> <testcase classname='BTS_Tests:hopping' name='TC_speech_no_rtp_tchf' time='7.409516'/> <testcase classname='BTS_Tests:hopping' name='TC_speech_no_rtp_tchh' time='5.454537'/> <testcase classname='BTS_Tests:hopping' name='TC_speech_rtp_tchf' time='7.697389'/> <testcase classname='BTS_Tests:hopping' name='TC_speech_rtp_tchh' time='5.445739'/> <testcase classname='BTS_Tests:hopping' name='TC_speech_osmux_tchf' time='3.408122'/> <testcase classname='BTS_Tests:hopping' name='TC_speech_osmux_tchh' time='3.477612'/> <testcase classname='BTS_Tests:hopping' name='TC_data_rtp_tchf144' time='2.134531'/> <testcase classname='BTS_Tests:hopping' name='TC_data_rtp_tchf96' time='2.185590'/> <testcase classname='BTS_Tests:hopping' name='TC_data_rtp_tchf48' time='2.204777'/> <testcase classname='BTS_Tests:hopping' name='TC_data_rtp_tchh48' time='5.303111'> <failure type='fail-verdict'>Timeout waiting for matching Downlink data frame BTS_Tests.ttcn:9597 BTS_Tests control part BTS_Tests.ttcn:8880 TC_data_rtp_tchh48 testcase </failure> </testcase> <testcase classname='BTS_Tests:hopping' name='TC_data_rtp_tchf24' time='1.804613'/> <testcase classname='BTS_Tests:hopping' name='TC_data_rtp_tchh24' time='5.366020'> <failure type='fail-verdict'>Timeout waiting for matching Downlink data frame BTS_Tests.ttcn:9599 BTS_Tests control part BTS_Tests.ttcn:8949 TC_data_rtp_tchh24 testcase </failure> </testcase> <testcase classname='BTS_Tests:hopping' name='TC_data_facch_tchf144' time='2.012054'/> <testcase classname='BTS_Tests:hopping' name='TC_data_facch_tchf96' time='2.071947'/> <testcase classname='BTS_Tests:hopping' name='TC_data_facch_tchf48' time='2.068500'/> <testcase classname='BTS_Tests:hopping' name='TC_data_facch_tchh48' time='2.152065'/> <testcase classname='BTS_Tests:hopping' name='TC_data_facch_tchf24' time='2.076654'/> <testcase classname='BTS_Tests:hopping' name='TC_data_facch_tchh24' time='2.149297'/> <testcase classname='BTS_Tests:hopping' name='TC_early_immediate_assignment' time='3.560438'/> <testcase classname='BTS_Tests:hopping' name='TC_acch_overpower_rxqual_thresh' time='9.097401'> <failure type='fail-verdict'>Timeout waiting for L1CTL DATA.ind BTS_Tests.ttcn:9610 BTS_Tests control part BTS_Tests.ttcn:9244 TC_acch_overpower_rxqual_thresh testcase </failure> </testcase> <testcase classname='BTS_Tests:hopping' name='TC_acch_overpower_rxqual_thresh_dtx' time='9.017040'> <failure type='fail-verdict'>Timeout waiting for L1CTL DATA.ind BTS_Tests.ttcn:9611 BTS_Tests control part BTS_Tests.ttcn:9285 TC_acch_overpower_rxqual_thresh_dtx testcase </failure> </testcase> <testcase classname='BTS_Tests:hopping' name='TC_acch_overpower_always_on_facch' time='9.020763'> <failure type='fail-verdict'>Timeout waiting for L1CTL DATA.ind BTS_Tests.ttcn:9612 BTS_Tests control part BTS_Tests.ttcn:9317 TC_acch_overpower_always_on_facch testcase </failure> </testcase> <testcase classname='BTS_Tests:hopping' name='TC_acch_overpower_always_on_sacch' time='9.035725'> <failure type='fail-verdict'>Timeout waiting for L1CTL DATA.ind BTS_Tests.ttcn:9613 BTS_Tests control part BTS_Tests.ttcn:9349 TC_acch_overpower_always_on_sacch testcase </failure> </testcase> <testcase classname='BTS_Tests:hopping' name='TC_acch_overpower_limit' time='9.035970'> <failure type='fail-verdict'>Timeout waiting for L1CTL DATA.ind BTS_Tests.ttcn:9614 BTS_Tests control part BTS_Tests.ttcn:9380 TC_acch_overpower_limit testcase </failure> </testcase> <testcase classname='BTS_Tests_SMSCB:hopping' name='TC_cbch_load_idle_no_cbch' time='11.165713'/> <testcase classname='BTS_Tests_SMSCB:hopping' name='TC_sms_cb_cmd_sdcch4_1block' time='14.339403'/> <testcase classname='BTS_Tests_SMSCB:hopping' name='TC_sms_cb_cmd_sdcch4_2block' time='14.195612'/> <testcase classname='BTS_Tests_SMSCB:hopping' name='TC_sms_cb_cmd_sdcch4_3block' time='17.126408'/> <testcase classname='BTS_Tests_SMSCB:hopping' name='TC_sms_cb_cmd_sdcch4_4block' time='14.178704'/> <testcase classname='BTS_Tests_SMSCB:hopping' name='TC_sms_cb_cmd_sdcch4_multi' time='20.196679'/> <testcase classname='BTS_Tests_SMSCB:hopping' name='TC_sms_cb_cmd_sdcch4_schedule' time='14.152836'/> <testcase classname='BTS_Tests_SMSCB:hopping' name='TC_sms_cb_cmd_sdcch4_default_only' time='16.197759'/> <testcase classname='BTS_Tests_SMSCB:hopping' name='TC_sms_cb_cmd_sdcch4_default_and_normal' time='17.176742'/> <testcase classname='BTS_Tests_SMSCB:hopping' name='TC_sms_cb_cmd_sdcch4_default_then_null' time='26.181629'/> <testcase classname='BTS_Tests_SMSCB:hopping' name='TC_cbc_sdcch4_load_idle' time='16.067670'/> <testcase classname='BTS_Tests_SMSCB:hopping' name='TC_cbc_sdcch4_load_overload' time='18.202573'/> <testcase classname='BTS_Tests_SMSCB:hopping' name='TC_sms_cb_cmd_sdcch8_1block' time='14.243121'/> <testcase classname='BTS_Tests_SMSCB:hopping' name='TC_sms_cb_cmd_sdcch8_2block' time='14.235643'/> <testcase classname='BTS_Tests_SMSCB:hopping' name='TC_sms_cb_cmd_sdcch8_3block' time='14.206421'/> <testcase classname='BTS_Tests_SMSCB:hopping' name='TC_sms_cb_cmd_sdcch8_4block' time='14.229185'/> <testcase classname='BTS_Tests_SMSCB:hopping' name='TC_sms_cb_cmd_sdcch8_multi' time='20.220413'/> <testcase classname='BTS_Tests_SMSCB:hopping' name='TC_sms_cb_cmd_sdcch8_schedule' time='14.180045'/> <testcase classname='BTS_Tests_SMSCB:hopping' name='TC_sms_cb_cmd_sdcch8_default_only' time='16.237690'/> <testcase classname='BTS_Tests_SMSCB:hopping' name='TC_sms_cb_cmd_sdcch8_default_and_normal' time='17.208327'/> <testcase classname='BTS_Tests_SMSCB:hopping' name='TC_cbc_sdcch8_load_idle' time='16.178094'/> <testcase classname='BTS_Tests_SMSCB:hopping' name='TC_cbc_sdcch8_load_overload' time='22.064715'/> <testcase classname='BTS_Tests_SMSCB:hopping' name='TC_etws_p1ro' time='12.181755'/> <testcase classname='BTS_Tests_SMSCB:hopping' name='TC_etws_p1ro_end' time='16.161184'/> <testcase classname='BTS_Tests_SMSCB:hopping' name='TC_etws_pcu' time='1.130586'/> <testcase classname='BTS_Tests_LAPDm:hopping' name='TC_sabm_ua_dcch_sapi0' time='2.899642'/> <testcase classname='BTS_Tests_LAPDm:hopping' name='TC_sabm_ua_dcch_sapi0_nopayload' time='21.505578'/> <testcase classname='BTS_Tests_LAPDm:hopping' name='TC_sabm_ua_dcch_sapi3' time='21.299974'/> <testcase classname='BTS_Tests_LAPDm:hopping' name='TC_sabm_ua_dcch_sapi4' time='24.403252'> <failure type='fail-verdict'>"BTS_Tests.ttcn:792 : Timeout expecting RF CHAN REL" BTS_Tests_LAPDm.ttcn:1477 BTS_Tests_LAPDm control part BTS_Tests_LAPDm.ttcn:167 TC_sabm_ua_dcch_sapi4 testcase </failure> </testcase> <testcase classname='BTS_Tests_LAPDm:hopping' name='TC_sabm_contention' time='14.619136'> <failure type='fail-verdict'>"BTS_Tests.ttcn:792 : Timeout expecting RF CHAN REL" BTS_Tests_LAPDm.ttcn:1478 BTS_Tests_LAPDm control part BTS_Tests_LAPDm.ttcn:201 TC_sabm_contention testcase </failure> </testcase> <testcase classname='BTS_Tests_LAPDm:hopping' name='TC_sabm_retransmit' time='8.037175'/> <testcase classname='BTS_Tests_LAPDm:hopping' name='TC_sabm_retransmit_bts' time='81.690029'/> <testcase classname='BTS_Tests_LAPDm:hopping' name='TC_sabm_invalid_resp' time='23.315167'/> <testcase classname='BTS_Tests_LAPDm:hopping' name='TC_sabm_dm' time='14.007997'/> <testcase classname='BTS_Tests_LAPDm:hopping' name='TC_establish_ign_first_sabm' time='8.262725'/> <testcase classname='BTS_Tests_LAPDm:hopping' name='TC_iframe_seq_and_ack' time='29.614342'> <failure type='fail-verdict'>Received RSL ERROR IND { msg_disc := { msg_group := RSL_MDISC_RLL (1), transparent := false }, msg_type := RSL_MT_ERROR_IND (3), ies := { { iei := RSL_IE_CHAN_NR (1), body := { chan_nr := { u := { sdcch8 := { tag := '01'B, sub_chan := 4 } }, tn := 6 } } }, { iei := RSL_IE_LINK_IDENT (2), body := { link_id := { c := FACCH_SDCCH (0), na := false, prio := SAPI0_PRIO_NORMAL (0), sapi := 0 } } }, { iei := RSL_IE_RLM_CAUSE (22), body := { rlm_cause := { len := 1, payload := '01'O } } } } } BTS_Tests_LAPDm.ttcn:1484 BTS_Tests_LAPDm control part BTS_Tests_LAPDm.ttcn:579 TC_iframe_seq_and_ack testcase </failure> </testcase> <testcase classname='BTS_Tests_LAPDm:hopping' name='TC_iframe_timer_recovery' time='24.604236'> <failure type='fail-verdict'>"BTS_Tests.ttcn:732 : Tguard timeout" BTS_Tests_LAPDm.ttcn:1485 BTS_Tests_LAPDm control part BTS_Tests_LAPDm.ttcn:685 TC_iframe_timer_recovery testcase </failure> </testcase> <testcase classname='BTS_Tests_LAPDm:hopping' name='TC_ns_seq_error' time='29.349357'> <failure type='fail-verdict'>"BTS_Tests.ttcn:732 : Tguard timeout" BTS_Tests_LAPDm.ttcn:1486 BTS_Tests_LAPDm control part BTS_Tests_LAPDm.ttcn:768 TC_ns_seq_error testcase </failure> </testcase> <testcase classname='BTS_Tests_LAPDm:hopping' name='TC_nr_seq_error' time='5.160579'> <failure type='fail-verdict'>Missing DISC from BTS BTS_Tests_LAPDm.ttcn:1487 BTS_Tests_LAPDm control part BTS_Tests_LAPDm.ttcn:831 TC_nr_seq_error testcase </failure> </testcase> <testcase classname='BTS_Tests_LAPDm:hopping' name='TC_rec_invalid_frame' time='107.513700'> <failure type='fail-verdict'>"BTS_Tests_LAPDm.ttcn:883 : Missing LAPDm_RR RSP" BTS_Tests_LAPDm.ttcn:1488 BTS_Tests_LAPDm control part BTS_Tests_LAPDm.ttcn:961 TC_rec_invalid_frame testcase </failure> </testcase> <testcase classname='BTS_Tests_LAPDm:hopping' name='TC_segm_concat_dcch' time='15.980942'> <failure type='fail-verdict'>"BTS_Tests_LAPDm.ttcn:1023 : received unexpected LAPDm { sacch := false, sapi := 0, lapdm := { ab := { addr := { spare := '0'B, lpd := 0, sapi := 0, c_r := false, ea := true }, ctrl := { s := { n_r := 1, p_f := false, s := '10'B, spare := '01'B } }, len := 0, m := false, el := 1, payload := ''O, padding := '2B2B2B2B2B2B2B2B2B2B2B2B2B2B2B2B2B2B2B2B'O (\"++++++++++++++++++++\") } } }" BTS_Tests_LAPDm.ttcn:1489 BTS_Tests_LAPDm control part BTS_Tests_LAPDm.ttcn:1088 TC_segm_concat_dcch testcase </failure> </testcase> <testcase classname='BTS_Tests_LAPDm:hopping' name='TC_segm_concat_sacch' time='48.775645'> <failure type='fail-verdict'>"BTS_Tests_LAPDm.ttcn:1023 : received unexpected LAPDm { sacch := true, sapi := 0, lapdm := { ab := { addr := { spare := '0'B, lpd := 0, sapi := 0, c_r := false, ea := true }, ctrl := { u := { u := '011'B, p_f := true, u2 := '00'B, spare := '11'B } }, len := 0, m := false, el := 1, payload := ''O, padding := '2B2B2B2B2B2B2B2B2B2B2B2B2B2B2B2B2B2B'O (\"++++++++++++++++++\") } } }" BTS_Tests_LAPDm.ttcn:1490 BTS_Tests_LAPDm control part BTS_Tests_LAPDm.ttcn:1093 TC_segm_concat_sacch testcase </failure> </testcase> <testcase classname='BTS_Tests_LAPDm:hopping' name='TC_t200_n200' time='39.811797'> <failure type='fail-verdict'>Missing RSL RLL ERROR INDICATION BTS_Tests_LAPDm.ttcn:1491 BTS_Tests_LAPDm control part BTS_Tests_LAPDm.ttcn:1182 TC_t200_n200 testcase </failure> </testcase> <testcase classname='BTS_Tests_LAPDm:hopping' name='TC_rr_response_frame_loss' time='6.543180'> <failure type='fail-verdict'>Timeout waiting for RR or REJ BTS_Tests_LAPDm.ttcn:1492 BTS_Tests_LAPDm control part BTS_Tests_LAPDm.ttcn:1239 TC_rr_response_frame_loss testcase </failure> </testcase> <testcase classname='BTS_Tests_LAPDm:hopping' name='TC_incorrect_cr' time='15.806831'/> <testcase classname='BTS_Tests_LAPDm:hopping' name='TC_sabm_incorrect_c' time='23.288798'> <failure type='fail-verdict'>"BTS_Tests.ttcn:732 : Tguard timeout" BTS_Tests_LAPDm.ttcn:1494 BTS_Tests_LAPDm control part BTS_Tests_LAPDm.ttcn:1341 TC_sabm_incorrect_c testcase </failure> </testcase> <testcase classname='BTS_Tests_LAPDm:hopping' name='TC_normal_reestablishment' time='16.109111'> <failure type='fail-verdict'>"BTS_Tests_LAPDm.ttcn:1023 : received unexpected LAPDm { sacch := false, sapi := 0, lapdm := { ab := { addr := { spare := '0'B, lpd := 0, sapi := 0, c_r := false, ea := true }, ctrl := { u := { u := '011'B, p_f := true, u2 := '00'B, spare := '11'B } }, len := 5, m := false, el := 1, payload := '4ADDE4415E'O, padding := '2B2B2B2B2B2B2B2B2B2B2B2B2B2B2B'O (\"+++++++++++++++\") } } }" BTS_Tests_LAPDm.ttcn:1495 BTS_Tests_LAPDm control part BTS_Tests_LAPDm.ttcn:1403 TC_normal_reestablishment testcase </failure> </testcase> <testcase classname='BTS_Tests_LAPDm:hopping' name='TC_normal_reestablishment_state_unacked' time='12.348621'> <failure type='fail-verdict'>"BTS_Tests_LAPDm.ttcn:1023 : received unexpected LAPDm { sacch := false, sapi := 0, lapdm := { ab := { addr := { spare := '0'B, lpd := 0, sapi := 0, c_r := false, ea := true }, ctrl := { s := { n_r := 1, p_f := false, s := '10'B, spare := '01'B } }, len := 0, m := false, el := 1, payload := ''O, padding := '2B2B2B2B2B2B2B2B2B2B2B2B2B2B2B2B2B2B2B2B'O (\"++++++++++++++++++++\") } } }" BTS_Tests_LAPDm.ttcn:1496 BTS_Tests_LAPDm control part BTS_Tests_LAPDm.ttcn:1470 TC_normal_reestablishment_state_unacked testcase </failure> </testcase> <testcase classname='BTS_Tests_VAMOS:hopping' name='TC_vamos_chan_act_vff' time='2.381371'/> <testcase classname='BTS_Tests_VAMOS:hopping' name='TC_vamos_chan_act_vhh' time='2.477209'/> <testcase classname='BTS_Tests_VAMOS:hopping' name='TC_vamos_chan_act_hvhh' time='2.586118'/> <testcase classname='BTS_Tests_VAMOS:hopping' name='TC_vamos_chan_act_dyn_ipa_vff' time='2.502918'/> <testcase classname='BTS_Tests_VAMOS:hopping' name='TC_vamos_chan_act_dyn_osmo_vff' time='2.539554'/> <testcase classname='BTS_Tests_VAMOS:hopping' name='TC_vamos_chan_act_dyn_osmo_vhh' time='2.613048'/> <testcase classname='BTS_Tests_VAMOS:hopping' name='TC_vamos_chan_act_dyn_osmo_hvhh' time='2.572107'/> <testcase classname='BTS_Tests_VAMOS:hopping' name='TC_vamos_chan_mode_modify_vff' time='1.325286'/> <testcase classname='BTS_Tests_VAMOS:hopping' name='TC_vamos_chan_mode_modify_vhh' time='1.489239'/> <testcase classname='BTS_Tests_VAMOS:hopping' name='TC_vamos_chan_mode_modify_hvhh' time='1.372296'/> <testcase classname='BTS_Tests_VAMOS:hopping' name='TC_vamos_chan_mode_modify_dyn_ipa_vff' time='1.342030'/> <testcase classname='BTS_Tests_VAMOS:hopping' name='TC_vamos_chan_mode_modify_dyn_osmo_vff' time='1.386460'/> <testcase classname='BTS_Tests_VAMOS:hopping' name='TC_vamos_chan_mode_modify_dyn_osmo_vhh' time='1.403494'/> <testcase classname='BTS_Tests_VAMOS:hopping' name='TC_vamos_chan_mode_modify_dyn_osmo_hvhh' time='1.642324'/> <testcase classname='BTS_Tests_ASCI:hopping' name='TC_vbs_notification' time='4.757079'/> <testcase classname='BTS_Tests_ASCI:hopping' name='TC_vgcs_uplink_free_and_busy' time='1.634416'/> <testcase classname='BTS_Tests_ASCI:hopping' name='TC_vgcs_talker_fail' time='16.778568'/> <testcase classname='BTS_Tests_ASCI:hopping' name='TC_vgcs_talker_est_rel' time='1.470248'/> <testcase classname='BTS_Tests_ASCI:hopping' name='TC_vgcs_listener_det' time='3.505505'/> </testsuite> <?xml version="1.0"?> <testsuite name='Titan' tests='17' failures='0' errors='0' skipped='0' inconc='0' time='96.00'> <testcase classname='BTS_Tests_OML' name='TC_wrong_mdisc' time='10.640031'/> <testcase classname='BTS_Tests_OML' name='TC_wrong_msgtype' time='0.692363'/> <testcase classname='BTS_Tests_OML' name='TC_short_length' time='0.706203'/> <testcase classname='BTS_Tests_OML' name='TC_long_length' time='0.728999'/> <testcase classname='BTS_Tests_OML' name='TC_wrong_placement' time='0.761764'/> <testcase classname='BTS_Tests_OML' name='TC_wrong_seq' time='0.728294'/> <testcase classname='BTS_Tests_OML' name='TC_wrong_obj_class' time='0.713770'/> <testcase classname='BTS_Tests_OML' name='TC_wrong_bts_nr' time='0.722009'/> <testcase classname='BTS_Tests_OML' name='TC_wrong_trx_nr' time='0.703973'/> <testcase classname='BTS_Tests_OML' name='TC_radio_carrier_opstart_noattr' time='0.713012'/> <testcase classname='BTS_Tests_OML' name='TC_bts_opstart' time='0.697886'/> <testcase classname='BTS_Tests_OML' name='TC_bts_opstart_noattr' time='0.715435'/> <testcase classname='BTS_Tests_OML' name='TC_ts_opstart' time='0.753667'/> <testcase classname='BTS_Tests_OML' name='TC_ts_opstart_noattr' time='0.732046'/> <testcase classname='BTS_Tests_OML' name='TC_initial_state_reports' time='0.729947'/> <testcase classname='BTS_Tests_OML' name='TC_ipa_osmo_pcu_anr_fwd' time='0.742491'/> <testcase classname='BTS_Tests_OML' name='TC_ipa_rsl_connect_nack' time='0.719649'/> </testsuite> + check_respawn_count + set +x [0;31m ================================================================ WARNING: osmo-bts was respawned 5 times (expected: 3)! (OS#6794) ================================================================ [0m+ RC=1 + uptime + grep --color=always -o load.* [01;31m[Kload average: 11.16, 11.91, 7.92[m[K + exit 1 Build step 'Execute shell' marked build as failure Recording test results [Checks API] No suitable checks publisher found.
1
0
0
0
Build failed in Jenkins: ttcn3-onomondo-ipa-test #3
by jenkins@lists.osmocom.org
01 Sep '26
01 Sep '26
See <
https://jenkins.osmocom.org/jenkins/job/ttcn3-onomondo-ipa-test/3/display/r…
> Changes: ------------------------------------------ Started by user Oliver Smith Running as SYSTEM Building remotely on build5-deb12build-ansible (ttcn3 obs osmo-gsm-tester-build qemu io_uring linux-shallow-clone osmocom-gerrit coverity osmocom-master) in workspace <
https://jenkins.osmocom.org/jenkins/job/ttcn3-onomondo-ipa-test/ws/
> The recommended git tool is: NONE No credentials specified Cloning the remote Git repository Cloning repository
https://gerrit.osmocom.org/osmo-ttcn3-hacks
> git init <
https://jenkins.osmocom.org/jenkins/job/ttcn3-onomondo-ipa-test/ws/src/osmo…
> # timeout=10 Fetching upstream changes from
https://gerrit.osmocom.org/osmo-ttcn3-hacks
> git --version # timeout=10 > git --version # 'git version 2.39.5' > git fetch --tags --force --progress --
https://gerrit.osmocom.org/osmo-ttcn3-hacks
+refs/heads/*:refs/remotes/origin/* # timeout=10 > git config remote.origin.url
https://gerrit.osmocom.org/osmo-ttcn3-hacks
# timeout=10 > git config --add remote.origin.fetch +refs/heads/*:refs/remotes/origin/* # timeout=10 Avoid second fetch > git rev-parse origin/master^{commit} # timeout=10 Checking out Revision e0628e7bc39d5e61c9fd8d0ba94de60a61a14f1f (origin/master) > git config core.sparsecheckout # timeout=10 > git checkout -f e0628e7bc39d5e61c9fd8d0ba94de60a61a14f1f # timeout=10 Commit message: "IPAd: A test to verify proper session cancellation by eUICC" > git rev-list --no-walk e0628e7bc39d5e61c9fd8d0ba94de60a61a14f1f # timeout=10 Copied 1 artifact from "build-kernel-none" build number 1 [ttcn3-onomondo-ipa-test] $ /bin/sh -xe /tmp/jenkins3663228021817458699.sh + DISTRO=debian:trixie + echo debian:trixie + tr : - +
IMAGE=registry.osmocom.org/osmocom-build/debian-trixie-osmo-ttcn3-testenv
+ KERNEL=none + echo True + tr [:upper:] [:lower:] + BUILD_WITH_OSMO_DEV=true + podman pull
registry.osmocom.org/osmocom-build/debian-trixie-osmo-ttcn3-testenv
Trying to pull
registry.osmocom.org/osmocom-build/debian-trixie-osmo-ttcn3-testenv:latest
... Getting image source signatures Copying blob sha256:7fa13ad30526db36a65dae4fb3e12004c819bc9e992d312bb16d15fad7bfff07 Copying blob sha256:745970bb62b6f7d7540c985525f372aa3a26b0117e6dff07bbd663e4210ec9e5 Copying blob sha256:c4332ef953ab372a071c9279caa8e70fb96ced408f666a2d885035521afd8dda Copying blob sha256:9bbee2b358614f45b0789da707cba82c7c94ccc80d1945afaa22e4f2aa813cb0 Copying blob sha256:bd9ddc54bea929a22b334e73e026d4136e5b73f5cc29942896c72e4ece69b13d Copying blob sha256:e3e75bd290920ff882ee81af050e3b07004d3191548cd240a05347b506c6373c Copying blob sha256:1e86b21d995ec039f4fb8eba96ce9338aac6eed24451a6eff347843b90c0d5b7 Copying blob sha256:42b088c91ab829f015b1ebafb84902dfecf1691d99a6047e351fba5fdadf279e Copying blob sha256:8efb1e4560fcdff7ba0f50126316e6a63d2c74d91c1ca2510cf8460d611ae048 Copying blob sha256:5be4b5ac7424118296fe79b0c9d6cf23f721dda03f1aaf90988aca419e7f227d Copying config sha256:de96c729fb8e5f9d8860f41d84dc70f85db7283453139e0ade0442bdd59f1083 Writing manifest to image destination Storing signatures de96c729fb8e5f9d8860f41d84dc70f85db7283453139e0ade0442bdd59f1083 + [ -e cache/podman/var-*-apt-*/*/partial ] + rm -rf logs cache src + [ none != none ] + set +x + uptime + grep --color=always -o load.* [01;31m[Kload average: 12.84, 13.68, 13.73[m[K + true + src/osmo-ttcn3-hacks/testenv.py init osmo-dev /tmp/jenkins3663228021817458699.sh: 47: src/osmo-ttcn3-hacks/testenv.py: not found Build step 'Execute shell' marked build as failure Recording test results ERROR: Step ‘Publish JUnit test result report’ failed: No test report files were found. Configuration error?
1
0
0
0
Build failed in Jenkins: Osmocom-repo-install-debian12 » nightly,qemu #1158
by jenkins@lists.osmocom.org
01 Sep '26
01 Sep '26
See <
https://jenkins.osmocom.org/jenkins/job/Osmocom-repo-install-debian12/feed=…
> Changes: ------------------------------------------ [...truncated 54.85 KiB...] libosmo-pfcp-dbg libosmo-pfcp-dev libosmo-ranap7 libosmo-ranap-dbg libosmo-ranap-dev libosmo-rspro2 libosmo-rspro2-dbgsym libosmo-rspro-dev libosmo-rua0 libosmo-rua-dbg libosmo-rua-dev libosmo-sabp1 libosmo-sabp-dbg libosmo-sabp-dev libosmo-sbcap2 libosmo-sbcap-dev libosmo-sigtran12 libosmo-sigtran-dbg libosmo-sigtran-dev libosmo-sigtran-doc libosmosim2 libosmosim-doc libosmo-simtrace2-1 libosmo-simtrace2-1-dbgsym libosmo-simtrace2-dev libosmotrau11 libosmousb0 libosmousb-doc libosmovty13 libosmovty-doc librtlsdr0 librtlsdr-dev libsmpp1 libsmpp34-dbg libsmpp34-dev libsmpp34-utils libstrongswan libstrongswan-dbgsym libstrongswan-extra-plugins libstrongswan-extra-plugins-dbgsym libstrongswan-standard-plugins libstrongswan-standard-plugins-dbgsym libusrp1 libusrp1-dbgsym libusrp-dev libusrp-doc libusrp-firmware libusrp-utils libusrp-utils-dbgsym neocon neocon-dbgsym nftables nftables-dbgsym osmo-bsc osmo-bsc-bs11-utils osmo-bsc-dbg osmo-bsc-doc osmo-bsc-ipaccess-utils osmo-bsc-meas-utils osmo-bsc-nat osmo-bsc-nat-dbg osmo-bsc-nat-doc osmo-bts osmo-bts-doc osmo-bts-trx osmo-bts-trx-dbg osmo-bts-virtual osmo-bts-virtual-dbg osmo-cbc osmo-cbc-dbg osmo-cbc-doc osmo-cbc-utils osmocom-bb-doc osmocom-bb-gprsdecode osmocom-bb-gprsdecode-dbgsym osmocom-bb-layer23 osmocom-bb-layer23-dbgsym osmocom-bb-osmocon osmocom-bb-osmocon-dbgsym osmocom-bb-trxcon osmocom-bb-trxcon-dbgsym osmocom-bb-trx-toolkit osmocom-bb-virtphy osmocom-bb-virtphy-dbgsym osmocom-keyring osmocom-nightly osmo-diameter2gsup osmo-e1d osmo-e1d-dbgsym osmo-epdg osmo-epdg-dbgsym osmo-epdg-doc osmo-fl2k osmo-fl2k-dbgsym osmo-gbproxy osmo-gbproxy-dbg osmo-gbproxy-doc osmo-ggsn osmo-ggsn-dbg osmo-ggsn-doc osmo-gsm-manuals-dev osmo-gtphub osmo-gtphub-dbg osmo-hlr osmo-hlr-dbg osmo-hlr-doc osmo-hnbgw osmo-hnbgw-dbg osmo-hnbgw-doc osmo-hnodeb osmo-hnodeb-dbg osmo-hnodeb-doc osmo-mgw osmo-mgw-dbgsym osmo-mgw-doc osmo-msc osmo-msc-dbg osmo-msc-doc osmo-mslookup-utils osmo-pcap-client osmo-pcap-client-dbg osmo-pcap-server osmo-pcap-server-dbg osmo-pcu osmo-pcu-dbg osmo-pcu-doc osmo-remsim-apitool osmo-remsim-bankd osmo-remsim-bankd-dbgsym osmo-remsim-client-shell osmo-remsim-client-shell-dbgsym osmo-remsim-client-st2 osmo-remsim-client-st2-dbgsym osmo-remsim-doc osmo-remsim-server osmo-remsim-server-dbgsym osmo-s1gw osmo-s1gw-cli osmo-s1gw-dbgsym osmo-sgsn osmo-sgsn-dbg osmo-sgsn-doc osmo-sip-connector osmo-sip-connector-dbg osmo-sip-connector-doc osmo-smlc osmo-smlc-dbg osmo-smlc-doc osmo-stp osmo-stp-dbg osmo-stp-doc osmo-sysmon osmo-sysmon-dbg osmo-trx osmo-trx-dbg osmo-trx-doc osmo-trx-ipc osmo-trx-lms osmo-trx-ms-blade osmo-trx-uhd osmo-trx-usrp1 osmo-uecups osmo-uecups-dbgsym osmo-upf osmo-upf-dbg osmo-upf-doc python3-osmopy-libs python3-osmopy-utils python3-pyosmocom python3-pyosmocom-doc rtl-sdr simtrace2-firmware simtrace2-utils simtrace2-utils-dbgsym strongswan strongswan-charon strongswan-charon-dbgsym strongswan-libcharon strongswan-libcharon-dbgsym strongswan-nm strongswan-nm-dbgsym strongswan-pki strongswan-pki-dbgsym strongswan-starter strongswan-starter-dbgsym strongswan-swanctl strongswan-swanctl-dbgsym + apt-get install -y --no-install-recommends -- abisip-find charon-cmd charon-cmd-dbgsym eclipse-titan eclipse-titan-dbgsym gapk gapk-dbgsym gtp-echo-responder gtp-echo-responder-dbg libasn1c1 libasn1c-dbg libasn1c-dev libcharon-extauth-plugins libcharon-extauth-plugins-dbgsym libcharon-extra-plugins libcharon-extra-plugins-dbgsym libgtp11 libgtp-dbg libgtp-dev libgtpnl0 libgtpnl-dbg libgtpnl-dev libgtpnl-tools libifd-osmo-remsim-client0 libifd-osmo-remsim-client0-dbgsym libnftables1 libnftables1-dbgsym libnftables-dev libosmo-abis libosmoabis17 libosmo-abis-dbg libosmo-abis-dev libosmo-asn1-tcap1 libosmo-asn1-tcap-dbg libosmo-asn1-tcap-dev libosmocodec4 libosmocodec-doc libosmocoding0 libosmocoding-doc libosmocore libosmocore22 libosmocore-dbg libosmocore-dev libosmocore-doc libosmocore-utils libosmo-csn1-1 libosmo-csn1-1-dbgsym libosmo-csn1-dbg libosmo-csn1-dev libosmoctrl0 libosmoctrl-doc libosmodsp0 libosmodsp-dbg libosmodsp-dev libosmodsp-doc libosmo-e1d3 libosmo-e1d3-dbgsym libosmo-e1d-dev libosmo-fl2k0 libosmo-fl2k0-dbgsym libosmo-fl2k-dev libosmogapk0 libosmogapk0-dbgsym libosmogapk-dev libosmogb14 libosmogb-doc libosmo-gprs-gmm1 libosmo-gprs-gmm1-dbgsym libosmo-gprs-gmm-dbg libosmo-gprs-gmm-dev libosmo-gprs-llc1 libosmo-gprs-llc1-dbgsym libosmo-gprs-llc-dbg libosmo-gprs-llc-dev libosmo-gprs-rlcmac1 libosmo-gprs-rlcmac1-dbgsym libosmo-gprs-rlcmac-dbg libosmo-gprs-rlcmac-dev libosmo-gprs-sm1 libosmo-gprs-sm1-dbgsym libosmo-gprs-sm-dbg libosmo-gprs-sm-dev libosmo-gprs-sndcp1 libosmo-gprs-sndcp1-dbgsym libosmo-gprs-sndcp-dbg libosmo-gprs-sndcp-dev libosmogsm20 libosmogsm-doc libosmo-gsup-client0 libosmo-gsup-client-dev libosmo-gtlv1 libosmo-gtlv-dbg libosmo-gtlv-dev libosmo-hnbap0 libosmo-hnbap-dbg libosmo-hnbap-dev libosmoisdn0 libosmoisdn-doc libosmo-iuh-dev libosmo-mgcp-client16 libosmo-mgcp-client16-dbgsym libosmo-mgcp-client-dev libosmo-mslookup1 libosmo-mslookup-dev libosmonetif11 libosmo-netif-dbg libosmo-netif-dev libosmo-netif-doc libosmo-octoi3 libosmo-octoi3-dbgsym libosmo-octoi-dev libosmo-pfcp libosmo-pfcp4 libosmo-pfcp-dbg libosmo-pfcp-dev libosmo-ranap7 libosmo-ranap-dbg libosmo-ranap-dev libosmo-rspro2 libosmo-rspro2-dbgsym libosmo-rspro-dev libosmo-rua0 libosmo-rua-dbg libosmo-rua-dev libosmo-sabp1 libosmo-sabp-dbg libosmo-sabp-dev libosmo-sbcap2 libosmo-sbcap-dev libosmo-sigtran12 libosmo-sigtran-dbg libosmo-sigtran-dev libosmo-sigtran-doc libosmosim2 libosmosim-doc libosmo-simtrace2-1 libosmo-simtrace2-1-dbgsym libosmo-simtrace2-dev libosmotrau11 libosmousb0 libosmousb-doc libosmovty13 libosmovty-doc librtlsdr0 librtlsdr-dev libsmpp1 libsmpp34-dbg libsmpp34-dev libsmpp34-utils libstrongswan libstrongswan-dbgsym libstrongswan-extra-plugins libstrongswan-extra-plugins-dbgsym libstrongswan-standard-plugins libstrongswan-standard-plugins-dbgsym libusrp1 libusrp1-dbgsym libusrp-dev libusrp-doc libusrp-firmware libusrp-utils libusrp-utils-dbgsym neocon neocon-dbgsym nftables nftables-dbgsym osmo-bsc osmo-bsc-bs11-utils osmo-bsc-dbg osmo-bsc-doc osmo-bsc-ipaccess-utils osmo-bsc-meas-utils osmo-bsc-nat osmo-bsc-nat-dbg osmo-bsc-nat-doc osmo-bts osmo-bts-doc osmo-bts-trx osmo-bts-trx-dbg osmo-bts-virtual osmo-bts-virtual-dbg osmo-cbc osmo-cbc-dbg osmo-cbc-doc osmo-cbc-utils osmocom-bb-doc osmocom-bb-gprsdecode osmocom-bb-gprsdecode-dbgsym osmocom-bb-layer23 osmocom-bb-layer23-dbgsym osmocom-bb-osmocon osmocom-bb-osmocon-dbgsym osmocom-bb-trxcon osmocom-bb-trxcon-dbgsym osmocom-bb-trx-toolkit osmocom-bb-virtphy osmocom-bb-virtphy-dbgsym osmocom-keyring osmocom-nightly osmo-diameter2gsup osmo-e1d osmo-e1d-dbgsym osmo-epdg osmo-epdg-dbgsym osmo-epdg-doc osmo-fl2k osmo-fl2k-dbgsym osmo-gbproxy osmo-gbproxy-dbg osmo-gbproxy-doc osmo-ggsn osmo-ggsn-dbg osmo-ggsn-doc osmo-gsm-manuals-dev osmo-gtphub osmo-gtphub-dbg osmo-hlr osmo-hlr-dbg osmo-hlr-doc osmo-hnbgw osmo-hnbgw-dbg osmo-hnbgw-doc osmo-hnodeb osmo-hnodeb-dbg osmo-hnodeb-doc osmo-mgw osmo-mgw-dbgsym osmo-mgw-doc osmo-msc osmo-msc-dbg osmo-msc-doc osmo-mslookup-utils osmo-pcap-client osmo-pcap-client-dbg osmo-pcap-server osmo-pcap-server-dbg osmo-pcu osmo-pcu-dbg osmo-pcu-doc osmo-remsim-apitool osmo-remsim-bankd osmo-remsim-bankd-dbgsym osmo-remsim-client-shell osmo-remsim-client-shell-dbgsym osmo-remsim-client-st2 osmo-remsim-client-st2-dbgsym osmo-remsim-doc osmo-remsim-server osmo-remsim-server-dbgsym osmo-s1gw osmo-s1gw-cli osmo-s1gw-dbgsym osmo-sgsn osmo-sgsn-dbg osmo-sgsn-doc osmo-sip-connector osmo-sip-connector-dbg osmo-sip-connector-doc osmo-smlc osmo-smlc-dbg osmo-smlc-doc osmo-stp osmo-stp-dbg osmo-stp-doc osmo-sysmon osmo-sysmon-dbg osmo-trx osmo-trx-dbg osmo-trx-doc osmo-trx-ipc osmo-trx-lms osmo-trx-ms-blade osmo-trx-uhd osmo-trx-usrp1 osmo-uecups osmo-uecups-dbgsym osmo-upf osmo-upf-dbg osmo-upf-doc python3-osmopy-libs python3-osmopy-utils python3-pyosmocom python3-pyosmocom-doc rtl-sdr simtrace2-firmware simtrace2-utils simtrace2-utils-dbgsym strongswan strongswan-charon strongswan-charon-dbgsym strongswan-libcharon strongswan-libcharon-dbgsym strongswan-nm strongswan-nm-dbgsym strongswan-pki strongswan-pki-dbgsym strongswan-starter strongswan-starter-dbgsym strongswan-swanctl strongswan-swanctl-dbgsym Reading package lists... Building dependency tree... Reading state information... libosmocodec4 is already the newest version (1.14.2.2.a279.202608301800). libosmocodec4 set to manually installed. libosmocoding0 is already the newest version (1.14.2.2.a279.202608301800). libosmocoding0 set to manually installed. libosmocore is already the newest version (1.14.2.2.a279.202608301800). libosmocore22 is already the newest version (1.14.2.2.a279.202608301800). libosmocore22 set to manually installed. libosmoctrl0 is already the newest version (1.14.2.2.a279.202608301800). libosmoctrl0 set to manually installed. libosmogb14 is already the newest version (1.14.2.2.a279.202608301800). libosmogb14 set to manually installed. libosmogsm20 is already the newest version (1.14.2.2.a279.202608301800). libosmogsm20 set to manually installed. libosmoisdn0 is already the newest version (1.14.2.2.a279.202608301800). libosmoisdn0 set to manually installed. libosmosim2 is already the newest version (1.14.2.2.a279.202608301800). libosmosim2 set to manually installed. libosmousb0 is already the newest version (1.14.2.2.a279.202608301800). libosmousb0 set to manually installed. libosmovty13 is already the newest version (1.14.2.2.a279.202608301800). libosmovty13 set to manually installed. osmocom-keyring is already the newest version (1.1.1.8.7873.202608301800). osmocom-keyring set to manually installed. osmocom-nightly is already the newest version (202608301800). Some packages could not be installed. This may mean that you have requested an impossible situation or if you are using the unstable distribution that some required packages have not yet been created or been moved out of Incoming. The following information may help to resolve the situation: The following packages have unmet dependencies: charon-cmd : Depends: osmocom-nightly (= 202608291800) but 202608301800 is to be installed libcharon-extauth-plugins : Depends: osmocom-nightly (= 202608291800) but 202608301800 is to be installed libcharon-extra-plugins : Depends: osmocom-nightly (= 202608291800) but 202608301800 is to be installed libstrongswan : Depends: osmocom-nightly (= 202608291800) but 202608301800 is to be installed libstrongswan-extra-plugins : Depends: osmocom-nightly (= 202608291800) but 202608301800 is to be installed libstrongswan-standard-plugins : Depends: osmocom-nightly (= 202608291800) but 202608301800 is to be installed strongswan-charon : Depends: osmocom-nightly (= 202608291800) but 202608301800 is to be installed strongswan-libcharon : Depends: osmocom-nightly (= 202608291800) but 202608301800 is to be installed strongswan-nm : Depends: osmocom-nightly (= 202608291800) but 202608301800 is to be installed strongswan-pki : Depends: osmocom-nightly (= 202608291800) but 202608301800 is to be installed strongswan-starter : Depends: osmocom-nightly (= 202608291800) but 202608301800 is to be installed strongswan-swanctl : Depends: osmocom-nightly (= 202608291800) but 202608301800 is to be installed E: Unable to correct problems, you have held broken packages. + clean_up_trap + [ -n ] + set +x ### Clean up ### + trap - EXIT INT TERM 0 + clean_up + [ -n ] + [ -e _repo_install_test_data/qemu.pid ] + cat _repo_install_test_data/qemu.pid + kill 304700 + rm -f _repo_install_test_data/temp.qcow2 Build step 'Execute shell' marked build as failure
1
1
0
0
← Newer
1
2
3
4
5
6
Older →
Jump to page:
1
2
3
4
5
6
Results per page:
10
25
50
100
200