lists.osmocom.org
Sign In
Sign Up
Sign In
Sign Up
Manage this list
×
Keyboard Shortcuts
Thread View
j
: Next unread message
k
: Previous unread message
j a
: Jump to all threads
j l
: Jump to MailingList overview
2026
September
August
July
June
May
April
March
February
January
2025
December
November
October
September
August
July
June
May
April
March
February
January
2024
December
November
October
September
August
July
June
May
April
March
February
January
2023
December
November
October
September
August
July
June
May
April
March
February
January
2022
December
November
October
September
August
July
June
May
April
March
February
January
2021
December
November
October
September
August
July
June
May
April
March
February
January
2020
December
November
October
September
August
July
June
May
April
March
February
January
2019
December
November
October
September
August
July
June
May
April
March
List overview
Download
jenkins-notifications
September 2026
----- 2026 -----
September 2026
August 2026
July 2026
June 2026
May 2026
April 2026
March 2026
February 2026
January 2026
----- 2025 -----
December 2025
November 2025
October 2025
September 2025
August 2025
July 2025
June 2025
May 2025
April 2025
March 2025
February 2025
January 2025
----- 2024 -----
December 2024
November 2024
October 2024
September 2024
August 2024
July 2024
June 2024
May 2024
April 2024
March 2024
February 2024
January 2024
----- 2023 -----
December 2023
November 2023
October 2023
September 2023
August 2023
July 2023
June 2023
May 2023
April 2023
March 2023
February 2023
January 2023
----- 2022 -----
December 2022
November 2022
October 2022
September 2022
August 2022
July 2022
June 2022
May 2022
April 2022
March 2022
February 2022
January 2022
----- 2021 -----
December 2021
November 2021
October 2021
September 2021
August 2021
July 2021
June 2021
May 2021
April 2021
March 2021
February 2021
January 2021
----- 2020 -----
December 2020
November 2020
October 2020
September 2020
August 2020
July 2020
June 2020
May 2020
April 2020
March 2020
February 2020
January 2020
----- 2019 -----
December 2019
November 2019
October 2019
September 2019
August 2019
July 2019
June 2019
May 2019
April 2019
March 2019
jenkins-notifications@lists.osmocom.org
1 participants
59 discussions
Start a n
N
ew thread
Build failed in Jenkins: Osmocom-repo-install-debian11 » nightly,qemu #1557
by jenkins@lists.osmocom.org
07 Sep '26
07 Sep '26
See <
https://jenkins.osmocom.org/jenkins/job/Osmocom-repo-install-debian11/feed=…
> Changes: ------------------------------------------ [...truncated 3.50 KiB...] + LOG_FILE=_repo_install_test_data/qemu.log + check_usage + local i + [ debian11 = centos8 ] + [ debian11 = debian10 ] + [ debian11 = debian11 ] + return + FEED=nightly + PROJ=osmocom:nightly + [ -z ] + TESTS= test_conflict install_repo_packages test_binaries services_check + [ -z ] + PROJ_CONFLICT=osmocom:latest + clean_up + [ -n ] + [ -e _repo_install_test_data/qemu.pid ] + rm -f _repo_install_test_data/temp.qcow2 + trap clean_up_trap EXIT INT TERM 0 + qemu_start + [ -n ] + prepare_img + dirname _repo_install_test_data/temp.qcow2 + mkdir -p _repo_install_test_data + get_backing_img_path + local ret= + ret=/opt/qemu/debian-11.qcow2 + [ -e /opt/qemu/debian-11.qcow2 ] + echo /opt/qemu/debian-11.qcow2 + qemu-img create -f qcow2 -b /opt/qemu/debian-11.qcow2 -F qcow2 _repo_install_test_data/temp.qcow2 Formatting '_repo_install_test_data/temp.qcow2', fmt=qcow2 cluster_size=65536 extended_l2=off compression_type=zlib size=6442450944 backing_file=/opt/qemu/debian-11.qcow2 backing_fmt=qcow2 lazy_refcounts=off refcount_bits=16 + find_free_ssh_port + echo (1077489 % 1000) + 22022 + bc + SSH_PORT=22511 + nc -z 127.0.0.1 22511 + echo 22511 + qemu_ssh_wait + set +x Waiting for VM to boot up... + sleep 1 + timeout 1h qemu-system-x86_64 -cpu host -device virtio-net-pci,netdev=net -display none -drive file=_repo_install_test_data/temp.qcow2,format=qcow2 -enable-kvm -m 1024 -netdev user,id=net,hostfwd=tcp:127.0.0.1:22511-:22 -nodefaults -pidfile _repo_install_test_data/qemu.pid -serial stdio -smp 16 + cat _repo_install_test_data/qemu.pid + local pid=1077508 + seq 1 6 + [ -z 1077508 ] + kill -0 1077508 + TIMEOUT=10s qemu_ssh true + timeout 10s sshpass -p root ssh -p 22511 -o StrictHostKeyChecking=no -o UserKnownHostsFile=/dev/null root(a)127.0.0.1 -- true + sleep 1 + [ -z 1077508 ] + kill -0 1077508 + TIMEOUT=10s qemu_ssh true + timeout 10s sshpass -p root ssh -p 22511 -o StrictHostKeyChecking=no -o UserKnownHostsFile=/dev/null root(a)127.0.0.1 -- true Warning: Permanently added '[127.0.0.1]:22511' (ED25519) to the list of known hosts. + return + set +x VM is running! + qemu_prepare_vm + qemu_run_test_script + cat + qemu_ssh rm -rf /repo-install-test/ + timeout 1m sshpass -p root ssh -p 22511 -o StrictHostKeyChecking=no -o UserKnownHostsFile=/dev/null root(a)127.0.0.1 -- rm -rf /repo-install-test/ Warning: Permanently added '[127.0.0.1]:22511' (ED25519) to the list of known hosts. + qemu_ssh mkdir /repo-install-test + timeout 1m sshpass -p root ssh -p 22511 -o StrictHostKeyChecking=no -o UserKnownHostsFile=/dev/null root(a)127.0.0.1 -- mkdir /repo-install-test Warning: Permanently added '[127.0.0.1]:22511' (ED25519) to the list of known hosts. + qemu_scp -r scripts/repo-install-test/run-inside-env.sh scripts/repo-install-test/run-inside.sh root@127.0.0.1:/repo-install-test + timeout 1m sshpass -p root scp -P 22511 -o StrictHostKeyChecking=no -o UserKnownHostsFile=/dev/null -r scripts/repo-install-test/run-inside-env.sh scripts/repo-install-test/run-inside.sh root@127.0.0.1:/repo-install-test Warning: Permanently added '[127.0.0.1]:22511' (ED25519) to the list of known hosts. + TIMEOUT=1h qemu_ssh sh -ex /repo-install-test/run-inside-env.sh + timeout 1h sshpass -p root ssh -p 22511 -o StrictHostKeyChecking=no -o UserKnownHostsFile=/dev/null root(a)127.0.0.1 -- sh -ex /repo-install-test/run-inside-env.sh Warning: Permanently added '[127.0.0.1]:22511' (ED25519) to the list of known hosts. + export DISTRO=debian11 + export
DOMAIN=downloads.osmocom.org
+ export FEED=nightly + export PROJ=osmocom:nightly + export PROJ_CONFLICT=osmocom:latest + export SKIP_PREPARE_VM= + export TESTS= test_conflict install_repo_packages test_binaries services_check + /repo-install-test/run-inside.sh + SERVICES= osmo-bsc osmo-bts-virtual osmo-cbc osmo-e1d osmo-gbproxy osmo-ggsn osmo-gtphub osmo-hlr osmo-hnbgw osmo-hnodeb osmo-mgw osmo-msc osmo-pcap-client osmo-pcap-server osmo-pcu osmo-remsim-bankd osmo-remsim-server osmo-sgsn osmo-sip-connector osmo-smlc osmo-stp + SERVICES_NIGHTLY= osmo-bsc-nat + distro_obsdir + echo Debian_11 + DISTRO_OBSDIR=Debian_11 Checking feed: nightly Checking project: osmocom:nightly Checking conflicting project: osmocom:latest Linux distribution: debian11 Enabled tests: test_conflict install_repo_packages test_binaries services_check + check_env + [ -n nightly ] + echo Checking feed: nightly + [ -n osmocom:nightly ] + echo Checking project: osmocom:nightly + [ -n osmocom:latest ] + echo Checking conflicting project: osmocom:latest + [ -n debian11 ] + echo Linux distribution: debian11 + [ -n test_conflict install_repo_packages test_binaries services_check ] + echo Enabled tests: test_conflict install_repo_packages test_binaries services_check + prepare_vm + [ -n ] + prepare_vm_debian + ln -sf /bin/true /usr/bin/fmtutil + echo path-exclude=/usr/bin/fmtutil + apt-get update --allow-releaseinfo-change Get:1
http://security.debian.org/debian-security
bullseye-security InRelease [27.2 kB] Get:2
http://deb.debian.org/debian
bullseye InRelease [75.1 kB] Get:3
http://deb.debian.org/debian
bullseye-updates InRelease [44.0 kB] Get:4
http://security.debian.org/debian-security
bullseye-security/main Sources [311 kB] Get:5
http://security.debian.org/debian-security
bullseye-security/main amd64 Packages [475 kB] Get:6
http://security.debian.org/debian-security
bullseye-security/main Translation-en [318 kB] Get:7
http://deb.debian.org/debian
bullseye/main Sources [8,500 kB] Get:8
http://deb.debian.org/debian
bullseye-updates/main Sources.diff/Index [26.3 kB] Get:9
http://deb.debian.org/debian
bullseye-updates/main amd64 Packages.diff/Index [26.3 kB] Ign:9
http://deb.debian.org/debian
bullseye-updates/main amd64 Packages.diff/Index Get:10
http://deb.debian.org/debian
bullseye-updates/main Translation-en.diff/Index [12.8 kB] Get:11
http://deb.debian.org/debian
bullseye-updates/main Sources T-2023-12-29-1403.39-F-2022-01-24-2024.03.pdiff [7,722 B] Get:11
http://deb.debian.org/debian
bullseye-updates/main Sources T-2023-12-29-1403.39-F-2022-01-24-2024.03.pdiff [7,722 B] Get:12
http://deb.debian.org/debian
bullseye-updates/main Translation-en T-2025-07-21-2004.39-F-2022-09-22-1635.40.pdiff [8,550 B] Get:12
http://deb.debian.org/debian
bullseye-updates/main Translation-en T-2025-07-21-2004.39-F-2022-09-22-1635.40.pdiff [8,550 B] Get:13
http://deb.debian.org/debian
bullseye/main amd64 Packages [8,066 kB] Get:14
http://deb.debian.org/debian
bullseye/main Translation-en [6,235 kB] Get:15
http://deb.debian.org/debian
bullseye-updates/main amd64 Packages [18.8 kB] Get:16
http://deb.debian.org/debian
bullseye-updates/main Sources [7,908 B] Get:17
http://deb.debian.org/debian
bullseye-updates/main Translation-en [10.5 kB] Fetched 24.2 MB in 2s (11.0 MB/s) Reading package lists... + apt-get install -y --no-install-recommends aptitude ca-certificates gnupg2 wget Reading package lists... Building dependency tree... Reading state information... The following additional packages will be installed: aptitude-common dirmngr gnupg gnupg-l10n gnupg-utils gpg gpg-agent gpg-wks-client gpg-wks-server gpgconf gpgsm gpgv libassuan0 libboost-iostreams1.74.0 libcwidget4 libksba8 libnpth0 libsigc++-2.0-0v5 libxapian30 pinentry-curses Suggested packages: apt-xapian-index aptitude-doc-en | aptitude-doc debtags dbus-user-session pinentry-gnome3 tor parcimonie xloadimage scdaemon libcwidget-dev xapian-tools pinentry-doc Recommended packages: libdpkg-perl The following NEW packages will be installed: aptitude aptitude-common dirmngr gnupg gnupg-l10n gnupg-utils gnupg2 gpg gpg-agent gpg-wks-client gpg-wks-server gpgconf gpgsm libassuan0 libboost-iostreams1.74.0 libcwidget4 libksba8 libnpth0 libsigc++-2.0-0v5 libxapian30 pinentry-curses The following packages will be upgraded: ca-certificates gpgv wget 3 upgraded, 21 newly installed, 0 to remove and 148 not upgraded. Need to get 14.7 MB of archives. After this operation, 37.0 MB of additional disk space will be used. Get:1
http://security.debian.org/debian-security
bullseye-security/main amd64 gpgv amd64 2.2.27-2+deb11u3 [626 kB] Get:2
http://deb.debian.org/debian
bullseye/main amd64 aptitude-common all 0.8.13-3 [1,776 kB] Err:3
http://security.debian.org/debian-security
bullseye-security/main amd64 ca-certificates all 20250419~deb12u1~deb11u1 404 Not Found [IP: 146.75.122.132 80] Get:4
http://security.debian.org/debian-security
bullseye-security/main amd64 wget amd64 1.21-1+deb11u2 [964 kB] Get:5
http://security.debian.org/debian-security
bullseye-security/main amd64 gpgconf amd64 2.2.27-2+deb11u3 [548 kB] Get:6
http://deb.debian.org/debian
bullseye/main amd64 libboost-iostreams1.74.0 amd64 1.74.0-9 [264 kB] Get:7
http://deb.debian.org/debian
bullseye/main amd64 libsigc++-2.0-0v5 amd64 2.10.4-2 [31.3 kB] Get:8
http://deb.debian.org/debian
bullseye/main amd64 libcwidget4 amd64 0.5.18-5 [315 kB] Get:9
http://security.debian.org/debian-security
bullseye-security/main amd64 dirmngr amd64 2.2.27-2+deb11u3 [763 kB] Get:10
http://deb.debian.org/debian
bullseye/main amd64 libxapian30 amd64 1.4.18-3+deb11u1 [1,089 kB] Get:11
http://security.debian.org/debian-security
bullseye-security/main amd64 gnupg-l10n all 2.2.27-2+deb11u3 [1,084 kB] Get:12
http://security.debian.org/debian-security
bullseye-security/main amd64 gnupg-utils amd64 2.2.27-2+deb11u3 [905 kB] Get:13
http://security.debian.org/debian-security
bullseye-security/main amd64 gpg amd64 2.2.27-2+deb11u3 [928 kB] Get:14
http://security.debian.org/debian-security
bullseye-security/main amd64 gpg-agent amd64 2.2.27-2+deb11u3 [670 kB] Get:15
http://deb.debian.org/debian
bullseye/main amd64 aptitude amd64 0.8.13-3 [1,349 kB] Get:16
http://deb.debian.org/debian
bullseye/main amd64 libassuan0 amd64 2.5.3-7.1 [50.5 kB] Get:17
http://deb.debian.org/debian
bullseye/main amd64 libksba8 amd64 1.5.0-3+deb11u2 [123 kB] Get:18
http://deb.debian.org/debian
bullseye/main amd64 libnpth0 amd64 1.6-3 [19.0 kB] Get:19
http://deb.debian.org/debian
bullseye/main amd64 pinentry-curses amd64 1.1.0-4 [64.9 kB] Get:20
http://security.debian.org/debian-security
bullseye-security/main amd64 gpg-wks-client amd64 2.2.27-2+deb11u3 [524 kB] Get:21
http://security.debian.org/debian-security
bullseye-security/main amd64 gpg-wks-server amd64 2.2.27-2+deb11u3 [516 kB] Get:22
http://security.debian.org/debian-security
bullseye-security/main amd64 gpgsm amd64 2.2.27-2+deb11u3 [645 kB] Get:23
http://security.debian.org/debian-security
bullseye-security/main amd64 gnupg all 2.2.27-2+deb11u3 [825 kB] Get:24
http://security.debian.org/debian-security
bullseye-security/main amd64 gnupg2 all 2.2.27-2+deb11u3 [435 kB] Fetched 14.5 MB in 0s (79.8 MB/s) E: Failed to fetch
http://security.debian.org/debian-security/pool/updates/main/c/ca-certifica…
404 Not Found [IP: 146.75.122.132 80] E: Unable to fetch some archives, maybe run apt-get update or try with --fix-missing? + clean_up_trap + [ -n ] + set +x ### Clean up ### + trap - EXIT INT TERM 0 + clean_up + [ -n ] + [ -e _repo_install_test_data/qemu.pid ] + cat _repo_install_test_data/qemu.pid + kill 1077508 + rm -f _repo_install_test_data/temp.qcow2 Build step 'Execute shell' marked build as failure
1
3
0
0
Build failed in Jenkins: Osmocom-repo-install-debian11 » latest,qemu #1557
by jenkins@lists.osmocom.org
07 Sep '26
07 Sep '26
See <
https://jenkins.osmocom.org/jenkins/job/Osmocom-repo-install-debian11/feed=…
> Changes: ------------------------------------------ [...truncated 3.49 KiB...] + LOG_FILE=_repo_install_test_data/qemu.log + check_usage + local i + [ debian11 = centos8 ] + [ debian11 = debian10 ] + [ debian11 = debian11 ] + return + FEED=latest + PROJ=osmocom:latest + [ -z ] + TESTS= test_conflict install_repo_packages test_binaries services_check + [ -z ] + PROJ_CONFLICT=osmocom:nightly + clean_up + [ -n ] + [ -e _repo_install_test_data/qemu.pid ] + rm -f _repo_install_test_data/temp.qcow2 + trap clean_up_trap EXIT INT TERM 0 + qemu_start + [ -n ] + prepare_img + dirname _repo_install_test_data/temp.qcow2 + mkdir -p _repo_install_test_data + get_backing_img_path + local ret= + ret=/opt/qemu/debian-11.qcow2 + [ -e /opt/qemu/debian-11.qcow2 ] + echo /opt/qemu/debian-11.qcow2 + qemu-img create -f qcow2 -b /opt/qemu/debian-11.qcow2 -F qcow2 _repo_install_test_data/temp.qcow2 Formatting '_repo_install_test_data/temp.qcow2', fmt=qcow2 cluster_size=65536 extended_l2=off compression_type=zlib size=6442450944 backing_file=/opt/qemu/debian-11.qcow2 backing_fmt=qcow2 lazy_refcounts=off refcount_bits=16 + find_free_ssh_port + echo (2024954 % 1000) + 22022 + bc + SSH_PORT=22976 + nc -z 127.0.0.1 22976 + echo 22976 + qemu_ssh_wait + set +x Waiting for VM to boot up... + sleep 1 + timeout 1h qemu-system-x86_64 -cpu host -device virtio-net-pci,netdev=net -display none -drive file=_repo_install_test_data/temp.qcow2,format=qcow2 -enable-kvm -m 1024 -netdev user,id=net,hostfwd=tcp:127.0.0.1:22976-:22 -nodefaults -pidfile _repo_install_test_data/qemu.pid -serial stdio -smp 16 + cat _repo_install_test_data/qemu.pid + local pid=2024978 + seq 1 6 + [ -z 2024978 ] + kill -0 2024978 + TIMEOUT=10s qemu_ssh true + timeout 10s sshpass -p root ssh -p 22976 -o StrictHostKeyChecking=no -o UserKnownHostsFile=/dev/null root(a)127.0.0.1 -- true + sleep 1 + [ -z 2024978 ] + kill -0 2024978 + TIMEOUT=10s qemu_ssh true + timeout 10s sshpass -p root ssh -p 22976 -o StrictHostKeyChecking=no -o UserKnownHostsFile=/dev/null root(a)127.0.0.1 -- true Warning: Permanently added '[127.0.0.1]:22976' (ED25519) to the list of known hosts. + return + set +x VM is running! + qemu_prepare_vm + qemu_run_test_script + cat + qemu_ssh rm -rf /repo-install-test/ + timeout 1m sshpass -p root ssh -p 22976 -o StrictHostKeyChecking=no -o UserKnownHostsFile=/dev/null root(a)127.0.0.1 -- rm -rf /repo-install-test/ Warning: Permanently added '[127.0.0.1]:22976' (ED25519) to the list of known hosts. + qemu_ssh mkdir /repo-install-test + timeout 1m sshpass -p root ssh -p 22976 -o StrictHostKeyChecking=no -o UserKnownHostsFile=/dev/null root(a)127.0.0.1 -- mkdir /repo-install-test Warning: Permanently added '[127.0.0.1]:22976' (ED25519) to the list of known hosts. + qemu_scp -r scripts/repo-install-test/run-inside-env.sh scripts/repo-install-test/run-inside.sh root@127.0.0.1:/repo-install-test + timeout 1m sshpass -p root scp -P 22976 -o StrictHostKeyChecking=no -o UserKnownHostsFile=/dev/null -r scripts/repo-install-test/run-inside-env.sh scripts/repo-install-test/run-inside.sh root@127.0.0.1:/repo-install-test Warning: Permanently added '[127.0.0.1]:22976' (ED25519) to the list of known hosts. + TIMEOUT=1h qemu_ssh sh -ex /repo-install-test/run-inside-env.sh + timeout 1h sshpass -p root ssh -p 22976 -o StrictHostKeyChecking=no -o UserKnownHostsFile=/dev/null root(a)127.0.0.1 -- sh -ex /repo-install-test/run-inside-env.sh Warning: Permanently added '[127.0.0.1]:22976' (ED25519) to the list of known hosts. + export DISTRO=debian11 + export
DOMAIN=downloads.osmocom.org
+ export FEED=latest + export PROJ=osmocom:latest + export PROJ_CONFLICT=osmocom:nightly + export SKIP_PREPARE_VM= + export TESTS= test_conflict install_repo_packages test_binaries services_check + /repo-install-test/run-inside.sh + SERVICES= osmo-bsc osmo-bts-virtual osmo-cbc osmo-e1d osmo-gbproxy osmo-ggsn osmo-gtphub osmo-hlr osmo-hnbgw osmo-hnodeb osmo-mgw osmo-msc osmo-pcap-client osmo-pcap-server osmo-pcu osmo-remsim-bankd osmo-remsim-server osmo-sgsn osmo-sip-connector osmo-smlc osmo-stp + SERVICES_NIGHTLY= osmo-bsc-nat + distro_obsdir + echo Debian_11 + DISTRO_OBSDIR=Debian_11 + check_env + [ -n latest ] + echo Checking feed: latest + Checking feed: latest Checking project: osmocom:latest Checking conflicting project: osmocom:nightly [ -n osmocom:latest ] + echo Checking project: osmocom:latest + [ -n osmocom:nightly ] + echo Checking conflicting project: osmocom:nightly + [ -n debian11Linux distribution: debian11 Enabled tests: test_conflict install_repo_packages test_binaries services_check ] + echo Linux distribution: debian11 + [ -n test_conflict install_repo_packages test_binaries services_check ] + echo Enabled tests: test_conflict install_repo_packages test_binaries services_check + prepare_vm + [ -n ] + prepare_vm_debian + ln -sf /bin/true /usr/bin/fmtutil + echo path-exclude=/usr/bin/fmtutil + apt-get update --allow-releaseinfo-change Get:1
http://security.debian.org/debian-security
bullseye-security InRelease [27.2 kB] Get:2
http://deb.debian.org/debian
bullseye InRelease [75.1 kB] Get:3
http://deb.debian.org/debian
bullseye-updates InRelease [44.0 kB] Get:4
http://security.debian.org/debian-security
bullseye-security/main Sources [311 kB] Get:5
http://security.debian.org/debian-security
bullseye-security/main amd64 Packages [475 kB] Get:6
http://security.debian.org/debian-security
bullseye-security/main Translation-en [318 kB] Get:7
http://deb.debian.org/debian
bullseye/main Sources [8,500 kB] Get:8
http://deb.debian.org/debian
bullseye-updates/main Sources.diff/Index [26.3 kB] Get:9
http://deb.debian.org/debian
bullseye-updates/main amd64 Packages.diff/Index [26.3 kB] Ign:9
http://deb.debian.org/debian
bullseye-updates/main amd64 Packages.diff/Index Get:10
http://deb.debian.org/debian
bullseye-updates/main Translation-en.diff/Index [12.8 kB] Get:11
http://deb.debian.org/debian
bullseye-updates/main Sources T-2023-12-29-1403.39-F-2022-01-24-2024.03.pdiff [7,722 B] Get:11
http://deb.debian.org/debian
bullseye-updates/main Sources T-2023-12-29-1403.39-F-2022-01-24-2024.03.pdiff [7,722 B] Get:12
http://deb.debian.org/debian
bullseye-updates/main Translation-en T-2025-07-21-2004.39-F-2022-09-22-1635.40.pdiff [8,550 B] Get:12
http://deb.debian.org/debian
bullseye-updates/main Translation-en T-2025-07-21-2004.39-F-2022-09-22-1635.40.pdiff [8,550 B] Get:13
http://deb.debian.org/debian
bullseye/main amd64 Packages [8,066 kB] Get:14
http://deb.debian.org/debian
bullseye/main Translation-en [6,235 kB] Get:15
http://deb.debian.org/debian
bullseye-updates/main amd64 Packages [18.8 kB] Get:16
http://deb.debian.org/debian
bullseye-updates/main Sources [7,908 B] Get:17
http://deb.debian.org/debian
bullseye-updates/main Translation-en [10.5 kB] Fetched 24.2 MB in 2s (10.4 MB/s) Reading package lists... + apt-get install -y --no-install-recommends aptitude ca-certificates gnupg2 wget Reading package lists... Building dependency tree... Reading state information... The following additional packages will be installed: aptitude-common dirmngr gnupg gnupg-l10n gnupg-utils gpg gpg-agent gpg-wks-client gpg-wks-server gpgconf gpgsm gpgv libassuan0 libboost-iostreams1.74.0 libcwidget4 libksba8 libnpth0 libsigc++-2.0-0v5 libxapian30 pinentry-curses Suggested packages: apt-xapian-index aptitude-doc-en | aptitude-doc debtags dbus-user-session pinentry-gnome3 tor parcimonie xloadimage scdaemon libcwidget-dev xapian-tools pinentry-doc Recommended packages: libdpkg-perl The following NEW packages will be installed: aptitude aptitude-common dirmngr gnupg gnupg-l10n gnupg-utils gnupg2 gpg gpg-agent gpg-wks-client gpg-wks-server gpgconf gpgsm libassuan0 libboost-iostreams1.74.0 libcwidget4 libksba8 libnpth0 libsigc++-2.0-0v5 libxapian30 pinentry-curses The following packages will be upgraded: ca-certificates gpgv wget 3 upgraded, 21 newly installed, 0 to remove and 148 not upgraded. Need to get 14.7 MB of archives. After this operation, 37.0 MB of additional disk space will be used. Get:1
http://deb.debian.org/debian
bullseye/main amd64 aptitude-common all 0.8.13-3 [1,776 kB] Get:2
http://security.debian.org/debian-security
bullseye-security/main amd64 gpgv amd64 2.2.27-2+deb11u3 [626 kB] Err:3
http://security.debian.org/debian-security
bullseye-security/main amd64 ca-certificates all 20250419~deb12u1~deb11u1 404 Not Found [IP: 146.75.122.132 80] Get:4
http://deb.debian.org/debian
bullseye/main amd64 libboost-iostreams1.74.0 amd64 1.74.0-9 [264 kB] Get:5
http://security.debian.org/debian-security
bullseye-security/main amd64 wget amd64 1.21-1+deb11u2 [964 kB] Get:6
http://deb.debian.org/debian
bullseye/main amd64 libsigc++-2.0-0v5 amd64 2.10.4-2 [31.3 kB] Get:7
http://deb.debian.org/debian
bullseye/main amd64 libcwidget4 amd64 0.5.18-5 [315 kB] Get:8
http://deb.debian.org/debian
bullseye/main amd64 libxapian30 amd64 1.4.18-3+deb11u1 [1,089 kB] Get:9
http://security.debian.org/debian-security
bullseye-security/main amd64 gpgconf amd64 2.2.27-2+deb11u3 [548 kB] Get:10
http://deb.debian.org/debian
bullseye/main amd64 aptitude amd64 0.8.13-3 [1,349 kB] Get:11
http://security.debian.org/debian-security
bullseye-security/main amd64 dirmngr amd64 2.2.27-2+deb11u3 [763 kB] Get:12
http://deb.debian.org/debian
bullseye/main amd64 libassuan0 amd64 2.5.3-7.1 [50.5 kB] Get:13
http://deb.debian.org/debian
bullseye/main amd64 libksba8 amd64 1.5.0-3+deb11u2 [123 kB] Get:14
http://deb.debian.org/debian
bullseye/main amd64 libnpth0 amd64 1.6-3 [19.0 kB] Get:15
http://deb.debian.org/debian
bullseye/main amd64 pinentry-curses amd64 1.1.0-4 [64.9 kB] Get:16
http://security.debian.org/debian-security
bullseye-security/main amd64 gnupg-l10n all 2.2.27-2+deb11u3 [1,084 kB] Get:17
http://security.debian.org/debian-security
bullseye-security/main amd64 gnupg-utils amd64 2.2.27-2+deb11u3 [905 kB] Get:18
http://security.debian.org/debian-security
bullseye-security/main amd64 gpg amd64 2.2.27-2+deb11u3 [928 kB] Get:19
http://security.debian.org/debian-security
bullseye-security/main amd64 gpg-agent amd64 2.2.27-2+deb11u3 [670 kB] Get:20
http://security.debian.org/debian-security
bullseye-security/main amd64 gpg-wks-client amd64 2.2.27-2+deb11u3 [524 kB] Get:21
http://security.debian.org/debian-security
bullseye-security/main amd64 gpg-wks-server amd64 2.2.27-2+deb11u3 [516 kB] Get:22
http://security.debian.org/debian-security
bullseye-security/main amd64 gpgsm amd64 2.2.27-2+deb11u3 [645 kB] Get:23
http://security.debian.org/debian-security
bullseye-security/main amd64 gnupg all 2.2.27-2+deb11u3 [825 kB] Get:24
http://security.debian.org/debian-security
bullseye-security/main amd64 gnupg2 all 2.2.27-2+deb11u3 [435 kB] Fetched 14.5 MB in 0s (71.6 MB/s) E: Failed to fetch
http://security.debian.org/debian-security/pool/updates/main/c/ca-certifica…
404 Not Found [IP: 146.75.122.132 80] E: Unable to fetch some archives, maybe run apt-get update or try with --fix-missing? + clean_up_trap + [ -n ] + set +x ### Clean up ### + trap - EXIT INT TERM 0 + clean_up + [ -n ] + [ -e _repo_install_test_data/qemu.pid ] + cat _repo_install_test_data/qemu.pid + kill 2024978 + rm -f _repo_install_test_data/temp.qcow2 Build step 'Execute shell' marked build as failure
1
3
0
0
Build failed in Jenkins: Osmocom_OBS_master #156436
by jenkins@lists.osmocom.org
06 Sep '26
06 Sep '26
See <
https://jenkins.osmocom.org/jenkins/job/Osmocom_OBS_master/156436/display/r…
> Changes: ------------------------------------------ Started by upstream project "master-osmo-sgsn" build number 58459 originally caused by: Started by timer Running as SYSTEM Building remotely on build4-deb12build-ansible (ttcn3 obs osmo-gsm-tester-build qemu io_uring linux-shallow-clone osmocom-gerrit coverity osmocom-master) in workspace <
https://jenkins.osmocom.org/jenkins/job/Osmocom_OBS_master/ws/
> The recommended git tool is: NONE No credentials specified Wiping out workspace first. Cloning the remote Git repository Cloning repository
https://gerrit.osmocom.org/osmo-ci
> git init <
https://jenkins.osmocom.org/jenkins/job/Osmocom_OBS_master/ws/
> # timeout=10 Fetching upstream changes from
https://gerrit.osmocom.org/osmo-ci
> git --version # timeout=10 > git --version # 'git version 2.39.5' > git fetch --tags --force --progress --
https://gerrit.osmocom.org/osmo-ci
+refs/heads/*:refs/remotes/origin/* # timeout=10 > git config remote.origin.url
https://gerrit.osmocom.org/osmo-ci
# timeout=10 > git config --add remote.origin.fetch +refs/heads/*:refs/remotes/origin/* # timeout=10 Avoid second fetch > git rev-parse origin/master^{commit} # timeout=10 Checking out Revision 3a5e9d0f214488f71de5266f346287d8c1b708e4 (origin/master) > git config core.sparsecheckout # timeout=10 > git checkout -f 3a5e9d0f214488f71de5266f346287d8c1b708e4 # timeout=10 Commit message: "jobs/ttcn3-testsuites-testenv: add eim" > git rev-list --no-walk 3a5e9d0f214488f71de5266f346287d8c1b708e4 # timeout=10 [Osmocom_OBS_master] $ /bin/sh -xe /tmp/jenkins17475890452550387361.sh + export PYTHONUNBUFFERED=1 + ./scripts/obs/update_obs_project.py --apiurl
https://obs.osmocom.org
--conflict-version --docker --feed master --meta osmocom:master docker: building image debian-13-osmocom-obs-build-srcpkg + run_in_docker_and_exit(): ['docker', 'build', '--build-arg', 'DISTRO=debian:13', '--build-arg', 'DISTRO_FROM=debian:trixie', '--build-arg', 'UID=1000', '-t', 'debian-13-osmocom-obs-build-srcpkg', '-f', '<
https://jenkins.osmocom.org/jenkins/job/Osmocom_OBS_master/ws/scripts/obs/d…
',> '<
https://jenkins.osmocom.org/jenkins/job/Osmocom_OBS_master/ws/scripts/obs/d…
']> #0 building with "default" instance using docker driver #1 [internal] load build definition from build_srcpkg.Dockerfile #1 transferring dockerfile: 1.48kB done #1 WARN: InvalidDefaultArgInFrom: Default value for ARG ${DISTRO_FROM} results in empty or invalid base image name (line 3) #1 DONE 0.0s #2 [internal] load metadata for docker.io/library/debian:trixie #2 DONE 0.0s #3 [internal] load .dockerignore #3 transferring context: 2B done #3 DONE 0.0s #4 [1/4] FROM docker.io/library/debian:trixie #4 DONE 0.0s #5 [2/4] RUN APT-GET update && apt-get upgrade -y && apt-get install -y --no-install-recommends ca-certificates colordiff debhelper default-libmysqlclient-dev dh-cmake dh-python dh-runit dh-virtualenv dpkg-dev erlang-nox fakeroot git git-review gnupg2 libxml2-utils lsb-release meson osc pkgconf python3-packaging python3-pip python3-setuptools quilt sed sphinx-common wget && apt-get clean #5 CACHED #6 [3/4] RUN WGET
https://github.com/erlang/rebar3/releases/download/3.24.0/rebar3
-O /usr/bin/rebar3 && echo "d2d31cfb98904b8e4917300a75f870de12cb5167cd6214d1043e973a56668a54 /usr/bin/rebar3" | sha256sum -c && chmod +x /usr/bin/rebar3 && rebar3 --version #6 CACHED #7 [4/4] RUN USERADD --uid=1000 -m user #7 CACHED #8 exporting to image #8 exporting layers done #8 writing image sha256:9939d922165980127b8c2b86684488eecbea95eea4e9c7652446dda0d74ca96c 0.0s done #8 naming to docker.io/library/debian-13-osmocom-obs-build-srcpkg #8 naming to docker.io/library/debian-13-osmocom-obs-build-srcpkg 0.0s done #8 DONE 0.0s [33m1 warning found (use docker --debug to expand): [0m - InvalidDefaultArgInFrom: Default value for ARG ${DISTRO_FROM} results in empty or invalid base image name (line 3) docker: running: update_obs_project.py inside docker /obs/lib/debian.py:183: SyntaxWarning: invalid escape sequence '\/' lib.run_cmd(["sed", "-i", "s/$(MAKE) -C doc\/manuals//g", f"{debian}/rules"]) OBS: getting packages in osmocom:master ERROR: command failed unexpectedly *** command *** ['osc', '-A', '
https://obs.osmocom.org
', 'list', 'osmocom:master'] *** returncode *** 1 *** output *** fatal: not a git repository (or any of the parent directories): .git Server returned an error: HTTP Error 408: Request Timeout *** python trace *** Traceback (most recent call last): File "/obs/update_obs_project.py", line 265, in <module> main() ~~~~^^ File "/obs/update_obs_project.py", line 257, in main pkgs_remote = lib.osc.get_remote_pkgs() File "/obs/lib/osc.py", line 63, in get_remote_pkgs ret = run_osc(["list", proj]) File "/obs/lib/osc.py", line 58, in run_osc return lib.run_cmd(cmd, *args, **kwargs) ~~~~~~~~~~~^^^^^^^^^^^^^^^^^^^^^^ File "/obs/lib/__init__.py", line 202, in run_cmd exit_error_cmd(p, "command failed unexpectedly") ~~~~~~~~~~~~~~^^^^^^^^^^^^^^^^^^^^^^^^^^^^^^^^^^ File "/obs/lib/__init__.py", line 163, in exit_error_cmd raise RuntimeError("shell command related error, find details right above" " this python trace") RuntimeError: shell command related error, find details right above this python trace Build step 'Execute shell' marked build as failure
1
1
0
0
Build failed in Jenkins: ttcn3-bts-test-io_uring #847
by jenkins@lists.osmocom.org
06 Sep '26
06 Sep '26
See <
https://jenkins.osmocom.org/jenkins/job/ttcn3-bts-test-io_uring/847/display…
> Changes: ------------------------------------------ [...truncated 12.58 MiB...] <testcase classname='BTS_Tests:hopping' name='TC_rll_unit_data_req_DCCH' time='2.137096'/> <testcase classname='BTS_Tests:hopping' name='TC_rll_unit_data_req_ACCH' time='4.862558'/> <testcase classname='BTS_Tests:hopping' name='TC_rll_unit_data_ind_DCCH' time='2.958486'/> <testcase classname='BTS_Tests:hopping' name='TC_rll_unit_data_ind_ACCH' time='10.529464'/> <testcase classname='BTS_Tests:hopping' name='TC_chan_act_a51' time='2.652258'/> <testcase classname='BTS_Tests:hopping' name='TC_chan_act_a52' time='2.737797'/> <testcase classname='BTS_Tests:hopping' name='TC_chan_act_a53' time='2.751223'/> <testcase classname='BTS_Tests:hopping' name='TC_chan_act_a54' time='3.583296'/> <testcase classname='BTS_Tests:hopping' name='TC_encr_cmd_a51' time='5.075870'/> <testcase classname='BTS_Tests:hopping' name='TC_encr_cmd_a52' time='5.299131'/> <testcase classname='BTS_Tests:hopping' name='TC_encr_cmd_a53' time='5.142851'/> <testcase classname='BTS_Tests:hopping' name='TC_encr_cmd_a54' time='5.282632'/> <testcase classname='BTS_Tests:hopping' name='TC_err_rep_wrong_mdisc' time='1.219429'/> <testcase classname='BTS_Tests:hopping' name='TC_err_rep_wrong_msg_type' time='1.255050'/> <testcase classname='BTS_Tests:hopping' name='TC_err_rep_wrong_sequence' time='1.217939'/> <testcase classname='BTS_Tests:hopping' name='TC_lapdm_selftest' time='0.001939'/> <testcase classname='BTS_Tests:hopping' name='TC_tch_sign_l2_fill_frame' time='18.968800'/> <testcase classname='BTS_Tests:hopping' name='TC_tch_sign_l2_fill_frame_dtxd' time='6.549145'> <failure type='fail-verdict'>Received DTX TCH fill frame with bad frame number: 175 (mod 104: 71) (mod 26: 19) BTS_Tests.ttcn:9579 BTS_Tests control part BTS_Tests.ttcn:8110 TC_tch_sign_l2_fill_frame_dtxd testcase </failure> </testcase> <testcase classname='BTS_Tests:hopping' name='TC_chopped_ipa_ping' time='24.721963'/> <testcase classname='BTS_Tests:hopping' name='TC_chopped_ipa_payload' time='42.590520'/> <testcase classname='BTS_Tests:hopping' name='TC_ms_pwr_ctrl_constant' time='16.462185'/> <testcase classname='BTS_Tests:hopping' name='TC_ms_pwr_ctrl_pf_ewma' time='31.862823'/> <testcase classname='BTS_Tests:hopping' name='TC_speech_no_rtp_tchf' time='7.243355'/> <testcase classname='BTS_Tests:hopping' name='TC_speech_no_rtp_tchh' time='5.462037'/> <testcase classname='BTS_Tests:hopping' name='TC_speech_rtp_tchf' time='7.586540'/> <testcase classname='BTS_Tests:hopping' name='TC_speech_rtp_tchh' time='5.447588'/> <testcase classname='BTS_Tests:hopping' name='TC_speech_osmux_tchf' time='3.402067'/> <testcase classname='BTS_Tests:hopping' name='TC_speech_osmux_tchh' time='3.490049'/> <testcase classname='BTS_Tests:hopping' name='TC_data_rtp_tchf144' time='5.708088'> <failure type='fail-verdict'>Timeout waiting for matching Downlink data frame BTS_Tests.ttcn:9594 BTS_Tests control part BTS_Tests.ttcn:8781 TC_data_rtp_tchf144 testcase </failure> </testcase> <testcase classname='BTS_Tests:hopping' name='TC_data_rtp_tchf96' time='2.081161'/> <testcase classname='BTS_Tests:hopping' name='TC_data_rtp_tchf48' time='2.189588'/> <testcase classname='BTS_Tests:hopping' name='TC_data_rtp_tchh48' time='5.286833'> <failure type='fail-verdict'>Timeout waiting for matching Downlink data frame BTS_Tests.ttcn:9597 BTS_Tests control part BTS_Tests.ttcn:8880 TC_data_rtp_tchh48 testcase </failure> </testcase> <testcase classname='BTS_Tests:hopping' name='TC_data_rtp_tchf24' time='1.699529'/> <testcase classname='BTS_Tests:hopping' name='TC_data_rtp_tchh24' time='5.346339'> <failure type='fail-verdict'>Timeout waiting for matching Downlink data frame BTS_Tests.ttcn:9599 BTS_Tests control part BTS_Tests.ttcn:8949 TC_data_rtp_tchh24 testcase </failure> </testcase> <testcase classname='BTS_Tests:hopping' name='TC_data_facch_tchf144' time='2.011798'/> <testcase classname='BTS_Tests:hopping' name='TC_data_facch_tchf96' time='1.968112'/> <testcase classname='BTS_Tests:hopping' name='TC_data_facch_tchf48' time='1.958818'/> <testcase classname='BTS_Tests:hopping' name='TC_data_facch_tchh48' time='4.993575'/> <testcase classname='BTS_Tests:hopping' name='TC_data_facch_tchf24' time='2.042464'/> <testcase classname='BTS_Tests:hopping' name='TC_data_facch_tchh24' time='2.260499'/> <testcase classname='BTS_Tests:hopping' name='TC_early_immediate_assignment' time='3.564887'/> <testcase classname='BTS_Tests:hopping' name='TC_acch_overpower_rxqual_thresh' time='9.122230'> <failure type='fail-verdict'>Timeout waiting for L1CTL DATA.ind BTS_Tests.ttcn:9610 BTS_Tests control part BTS_Tests.ttcn:9244 TC_acch_overpower_rxqual_thresh testcase </failure> </testcase> <testcase classname='BTS_Tests:hopping' name='TC_acch_overpower_rxqual_thresh_dtx' time='9.043781'> <failure type='fail-verdict'>Timeout waiting for L1CTL DATA.ind BTS_Tests.ttcn:9611 BTS_Tests control part BTS_Tests.ttcn:9285 TC_acch_overpower_rxqual_thresh_dtx testcase </failure> </testcase> <testcase classname='BTS_Tests:hopping' name='TC_acch_overpower_always_on_facch' time='9.054946'> <failure type='fail-verdict'>Timeout waiting for L1CTL DATA.ind BTS_Tests.ttcn:9612 BTS_Tests control part BTS_Tests.ttcn:9317 TC_acch_overpower_always_on_facch testcase </failure> </testcase> <testcase classname='BTS_Tests:hopping' name='TC_acch_overpower_always_on_sacch' time='9.049748'> <failure type='fail-verdict'>Timeout waiting for L1CTL DATA.ind BTS_Tests.ttcn:9613 BTS_Tests control part BTS_Tests.ttcn:9349 TC_acch_overpower_always_on_sacch testcase </failure> </testcase> <testcase classname='BTS_Tests:hopping' name='TC_acch_overpower_limit' time='8.892584'> <failure type='fail-verdict'>Timeout waiting for L1CTL DATA.ind BTS_Tests.ttcn:9614 BTS_Tests control part BTS_Tests.ttcn:9380 TC_acch_overpower_limit testcase </failure> </testcase> <testcase classname='BTS_Tests_SMSCB:hopping' name='TC_cbch_load_idle_no_cbch' time='11.161859'/> <testcase classname='BTS_Tests_SMSCB:hopping' name='TC_sms_cb_cmd_sdcch4_1block' time='14.286414'/> <testcase classname='BTS_Tests_SMSCB:hopping' name='TC_sms_cb_cmd_sdcch4_2block' time='14.237211'/> <testcase classname='BTS_Tests_SMSCB:hopping' name='TC_sms_cb_cmd_sdcch4_3block' time='14.231942'/> <testcase classname='BTS_Tests_SMSCB:hopping' name='TC_sms_cb_cmd_sdcch4_4block' time='14.240504'/> <testcase classname='BTS_Tests_SMSCB:hopping' name='TC_sms_cb_cmd_sdcch4_multi' time='20.221730'/> <testcase classname='BTS_Tests_SMSCB:hopping' name='TC_sms_cb_cmd_sdcch4_schedule' time='14.183731'/> <testcase classname='BTS_Tests_SMSCB:hopping' name='TC_sms_cb_cmd_sdcch4_default_only' time='16.214315'/> <testcase classname='BTS_Tests_SMSCB:hopping' name='TC_sms_cb_cmd_sdcch4_default_and_normal' time='17.173790'/> <testcase classname='BTS_Tests_SMSCB:hopping' name='TC_sms_cb_cmd_sdcch4_default_then_null' time='26.184989'/> <testcase classname='BTS_Tests_SMSCB:hopping' name='TC_cbc_sdcch4_load_idle' time='16.074420'/> <testcase classname='BTS_Tests_SMSCB:hopping' name='TC_cbc_sdcch4_load_overload' time='18.138932'/> <testcase classname='BTS_Tests_SMSCB:hopping' name='TC_sms_cb_cmd_sdcch8_1block' time='14.225396'/> <testcase classname='BTS_Tests_SMSCB:hopping' name='TC_sms_cb_cmd_sdcch8_2block' time='14.219648'/> <testcase classname='BTS_Tests_SMSCB:hopping' name='TC_sms_cb_cmd_sdcch8_3block' time='14.233456'/> <testcase classname='BTS_Tests_SMSCB:hopping' name='TC_sms_cb_cmd_sdcch8_4block' time='14.222577'/> <testcase classname='BTS_Tests_SMSCB:hopping' name='TC_sms_cb_cmd_sdcch8_multi' time='20.296548'/> <testcase classname='BTS_Tests_SMSCB:hopping' name='TC_sms_cb_cmd_sdcch8_schedule' time='14.162612'/> <testcase classname='BTS_Tests_SMSCB:hopping' name='TC_sms_cb_cmd_sdcch8_default_only' time='16.226698'/> <testcase classname='BTS_Tests_SMSCB:hopping' name='TC_sms_cb_cmd_sdcch8_default_and_normal' time='17.189145'/> <testcase classname='BTS_Tests_SMSCB:hopping' name='TC_cbc_sdcch8_load_idle' time='16.202532'/> <testcase classname='BTS_Tests_SMSCB:hopping' name='TC_cbc_sdcch8_load_overload' time='18.201792'/> <testcase classname='BTS_Tests_SMSCB:hopping' name='TC_etws_p1ro' time='12.182404'/> <testcase classname='BTS_Tests_SMSCB:hopping' name='TC_etws_p1ro_end' time='16.159123'/> <testcase classname='BTS_Tests_SMSCB:hopping' name='TC_etws_pcu' time='1.114093'/> <testcase classname='BTS_Tests_LAPDm:hopping' name='TC_sabm_ua_dcch_sapi0' time='2.892140'/> <testcase classname='BTS_Tests_LAPDm:hopping' name='TC_sabm_ua_dcch_sapi0_nopayload' time='21.497267'/> <testcase classname='BTS_Tests_LAPDm:hopping' name='TC_sabm_ua_dcch_sapi3' time='21.304909'/> <testcase classname='BTS_Tests_LAPDm:hopping' name='TC_sabm_ua_dcch_sapi4' time='21.352081'/> <testcase classname='BTS_Tests_LAPDm:hopping' name='TC_sabm_contention' time='21.256699'/> <testcase classname='BTS_Tests_LAPDm:hopping' name='TC_sabm_retransmit' time='3.159034'/> <testcase classname='BTS_Tests_LAPDm:hopping' name='TC_sabm_retransmit_bts' time='81.445686'/> <testcase classname='BTS_Tests_LAPDm:hopping' name='TC_sabm_invalid_resp' time='23.357491'/> <testcase classname='BTS_Tests_LAPDm:hopping' name='TC_sabm_dm' time='14.020441'/> <testcase classname='BTS_Tests_LAPDm:hopping' name='TC_establish_ign_first_sabm' time='8.208077'/> <testcase classname='BTS_Tests_LAPDm:hopping' name='TC_iframe_seq_and_ack' time='29.591761'> <failure type='fail-verdict'>Received RSL ERROR IND { msg_disc := { msg_group := RSL_MDISC_RLL (1), transparent := false }, msg_type := RSL_MT_ERROR_IND (3), ies := { { iei := RSL_IE_CHAN_NR (1), body := { chan_nr := { u := { sdcch8 := { tag := '01'B, sub_chan := 4 } }, tn := 6 } } }, { iei := RSL_IE_LINK_IDENT (2), body := { link_id := { c := FACCH_SDCCH (0), na := false, prio := SAPI0_PRIO_NORMAL (0), sapi := 0 } } }, { iei := RSL_IE_RLM_CAUSE (22), body := { rlm_cause := { len := 1, payload := '01'O } } } } } BTS_Tests_LAPDm.ttcn:1484 BTS_Tests_LAPDm control part BTS_Tests_LAPDm.ttcn:579 TC_iframe_seq_and_ack testcase </failure> </testcase> <testcase classname='BTS_Tests_LAPDm:hopping' name='TC_iframe_timer_recovery' time='24.623417'> <failure type='fail-verdict'>Received RSL ERROR IND { msg_disc := { msg_group := RSL_MDISC_RLL (1), transparent := false }, msg_type := RSL_MT_ERROR_IND (3), ies := { { iei := RSL_IE_CHAN_NR (1), body := { chan_nr := { u := { sdcch8 := { tag := '01'B, sub_chan := 4 } }, tn := 6 } } }, { iei := RSL_IE_LINK_IDENT (2), body := { link_id := { c := FACCH_SDCCH (0), na := false, prio := SAPI0_PRIO_NORMAL (0), sapi := 0 } } }, { iei := RSL_IE_RLM_CAUSE (22), body := { rlm_cause := { len := 1, payload := '01'O } } } } } BTS_Tests_LAPDm.ttcn:1485 BTS_Tests_LAPDm control part BTS_Tests_LAPDm.ttcn:685 TC_iframe_timer_recovery testcase </failure> </testcase> <testcase classname='BTS_Tests_LAPDm:hopping' name='TC_ns_seq_error' time='29.621621'> <failure type='fail-verdict'>"BTS_Tests.ttcn:732 : Tguard timeout" BTS_Tests_LAPDm.ttcn:1486 BTS_Tests_LAPDm control part BTS_Tests_LAPDm.ttcn:768 TC_ns_seq_error testcase </failure> </testcase> <testcase classname='BTS_Tests_LAPDm:hopping' name='TC_nr_seq_error' time='2.878890'/> <testcase classname='BTS_Tests_LAPDm:hopping' name='TC_rec_invalid_frame' time='119.140150'> <failure type='fail-verdict'>"BTS_Tests_LAPDm.ttcn:909 : Missing LAPDm_RR RSP" BTS_Tests_LAPDm.ttcn:1488 BTS_Tests_LAPDm control part BTS_Tests_LAPDm.ttcn:961 TC_rec_invalid_frame testcase </failure> </testcase> <testcase classname='BTS_Tests_LAPDm:hopping' name='TC_segm_concat_dcch' time='13.507767'> <failure type='fail-verdict'>"BTS_Tests_LAPDm.ttcn:1023 : received unexpected LAPDm { sacch := false, sapi := 0, lapdm := { ab := { addr := { spare := '0'B, lpd := 0, sapi := 0, c_r := false, ea := true }, ctrl := { s := { n_r := 1, p_f := false, s := '10'B, spare := '01'B } }, len := 0, m := false, el := 1, payload := ''O, padding := '2B2B2B2B2B2B2B2B2B2B2B2B2B2B2B2B2B2B2B2B'O (\"++++++++++++++++++++\") } } }" BTS_Tests_LAPDm.ttcn:1489 BTS_Tests_LAPDm control part BTS_Tests_LAPDm.ttcn:1088 TC_segm_concat_dcch testcase </failure> </testcase> <testcase classname='BTS_Tests_LAPDm:hopping' name='TC_segm_concat_sacch' time='48.556569'> <failure type='fail-verdict'>"BTS_Tests_LAPDm.ttcn:1023 : received unexpected LAPDm { sacch := true, sapi := 0, lapdm := { ab := { addr := { spare := '0'B, lpd := 0, sapi := 0, c_r := false, ea := true }, ctrl := { u := { u := '011'B, p_f := true, u2 := '00'B, spare := '11'B } }, len := 0, m := false, el := 1, payload := ''O, padding := '2B2B2B2B2B2B2B2B2B2B2B2B2B2B2B2B2B2B'O (\"++++++++++++++++++\") } } }" BTS_Tests_LAPDm.ttcn:1490 BTS_Tests_LAPDm control part BTS_Tests_LAPDm.ttcn:1093 TC_segm_concat_sacch testcase </failure> </testcase> <testcase classname='BTS_Tests_LAPDm:hopping' name='TC_t200_n200' time='39.835909'> <failure type='fail-verdict'>Missing RSL RLL ERROR INDICATION BTS_Tests_LAPDm.ttcn:1491 BTS_Tests_LAPDm control part BTS_Tests_LAPDm.ttcn:1182 TC_t200_n200 testcase </failure> </testcase> <testcase classname='BTS_Tests_LAPDm:hopping' name='TC_rr_response_frame_loss' time='6.682834'> <failure type='fail-verdict'>Timeout waiting for RR or REJ BTS_Tests_LAPDm.ttcn:1492 BTS_Tests_LAPDm control part BTS_Tests_LAPDm.ttcn:1239 TC_rr_response_frame_loss testcase </failure> </testcase> <testcase classname='BTS_Tests_LAPDm:hopping' name='TC_incorrect_cr' time='15.780757'/> <testcase classname='BTS_Tests_LAPDm:hopping' name='TC_sabm_incorrect_c' time='23.277534'> <failure type='fail-verdict'>"BTS_Tests.ttcn:732 : Tguard timeout" BTS_Tests_LAPDm.ttcn:1494 BTS_Tests_LAPDm control part BTS_Tests_LAPDm.ttcn:1341 TC_sabm_incorrect_c testcase </failure> </testcase> <testcase classname='BTS_Tests_LAPDm:hopping' name='TC_normal_reestablishment' time='16.085605'> <failure type='fail-verdict'>"BTS_Tests_LAPDm.ttcn:1023 : received unexpected LAPDm { sacch := false, sapi := 0, lapdm := { ab := { addr := { spare := '0'B, lpd := 0, sapi := 0, c_r := false, ea := true }, ctrl := { u := { u := '011'B, p_f := true, u2 := '00'B, spare := '11'B } }, len := 5, m := false, el := 1, payload := '63EC78250C'O, padding := '2B2B2B2B2B2B2B2B2B2B2B2B2B2B2B'O (\"+++++++++++++++\") } } }" BTS_Tests_LAPDm.ttcn:1495 BTS_Tests_LAPDm control part BTS_Tests_LAPDm.ttcn:1403 TC_normal_reestablishment testcase </failure> </testcase> <testcase classname='BTS_Tests_LAPDm:hopping' name='TC_normal_reestablishment_state_unacked' time='12.362057'> <failure type='fail-verdict'>"BTS_Tests_LAPDm.ttcn:1023 : received unexpected LAPDm { sacch := false, sapi := 0, lapdm := { ab := { addr := { spare := '0'B, lpd := 0, sapi := 0, c_r := false, ea := true }, ctrl := { s := { n_r := 1, p_f := false, s := '10'B, spare := '01'B } }, len := 0, m := false, el := 1, payload := ''O, padding := '2B2B2B2B2B2B2B2B2B2B2B2B2B2B2B2B2B2B2B2B'O (\"++++++++++++++++++++\") } } }" BTS_Tests_LAPDm.ttcn:1496 BTS_Tests_LAPDm control part BTS_Tests_LAPDm.ttcn:1470 TC_normal_reestablishment_state_unacked testcase </failure> </testcase> <testcase classname='BTS_Tests_VAMOS:hopping' name='TC_vamos_chan_act_vff' time='2.421712'/> <testcase classname='BTS_Tests_VAMOS:hopping' name='TC_vamos_chan_act_vhh' time='2.597909'/> <testcase classname='BTS_Tests_VAMOS:hopping' name='TC_vamos_chan_act_hvhh' time='2.563563'/> <testcase classname='BTS_Tests_VAMOS:hopping' name='TC_vamos_chan_act_dyn_ipa_vff' time='2.538722'/> <testcase classname='BTS_Tests_VAMOS:hopping' name='TC_vamos_chan_act_dyn_osmo_vff' time='2.535913'/> <testcase classname='BTS_Tests_VAMOS:hopping' name='TC_vamos_chan_act_dyn_osmo_vhh' time='2.607567'/> <testcase classname='BTS_Tests_VAMOS:hopping' name='TC_vamos_chan_act_dyn_osmo_hvhh' time='2.518328'/> <testcase classname='BTS_Tests_VAMOS:hopping' name='TC_vamos_chan_mode_modify_vff' time='1.301436'/> <testcase classname='BTS_Tests_VAMOS:hopping' name='TC_vamos_chan_mode_modify_vhh' time='1.347505'/> <testcase classname='BTS_Tests_VAMOS:hopping' name='TC_vamos_chan_mode_modify_hvhh' time='1.356285'/> <testcase classname='BTS_Tests_VAMOS:hopping' name='TC_vamos_chan_mode_modify_dyn_ipa_vff' time='1.318938'/> <testcase classname='BTS_Tests_VAMOS:hopping' name='TC_vamos_chan_mode_modify_dyn_osmo_vff' time='1.337070'/> <testcase classname='BTS_Tests_VAMOS:hopping' name='TC_vamos_chan_mode_modify_dyn_osmo_vhh' time='1.397271'/> <testcase classname='BTS_Tests_VAMOS:hopping' name='TC_vamos_chan_mode_modify_dyn_osmo_hvhh' time='1.381722'/> <testcase classname='BTS_Tests_ASCI:hopping' name='TC_vbs_notification' time='4.643001'/> <testcase classname='BTS_Tests_ASCI:hopping' name='TC_vgcs_uplink_free_and_busy' time='1.813509'/> <testcase classname='BTS_Tests_ASCI:hopping' name='TC_vgcs_talker_fail' time='17.026227'/> <testcase classname='BTS_Tests_ASCI:hopping' name='TC_vgcs_talker_est_rel' time='1.372257'/> <testcase classname='BTS_Tests_ASCI:hopping' name='TC_vgcs_listener_det' time='3.319690'/> </testsuite> <?xml version="1.0"?> <testsuite name='Titan' tests='17' failures='0' errors='0' skipped='0' inconc='0' time='96.00'> <testcase classname='BTS_Tests_OML' name='TC_wrong_mdisc' time='10.752902'/> <testcase classname='BTS_Tests_OML' name='TC_wrong_msgtype' time='0.685509'/> <testcase classname='BTS_Tests_OML' name='TC_short_length' time='0.685481'/> <testcase classname='BTS_Tests_OML' name='TC_long_length' time='0.758053'/> <testcase classname='BTS_Tests_OML' name='TC_wrong_placement' time='0.745472'/> <testcase classname='BTS_Tests_OML' name='TC_wrong_seq' time='0.733389'/> <testcase classname='BTS_Tests_OML' name='TC_wrong_obj_class' time='0.700126'/> <testcase classname='BTS_Tests_OML' name='TC_wrong_bts_nr' time='0.698662'/> <testcase classname='BTS_Tests_OML' name='TC_wrong_trx_nr' time='0.716569'/> <testcase classname='BTS_Tests_OML' name='TC_radio_carrier_opstart_noattr' time='0.723786'/> <testcase classname='BTS_Tests_OML' name='TC_bts_opstart' time='0.704252'/> <testcase classname='BTS_Tests_OML' name='TC_bts_opstart_noattr' time='0.744955'/> <testcase classname='BTS_Tests_OML' name='TC_ts_opstart' time='0.686142'/> <testcase classname='BTS_Tests_OML' name='TC_ts_opstart_noattr' time='0.677909'/> <testcase classname='BTS_Tests_OML' name='TC_initial_state_reports' time='0.680942'/> <testcase classname='BTS_Tests_OML' name='TC_ipa_osmo_pcu_anr_fwd' time='0.686872'/> <testcase classname='BTS_Tests_OML' name='TC_ipa_rsl_connect_nack' time='0.697006'/> </testsuite> + check_respawn_count + set +x [0;31m ================================================================ WARNING: osmo-bts was respawned 5 times (expected: 3)! (OS#6794) ================================================================ [0m+ RC=1 + uptime + grep --color=always -o load.* [01;31m[Kload average: 0.90, 1.08, 3.26[m[K + exit 1 Build step 'Execute shell' marked build as failure Recording test results [Checks API] No suitable checks publisher found.
1
0
0
0
Build failed in Jenkins: ttcn3-bts-test #3253
by jenkins@lists.osmocom.org
06 Sep '26
06 Sep '26
See <
https://jenkins.osmocom.org/jenkins/job/ttcn3-bts-test/3253/display/redirect
> Changes: ------------------------------------------ [...truncated 12.61 MiB...] <testcase classname='BTS_Tests:hopping' name='TC_rll_unit_data_req_DCCH' time='2.362138'/> <testcase classname='BTS_Tests:hopping' name='TC_rll_unit_data_req_ACCH' time='5.310589'/> <testcase classname='BTS_Tests:hopping' name='TC_rll_unit_data_ind_DCCH' time='2.962768'/> <testcase classname='BTS_Tests:hopping' name='TC_rll_unit_data_ind_ACCH' time='11.507693'/> <testcase classname='BTS_Tests:hopping' name='TC_chan_act_a51' time='2.660208'/> <testcase classname='BTS_Tests:hopping' name='TC_chan_act_a52' time='2.694232'/> <testcase classname='BTS_Tests:hopping' name='TC_chan_act_a53' time='2.722300'/> <testcase classname='BTS_Tests:hopping' name='TC_chan_act_a54' time='2.732358'/> <testcase classname='BTS_Tests:hopping' name='TC_encr_cmd_a51' time='5.233887'/> <testcase classname='BTS_Tests:hopping' name='TC_encr_cmd_a52' time='5.201316'/> <testcase classname='BTS_Tests:hopping' name='TC_encr_cmd_a53' time='5.218450'/> <testcase classname='BTS_Tests:hopping' name='TC_encr_cmd_a54' time='5.233411'/> <testcase classname='BTS_Tests:hopping' name='TC_err_rep_wrong_mdisc' time='1.243760'/> <testcase classname='BTS_Tests:hopping' name='TC_err_rep_wrong_msg_type' time='1.294122'/> <testcase classname='BTS_Tests:hopping' name='TC_err_rep_wrong_sequence' time='1.253848'/> <testcase classname='BTS_Tests:hopping' name='TC_lapdm_selftest' time='0.005677'/> <testcase classname='BTS_Tests:hopping' name='TC_tch_sign_l2_fill_frame' time='18.482168'/> <testcase classname='BTS_Tests:hopping' name='TC_tch_sign_l2_fill_frame_dtxd' time='2.123890'> <failure type='fail-verdict'>Received DTX TCH fill frame with bad frame number: 175 (mod 104: 71) (mod 26: 19) BTS_Tests.ttcn:9579 BTS_Tests control part BTS_Tests.ttcn:8110 TC_tch_sign_l2_fill_frame_dtxd testcase </failure> </testcase> <testcase classname='BTS_Tests:hopping' name='TC_chopped_ipa_ping' time='24.729338'/> <testcase classname='BTS_Tests:hopping' name='TC_chopped_ipa_payload' time='42.624546'/> <testcase classname='BTS_Tests:hopping' name='TC_ms_pwr_ctrl_constant' time='16.921291'/> <testcase classname='BTS_Tests:hopping' name='TC_ms_pwr_ctrl_pf_ewma' time='31.538792'/> <testcase classname='BTS_Tests:hopping' name='TC_speech_no_rtp_tchf' time='7.399658'/> <testcase classname='BTS_Tests:hopping' name='TC_speech_no_rtp_tchh' time='5.435021'/> <testcase classname='BTS_Tests:hopping' name='TC_speech_rtp_tchf' time='7.646737'/> <testcase classname='BTS_Tests:hopping' name='TC_speech_rtp_tchh' time='5.564752'/> <testcase classname='BTS_Tests:hopping' name='TC_speech_osmux_tchf' time='3.441128'/> <testcase classname='BTS_Tests:hopping' name='TC_speech_osmux_tchh' time='3.513000'/> <testcase classname='BTS_Tests:hopping' name='TC_data_rtp_tchf144' time='2.191179'/> <testcase classname='BTS_Tests:hopping' name='TC_data_rtp_tchf96' time='2.100743'/> <testcase classname='BTS_Tests:hopping' name='TC_data_rtp_tchf48' time='2.209684'/> <testcase classname='BTS_Tests:hopping' name='TC_data_rtp_tchh48' time='5.241434'> <failure type='fail-verdict'>Timeout waiting for matching Downlink data frame BTS_Tests.ttcn:9597 BTS_Tests control part BTS_Tests.ttcn:8880 TC_data_rtp_tchh48 testcase </failure> </testcase> <testcase classname='BTS_Tests:hopping' name='TC_data_rtp_tchf24' time='1.791748'/> <testcase classname='BTS_Tests:hopping' name='TC_data_rtp_tchh24' time='5.291150'> <failure type='fail-verdict'>Timeout waiting for matching Downlink data frame BTS_Tests.ttcn:9599 BTS_Tests control part BTS_Tests.ttcn:8949 TC_data_rtp_tchh24 testcase </failure> </testcase> <testcase classname='BTS_Tests:hopping' name='TC_data_facch_tchf144' time='1.944481'/> <testcase classname='BTS_Tests:hopping' name='TC_data_facch_tchf96' time='2.037149'/> <testcase classname='BTS_Tests:hopping' name='TC_data_facch_tchf48' time='2.032078'/> <testcase classname='BTS_Tests:hopping' name='TC_data_facch_tchh48' time='2.154447'/> <testcase classname='BTS_Tests:hopping' name='TC_data_facch_tchf24' time='2.032406'/> <testcase classname='BTS_Tests:hopping' name='TC_data_facch_tchh24' time='2.176167'/> <testcase classname='BTS_Tests:hopping' name='TC_early_immediate_assignment' time='3.555515'/> <testcase classname='BTS_Tests:hopping' name='TC_acch_overpower_rxqual_thresh' time='9.086187'> <failure type='fail-verdict'>Timeout waiting for L1CTL DATA.ind BTS_Tests.ttcn:9610 BTS_Tests control part BTS_Tests.ttcn:9244 TC_acch_overpower_rxqual_thresh testcase </failure> </testcase> <testcase classname='BTS_Tests:hopping' name='TC_acch_overpower_rxqual_thresh_dtx' time='9.041500'> <failure type='fail-verdict'>Timeout waiting for L1CTL DATA.ind BTS_Tests.ttcn:9611 BTS_Tests control part BTS_Tests.ttcn:9285 TC_acch_overpower_rxqual_thresh_dtx testcase </failure> </testcase> <testcase classname='BTS_Tests:hopping' name='TC_acch_overpower_always_on_facch' time='9.035845'> <failure type='fail-verdict'>Timeout waiting for L1CTL DATA.ind BTS_Tests.ttcn:9612 BTS_Tests control part BTS_Tests.ttcn:9317 TC_acch_overpower_always_on_facch testcase </failure> </testcase> <testcase classname='BTS_Tests:hopping' name='TC_acch_overpower_always_on_sacch' time='9.067327'> <failure type='fail-verdict'>Timeout waiting for L1CTL DATA.ind BTS_Tests.ttcn:9613 BTS_Tests control part BTS_Tests.ttcn:9349 TC_acch_overpower_always_on_sacch testcase </failure> </testcase> <testcase classname='BTS_Tests:hopping' name='TC_acch_overpower_limit' time='9.036235'> <failure type='fail-verdict'>Timeout waiting for L1CTL DATA.ind BTS_Tests.ttcn:9614 BTS_Tests control part BTS_Tests.ttcn:9380 TC_acch_overpower_limit testcase </failure> </testcase> <testcase classname='BTS_Tests_SMSCB:hopping' name='TC_cbch_load_idle_no_cbch' time='11.162509'/> <testcase classname='BTS_Tests_SMSCB:hopping' name='TC_sms_cb_cmd_sdcch4_1block' time='14.242780'/> <testcase classname='BTS_Tests_SMSCB:hopping' name='TC_sms_cb_cmd_sdcch4_2block' time='14.197098'/> <testcase classname='BTS_Tests_SMSCB:hopping' name='TC_sms_cb_cmd_sdcch4_3block' time='14.231047'/> <testcase classname='BTS_Tests_SMSCB:hopping' name='TC_sms_cb_cmd_sdcch4_4block' time='14.214239'/> <testcase classname='BTS_Tests_SMSCB:hopping' name='TC_sms_cb_cmd_sdcch4_multi' time='20.219069'/> <testcase classname='BTS_Tests_SMSCB:hopping' name='TC_sms_cb_cmd_sdcch4_schedule' time='14.176361'/> <testcase classname='BTS_Tests_SMSCB:hopping' name='TC_sms_cb_cmd_sdcch4_default_only' time='16.236399'/> <testcase classname='BTS_Tests_SMSCB:hopping' name='TC_sms_cb_cmd_sdcch4_default_and_normal' time='17.201927'/> <testcase classname='BTS_Tests_SMSCB:hopping' name='TC_sms_cb_cmd_sdcch4_default_then_null' time='26.240165'/> <testcase classname='BTS_Tests_SMSCB:hopping' name='TC_cbc_sdcch4_load_idle' time='16.082399'/> <testcase classname='BTS_Tests_SMSCB:hopping' name='TC_cbc_sdcch4_load_overload' time='18.265347'/> <testcase classname='BTS_Tests_SMSCB:hopping' name='TC_sms_cb_cmd_sdcch8_1block' time='14.234067'/> <testcase classname='BTS_Tests_SMSCB:hopping' name='TC_sms_cb_cmd_sdcch8_2block' time='14.239223'/> <testcase classname='BTS_Tests_SMSCB:hopping' name='TC_sms_cb_cmd_sdcch8_3block' time='14.250513'/> <testcase classname='BTS_Tests_SMSCB:hopping' name='TC_sms_cb_cmd_sdcch8_4block' time='14.250632'/> <testcase classname='BTS_Tests_SMSCB:hopping' name='TC_sms_cb_cmd_sdcch8_multi' time='20.249281'/> <testcase classname='BTS_Tests_SMSCB:hopping' name='TC_sms_cb_cmd_sdcch8_schedule' time='14.181159'/> <testcase classname='BTS_Tests_SMSCB:hopping' name='TC_sms_cb_cmd_sdcch8_default_only' time='16.331881'/> <testcase classname='BTS_Tests_SMSCB:hopping' name='TC_sms_cb_cmd_sdcch8_default_and_normal' time='17.168484'/> <testcase classname='BTS_Tests_SMSCB:hopping' name='TC_cbc_sdcch8_load_idle' time='16.139705'/> <testcase classname='BTS_Tests_SMSCB:hopping' name='TC_cbc_sdcch8_load_overload' time='18.184435'/> <testcase classname='BTS_Tests_SMSCB:hopping' name='TC_etws_p1ro' time='12.170730'/> <testcase classname='BTS_Tests_SMSCB:hopping' name='TC_etws_p1ro_end' time='16.151972'/> <testcase classname='BTS_Tests_SMSCB:hopping' name='TC_etws_pcu' time='1.119104'/> <testcase classname='BTS_Tests_LAPDm:hopping' name='TC_sabm_ua_dcch_sapi0' time='2.899001'/> <testcase classname='BTS_Tests_LAPDm:hopping' name='TC_sabm_ua_dcch_sapi0_nopayload' time='21.529266'/> <testcase classname='BTS_Tests_LAPDm:hopping' name='TC_sabm_ua_dcch_sapi3' time='21.359242'/> <testcase classname='BTS_Tests_LAPDm:hopping' name='TC_sabm_ua_dcch_sapi4' time='21.306477'/> <testcase classname='BTS_Tests_LAPDm:hopping' name='TC_sabm_contention' time='21.238274'/> <testcase classname='BTS_Tests_LAPDm:hopping' name='TC_sabm_retransmit' time='3.149510'/> <testcase classname='BTS_Tests_LAPDm:hopping' name='TC_sabm_retransmit_bts' time='81.468029'/> <testcase classname='BTS_Tests_LAPDm:hopping' name='TC_sabm_invalid_resp' time='23.367669'/> <testcase classname='BTS_Tests_LAPDm:hopping' name='TC_sabm_dm' time='14.025744'/> <testcase classname='BTS_Tests_LAPDm:hopping' name='TC_establish_ign_first_sabm' time='8.174421'/> <testcase classname='BTS_Tests_LAPDm:hopping' name='TC_iframe_seq_and_ack' time='29.583312'> <failure type='fail-verdict'>Received RSL ERROR IND { msg_disc := { msg_group := RSL_MDISC_RLL (1), transparent := false }, msg_type := RSL_MT_ERROR_IND (3), ies := { { iei := RSL_IE_CHAN_NR (1), body := { chan_nr := { u := { sdcch8 := { tag := '01'B, sub_chan := 4 } }, tn := 6 } } }, { iei := RSL_IE_LINK_IDENT (2), body := { link_id := { c := FACCH_SDCCH (0), na := false, prio := SAPI0_PRIO_NORMAL (0), sapi := 0 } } }, { iei := RSL_IE_RLM_CAUSE (22), body := { rlm_cause := { len := 1, payload := '01'O } } } } } BTS_Tests_LAPDm.ttcn:1484 BTS_Tests_LAPDm control part BTS_Tests_LAPDm.ttcn:579 TC_iframe_seq_and_ack testcase </failure> </testcase> <testcase classname='BTS_Tests_LAPDm:hopping' name='TC_iframe_timer_recovery' time='24.911618'> <failure type='fail-verdict'>Received RSL ERROR IND { msg_disc := { msg_group := RSL_MDISC_RLL (1), transparent := false }, msg_type := RSL_MT_ERROR_IND (3), ies := { { iei := RSL_IE_CHAN_NR (1), body := { chan_nr := { u := { sdcch8 := { tag := '01'B, sub_chan := 4 } }, tn := 6 } } }, { iei := RSL_IE_LINK_IDENT (2), body := { link_id := { c := FACCH_SDCCH (0), na := false, prio := SAPI0_PRIO_NORMAL (0), sapi := 0 } } }, { iei := RSL_IE_RLM_CAUSE (22), body := { rlm_cause := { len := 1, payload := '01'O } } } } } BTS_Tests_LAPDm.ttcn:1485 BTS_Tests_LAPDm control part BTS_Tests_LAPDm.ttcn:685 TC_iframe_timer_recovery testcase </failure> </testcase> <testcase classname='BTS_Tests_LAPDm:hopping' name='TC_ns_seq_error' time='34.210126'> <failure type='fail-verdict'>"BTS_Tests.ttcn:732 : Tguard timeout" BTS_Tests_LAPDm.ttcn:1486 BTS_Tests_LAPDm control part BTS_Tests_LAPDm.ttcn:768 TC_ns_seq_error testcase </failure> </testcase> <testcase classname='BTS_Tests_LAPDm:hopping' name='TC_nr_seq_error' time='5.371976'> <failure type='fail-verdict'>Missing DISC from BTS BTS_Tests_LAPDm.ttcn:1487 BTS_Tests_LAPDm control part BTS_Tests_LAPDm.ttcn:831 TC_nr_seq_error testcase </failure> </testcase> <testcase classname='BTS_Tests_LAPDm:hopping' name='TC_rec_invalid_frame' time='87.384835'> <failure type='fail-verdict'>"BTS_Tests_LAPDm.ttcn:913 : Missing LAPDm_RR RSP" BTS_Tests_LAPDm.ttcn:1488 BTS_Tests_LAPDm control part BTS_Tests_LAPDm.ttcn:961 TC_rec_invalid_frame testcase </failure> </testcase> <testcase classname='BTS_Tests_LAPDm:hopping' name='TC_segm_concat_dcch' time='10.639287'> <failure type='fail-verdict'>"BTS_Tests_LAPDm.ttcn:1023 : received unexpected LAPDm { sacch := false, sapi := 0, lapdm := { ab := { addr := { spare := '0'B, lpd := 0, sapi := 0, c_r := false, ea := true }, ctrl := { s := { n_r := 1, p_f := false, s := '10'B, spare := '01'B } }, len := 0, m := false, el := 1, payload := ''O, padding := '2B2B2B2B2B2B2B2B2B2B2B2B2B2B2B2B2B2B2B2B'O (\"++++++++++++++++++++\") } } }" BTS_Tests_LAPDm.ttcn:1489 BTS_Tests_LAPDm control part BTS_Tests_LAPDm.ttcn:1088 TC_segm_concat_dcch testcase </failure> </testcase> <testcase classname='BTS_Tests_LAPDm:hopping' name='TC_segm_concat_sacch' time='50.794623'> <failure type='fail-verdict'>"BTS_Tests_LAPDm.ttcn:1023 : received unexpected LAPDm { sacch := true, sapi := 0, lapdm := { ab := { addr := { spare := '0'B, lpd := 0, sapi := 0, c_r := false, ea := true }, ctrl := { u := { u := '011'B, p_f := true, u2 := '00'B, spare := '11'B } }, len := 0, m := false, el := 1, payload := ''O, padding := '2B2B2B2B2B2B2B2B2B2B2B2B2B2B2B2B2B2B'O (\"++++++++++++++++++\") } } }" BTS_Tests_LAPDm.ttcn:1490 BTS_Tests_LAPDm control part BTS_Tests_LAPDm.ttcn:1093 TC_segm_concat_sacch testcase </failure> </testcase> <testcase classname='BTS_Tests_LAPDm:hopping' name='TC_t200_n200' time='40.134733'> <failure type='fail-verdict'>Missing RSL RLL ERROR INDICATION BTS_Tests_LAPDm.ttcn:1491 BTS_Tests_LAPDm control part BTS_Tests_LAPDm.ttcn:1182 TC_t200_n200 testcase </failure> </testcase> <testcase classname='BTS_Tests_LAPDm:hopping' name='TC_rr_response_frame_loss' time='11.391153'> <failure type='fail-verdict'>Timeout waiting for RR or REJ BTS_Tests_LAPDm.ttcn:1492 BTS_Tests_LAPDm control part BTS_Tests_LAPDm.ttcn:1239 TC_rr_response_frame_loss testcase </failure> </testcase> <testcase classname='BTS_Tests_LAPDm:hopping' name='TC_incorrect_cr' time='15.899311'/> <testcase classname='BTS_Tests_LAPDm:hopping' name='TC_sabm_incorrect_c' time='23.408331'> <failure type='fail-verdict'>"BTS_Tests.ttcn:732 : Tguard timeout" BTS_Tests_LAPDm.ttcn:1494 BTS_Tests_LAPDm control part BTS_Tests_LAPDm.ttcn:1341 TC_sabm_incorrect_c testcase </failure> </testcase> <testcase classname='BTS_Tests_LAPDm:hopping' name='TC_normal_reestablishment' time='25.904644'> <failure type='fail-verdict'>"BTS_Tests_LAPDm.ttcn:1023 : received unexpected LAPDm { sacch := false, sapi := 0, lapdm := { ab := { addr := { spare := '0'B, lpd := 0, sapi := 0, c_r := false, ea := true }, ctrl := { s := { n_r := 3, p_f := false, s := '10'B, spare := '01'B } }, len := 0, m := false, el := 1, payload := ''O, padding := '2B2B2B2B2B2B2B2B2B2B2B2B2B2B2B2B2B2B2B2B'O (\"++++++++++++++++++++\") } } }" BTS_Tests_LAPDm.ttcn:1495 BTS_Tests_LAPDm control part BTS_Tests_LAPDm.ttcn:1403 TC_normal_reestablishment testcase </failure> </testcase> <testcase classname='BTS_Tests_LAPDm:hopping' name='TC_normal_reestablishment_state_unacked' time='12.179504'> <failure type='fail-verdict'>"BTS_Tests_LAPDm.ttcn:1023 : received unexpected LAPDm { sacch := false, sapi := 0, lapdm := { ab := { addr := { spare := '0'B, lpd := 0, sapi := 0, c_r := false, ea := true }, ctrl := { s := { n_r := 1, p_f := false, s := '10'B, spare := '01'B } }, len := 0, m := false, el := 1, payload := ''O, padding := '2B2B2B2B2B2B2B2B2B2B2B2B2B2B2B2B2B2B2B2B'O (\"++++++++++++++++++++\") } } }" BTS_Tests_LAPDm.ttcn:1496 BTS_Tests_LAPDm control part BTS_Tests_LAPDm.ttcn:1470 TC_normal_reestablishment_state_unacked testcase </failure> </testcase> <testcase classname='BTS_Tests_VAMOS:hopping' name='TC_vamos_chan_act_vff' time='2.594911'/> <testcase classname='BTS_Tests_VAMOS:hopping' name='TC_vamos_chan_act_vhh' time='2.543865'/> <testcase classname='BTS_Tests_VAMOS:hopping' name='TC_vamos_chan_act_hvhh' time='2.588056'/> <testcase classname='BTS_Tests_VAMOS:hopping' name='TC_vamos_chan_act_dyn_ipa_vff' time='2.540875'/> <testcase classname='BTS_Tests_VAMOS:hopping' name='TC_vamos_chan_act_dyn_osmo_vff' time='5.365692'/> <testcase classname='BTS_Tests_VAMOS:hopping' name='TC_vamos_chan_act_dyn_osmo_vhh' time='2.632379'/> <testcase classname='BTS_Tests_VAMOS:hopping' name='TC_vamos_chan_act_dyn_osmo_hvhh' time='2.530126'/> <testcase classname='BTS_Tests_VAMOS:hopping' name='TC_vamos_chan_mode_modify_vff' time='1.293024'/> <testcase classname='BTS_Tests_VAMOS:hopping' name='TC_vamos_chan_mode_modify_vhh' time='1.385812'/> <testcase classname='BTS_Tests_VAMOS:hopping' name='TC_vamos_chan_mode_modify_hvhh' time='1.347317'/> <testcase classname='BTS_Tests_VAMOS:hopping' name='TC_vamos_chan_mode_modify_dyn_ipa_vff' time='1.388949'/> <testcase classname='BTS_Tests_VAMOS:hopping' name='TC_vamos_chan_mode_modify_dyn_osmo_vff' time='1.342311'/> <testcase classname='BTS_Tests_VAMOS:hopping' name='TC_vamos_chan_mode_modify_dyn_osmo_vhh' time='1.386609'/> <testcase classname='BTS_Tests_VAMOS:hopping' name='TC_vamos_chan_mode_modify_dyn_osmo_hvhh' time='1.530889'/> <testcase classname='BTS_Tests_ASCI:hopping' name='TC_vbs_notification' time='4.707824'/> <testcase classname='BTS_Tests_ASCI:hopping' name='TC_vgcs_uplink_free_and_busy' time='1.830457'/> <testcase classname='BTS_Tests_ASCI:hopping' name='TC_vgcs_talker_fail' time='16.520069'/> <testcase classname='BTS_Tests_ASCI:hopping' name='TC_vgcs_talker_est_rel' time='1.383390'/> <testcase classname='BTS_Tests_ASCI:hopping' name='TC_vgcs_listener_det' time='3.361224'/> </testsuite> <?xml version="1.0"?> <testsuite name='Titan' tests='17' failures='0' errors='0' skipped='0' inconc='0' time='96.00'> <testcase classname='BTS_Tests_OML' name='TC_wrong_mdisc' time='10.647169'/> <testcase classname='BTS_Tests_OML' name='TC_wrong_msgtype' time='0.707657'/> <testcase classname='BTS_Tests_OML' name='TC_short_length' time='0.701020'/> <testcase classname='BTS_Tests_OML' name='TC_long_length' time='0.711224'/> <testcase classname='BTS_Tests_OML' name='TC_wrong_placement' time='0.718254'/> <testcase classname='BTS_Tests_OML' name='TC_wrong_seq' time='0.712302'/> <testcase classname='BTS_Tests_OML' name='TC_wrong_obj_class' time='0.707085'/> <testcase classname='BTS_Tests_OML' name='TC_wrong_bts_nr' time='0.722222'/> <testcase classname='BTS_Tests_OML' name='TC_wrong_trx_nr' time='0.700993'/> <testcase classname='BTS_Tests_OML' name='TC_radio_carrier_opstart_noattr' time='0.707281'/> <testcase classname='BTS_Tests_OML' name='TC_bts_opstart' time='0.708083'/> <testcase classname='BTS_Tests_OML' name='TC_bts_opstart_noattr' time='0.706045'/> <testcase classname='BTS_Tests_OML' name='TC_ts_opstart' time='0.716567'/> <testcase classname='BTS_Tests_OML' name='TC_ts_opstart_noattr' time='0.697146'/> <testcase classname='BTS_Tests_OML' name='TC_initial_state_reports' time='0.711034'/> <testcase classname='BTS_Tests_OML' name='TC_ipa_osmo_pcu_anr_fwd' time='0.740870'/> <testcase classname='BTS_Tests_OML' name='TC_ipa_rsl_connect_nack' time='0.733082'/> </testsuite> + check_respawn_count + set +x [0;31m ================================================================ WARNING: osmo-bts was respawned 5 times (expected: 3)! (OS#6794) ================================================================ [0m+ RC=1 + uptime + grep --color=always -o load.* [01;31m[Kload average: 11.64, 10.36, 5.92[m[K + exit 1 Build step 'Execute shell' marked build as failure Recording test results [Checks API] No suitable checks publisher found.
1
2
0
0
Jenkins build became unstable: ttcn3-bsc-test-io_uring #696
by jenkins@lists.osmocom.org
05 Sep '26
05 Sep '26
See <
https://jenkins.osmocom.org/jenkins/job/ttcn3-bsc-test-io_uring/696/display…
>
1
1
0
0
Build failed in Jenkins: ttcn3-5gc-test-ogs-latest #297
by jenkins@lists.osmocom.org
05 Sep '26
05 Sep '26
See <
https://jenkins.osmocom.org/jenkins/job/ttcn3-5gc-test-ogs-latest/297/displ…
> Changes: ------------------------------------------ [...truncated 251.28 MiB...] [32m09/05 13:47:00.976[0m: [[33msbi[0m] [1;37mDEBUG[0m: [{"op":"replace","path":"/nfStatus","value":"REGISTERED"},{"op":"replace","path":"/load","value":24}] (../lib/sbi/client.c:548) [32m09/05 13:47:00.976[0m: [[33msbi[0m] [1;37mDEBUG[0m: STREAM added [607] (../lib/sbi/nghttp2-server.c:1737) [32m09/05 13:47:00.977[0m: [[33msbi[0m] [1;37mDEBUG[0m: [PATCH] /nnrf-nfm/v1/nf-instances/d3e6d77e-a92f-41f1-baa9-339c3efa7f1a (../lib/sbi/nghttp2-server.c:1308) [32m09/05 13:47:00.977[0m: [[33msbi[0m] [1;37mDEBUG[0m: RECEIVED: 101 (../lib/sbi/nghttp2-server.c:1312) [32m09/05 13:47:00.977[0m: [[33msbi[0m] [1;37mDEBUG[0m: [{"op":"replace","path":"/nfStatus","value":"REGISTERED"},{"op":"replace","path":"/load","value":24}] (../lib/sbi/nghttp2-server.c:1314) [32m09/05 13:47:00.977[0m: [[33mnrf[0m] [1;37mDEBUG[0m: nrf_state_operational(): OGS_EVENT_NAME_SBI_SERVER (../src/nrf/nrf-sm.c:54) [32m09/05 13:47:00.977[0m: [[33mnrf[0m] [1;37mDEBUG[0m: nrf_nf_state_registered(): OGS_EVENT_NAME_SBI_SERVER (../src/nrf/nf-sm.c:201) [32m09/05 13:47:00.977[0m: [[33msbi[0m] [1;37mDEBUG[0m: STATUS [204] (../lib/sbi/nghttp2-server.c:702) [32m09/05 13:47:00.977[0m: [[33msbi[0m] [1;37mDEBUG[0m: STREAM closed [607] (../lib/sbi/nghttp2-server.c:1419) 0000: 00000301 05000002 5f89fbbe ........_... [32m09/05 13:47:00.977[0m: [[33msbi[0m] [1;37mDEBUG[0m: [204:PATCH]
http://127.0.0.10:7777/nnrf-nfm/v1/nf-instances/d3e6d77e-a92f-41f1-baa9-339…
(../lib/sbi/client.c:744) [32m09/05 13:47:00.977[0m: [[33msbi[0m] [1;37mDEBUG[0m: RECEIVED[0] (../lib/sbi/client.c:755) [32m09/05 13:47:00.977[0m: [[33msbi[0m] [1;37mDEBUG[0m: STATUS [204] (../lib/sbi/nghttp2-server.c:702) [32m09/05 13:47:00.977[0m: [[33msbi[0m] [1;37mDEBUG[0m: STREAM closed [5771] (../lib/sbi/nghttp2-server.c:1419) 0000: 00001a01 05000016 8b89c161 96dc34fd ...........a..4. 0010: 2806d4dc 5ad41004 e28166e3 4edc0014 (...Z.....f.N... 0020: c5a37f ... [32m09/05 13:47:00.977[0m: [[33msbi[0m] [1;37mDEBUG[0m: [204:PATCH]
http://127.0.0.200:7777/nnrf-nfm/v1/nf-instances/d3e6d77e-a92f-41f1-baa9-33…
(../lib/sbi/client.c:744) [32m09/05 13:47:00.977[0m: [[33msbi[0m] [1;37mDEBUG[0m: RECEIVED[0] (../lib/sbi/client.c:755) [32m09/05 13:47:00.977[0m: [[33mpcf[0m] [1;37mDEBUG[0m: pcf_state_operational(): OGS_EVENT_NAME_SBI_CLIENT (../src/pcf/pcf-sm.c:64) [32m09/05 13:47:00.977[0m: [[33msbi[0m] [1;37mDEBUG[0m: ogs_sbi_nf_state_registered(): OGS_EVENT_NAME_SBI_CLIENT (../lib/sbi/nf-sm.c:358) Waiting for packet dumper to finish... 1 (prev_count=4320, count=13096) [32m09/05 13:47:01.160[0m: [[33mamf[0m] [1;37mDEBUG[0m: amf_state_operational(): OGS_EVENT_NAME_SBI_TIMER (../src/amf/amf-sm.c:83) [32m09/05 13:47:01.160[0m: [[33msbi[0m] [1;37mDEBUG[0m: ogs_sbi_nf_state_registered(): OGS_EVENT_NAME_SBI_TIMER (../lib/sbi/nf-sm.c:358) [32m09/05 13:47:01.160[0m: [[33msbi[0m] [1;37mDEBUG[0m: [PATCH]
http://127.0.0.200:7777/nnrf-nfm/v1/nf-instances/d40427ca-a92f-41f1-b8dd-df…
(../lib/sbi/client.c:797) [32m09/05 13:47:01.160[0m: [[33msbi[0m] [1;37mDEBUG[0m: SENDING...[100] (../lib/sbi/client.c:546) [32m09/05 13:47:01.160[0m: [[33msbi[0m] [1;37mDEBUG[0m: [{"op":"replace","path":"/nfStatus","value":"REGISTERED"},{"op":"replace","path":"/load","value":0}] (../lib/sbi/client.c:548) [32m09/05 13:47:01.161[0m: [[33msbi[0m] [1;37mDEBUG[0m: STREAM added [23947] (../lib/sbi/nghttp2-server.c:1737) [32m09/05 13:47:01.161[0m: [[33msbi[0m] [1;37mDEBUG[0m: [PATCH] /nnrf-nfm/v1/nf-instances/d40427ca-a92f-41f1-b8dd-df70ec584a7d (../lib/sbi/nghttp2-server.c:1308) [32m09/05 13:47:01.161[0m: [[33msbi[0m] [1;37mDEBUG[0m: RECEIVED: 100 (../lib/sbi/nghttp2-server.c:1312) [32m09/05 13:47:01.161[0m: [[33msbi[0m] [1;37mDEBUG[0m: [{"op":"replace","path":"/nfStatus","value":"REGISTERED"},{"op":"replace","path":"/load","value":0}] (../lib/sbi/nghttp2-server.c:1314) [32m09/05 13:47:01.161[0m: [[33msbi[0m] [1;37mDEBUG[0m: [PATCH]
http://127.0.0.10:7777/nnrf-nfm/v1/nf-instances/d40427ca-a92f-41f1-b8dd-df7…
(../lib/sbi/client.c:797) [32m09/05 13:47:01.161[0m: [[33msbi[0m] [1;37mDEBUG[0m: SENDING...[100] (../lib/sbi/client.c:546) [32m09/05 13:47:01.161[0m: [[33msbi[0m] [1;37mDEBUG[0m: [{"op":"replace","path":"/nfStatus","value":"REGISTERED"},{"op":"replace","path":"/load","value":0}] (../lib/sbi/client.c:548) [32m09/05 13:47:01.161[0m: [[33msbi[0m] [1;37mDEBUG[0m: STREAM added [609] (../lib/sbi/nghttp2-server.c:1737) [32m09/05 13:47:01.161[0m: [[33msbi[0m] [1;37mDEBUG[0m: [PATCH] /nnrf-nfm/v1/nf-instances/d40427ca-a92f-41f1-b8dd-df70ec584a7d (../lib/sbi/nghttp2-server.c:1308) [32m09/05 13:47:01.161[0m: [[33msbi[0m] [1;37mDEBUG[0m: RECEIVED: 100 (../lib/sbi/nghttp2-server.c:1312) [32m09/05 13:47:01.161[0m: [[33msbi[0m] [1;37mDEBUG[0m: [{"op":"replace","path":"/nfStatus","value":"REGISTERED"},{"op":"replace","path":"/load","value":0}] (../lib/sbi/nghttp2-server.c:1314) [32m09/05 13:47:01.161[0m: [[33mnrf[0m] [1;37mDEBUG[0m: nrf_state_operational(): OGS_EVENT_NAME_SBI_SERVER (../src/nrf/nrf-sm.c:54) [32m09/05 13:47:01.162[0m: [[33mnrf[0m] [1;37mDEBUG[0m: nrf_nf_state_registered(): OGS_EVENT_NAME_SBI_SERVER (../src/nrf/nf-sm.c:201) [32m09/05 13:47:01.162[0m: [[33msbi[0m] [1;37mDEBUG[0m: STATUS [204] (../lib/sbi/nghttp2-server.c:702) [32m09/05 13:47:01.162[0m: [[33msbi[0m] [1;37mDEBUG[0m: STREAM closed [609] (../lib/sbi/nghttp2-server.c:1419) 0000: 00001a01 05000002 6189fb61 96dc34fd ........a..a..4. 0010: 2806d4dc 5ad41004 e28166e3 4edc0054 (...Z.....f.N..T 0020: c5a37f ... [32m09/05 13:47:01.162[0m: [[33msbi[0m] [1;37mDEBUG[0m: [204:PATCH]
http://127.0.0.10:7777/nnrf-nfm/v1/nf-instances/d40427ca-a92f-41f1-b8dd-df7…
(../lib/sbi/client.c:744) [32m09/05 13:47:01.162[0m: [[33msbi[0m] [1;37mDEBUG[0m: RECEIVED[0] (../lib/sbi/client.c:755) [32m09/05 13:47:01.162[0m: [[33msbi[0m] [1;37mDEBUG[0m: STATUS [204] (../lib/sbi/nghttp2-server.c:702) [32m09/05 13:47:01.162[0m: [[33msbi[0m] [1;37mDEBUG[0m: STREAM closed [23947] (../lib/sbi/nghttp2-server.c:1419) [32m09/05 13:47:01.162[0m: [[33msbi[0m] [1;37mDEBUG[0m: [204:PATCH]
http://127.0.0.200:7777/nnrf-nfm/v1/nf-instances/d40427ca-a92f-41f1-b8dd-df…
(../lib/sbi/client.c:744) [32m09/05 13:47:01.162[0m: [[33msbi[0m] [1;37mDEBUG[0m: RECEIVED[0] (../lib/sbi/client.c:755) [32m09/05 13:47:01.162[0m: [[33mamf[0m] [1;37mDEBUG[0m: amf_state_operational(): OGS_EVENT_NAME_SBI_CLIENT (../src/amf/amf-sm.c:83) [32m09/05 13:47:01.162[0m: [[33msbi[0m] [1;37mDEBUG[0m: ogs_sbi_nf_state_registered(): OGS_EVENT_NAME_SBI_CLIENT (../lib/sbi/nf-sm.c:358) 0000: 00001a01 0500005d 8b89c961 96dc34fd .......]...a..4. 0010: 2806d4dc 5ad41004 e28166e3 4edc0054 (...Z.....f.N..T 0020: c5a37f ... MTC@34589de6d3da: External command `<
https://jenkins.osmocom.org/jenkins/job/ttcn3-5gc-test-ogs-latest/ws/src/os…
> C5G_Tests.TC_normal_reg_emergency_services error' was executed successfully (exit status: 0). MTC@34589de6d3da: Starting external command `<
https://jenkins.osmocom.org/jenkins/job/ttcn3-5gc-test-ogs-latest/ws/src/os…
> C5G_Tests.TC_normal_reg_emergency_services_fallback'. ------ C5G_Tests.TC_normal_reg_emergency_services_fallback ------ (13:47:02) load average: 3.73, 2.82, 2.36 /usr/bin/dumpcap -q -s 1520 -n -i any -w "<
https://jenkins.osmocom.org/jenkins/job/ttcn3-5gc-test-ogs-latest/297/artif…
"> ><
https://jenkins.osmocom.org/jenkins/job/ttcn3-5gc-test-ogs-latest/297/artif…
> 2>/tmp/cmderr & Waiting for packet dumper to start... 0 MTC@34589de6d3da: External command `<
https://jenkins.osmocom.org/jenkins/job/ttcn3-5gc-test-ogs-latest/ws/src/os…
> C5G_Tests.TC_normal_reg_emergency_services_fallback' was executed successfully (exit status: 0). MTC@34589de6d3da: Test case TC_normal_reg_emergency_services_fallback started. GTP1U_EM(861)@34589de6d3da: Warning: sizes of 'struct sctp_event_subscribe': compile-time 14, kernel: 14 GTP1U_EM(861)@34589de6d3da: setverdict(fail): none -> fail reason: "Could not connect UECUPS socket, check your configuration", new component reason: "Could not connect UECUPS socket, check your configuration" GTP1U_EM(861)@34589de6d3da: Dynamic test case error: testcase.stop GTP1U_EM(861)@34589de6d3da: setverdict(error): fail -> error GTP1U_EM(861)@34589de6d3da: Final verdict of PTC: error TC_normal_reg_emergency_services_fallback-NGAP0(862)@34589de6d3da: Warning: sizes of 'struct sctp_event_subscribe': compile-time 14, kernel: 14 [32m09/05 13:47:03.286[0m: [[33mamf[0m] [1;32mINFO[0m: gNB-N2 accepted[127.0.0.202]:50000 in ng-path module (../src/amf/ngap-sctp.c:113) [32m09/05 13:47:03.286[0m: [[33mamf[0m] [1;37mDEBUG[0m: amf_state_operational(): AMF_EVENT_NGAP_LO_ACCEPT (../src/amf/amf-sm.c:83) [32m09/05 13:47:03.286[0m: [[33mamf[0m] [1;32mINFO[0m: gNB-N2 accepted[127.0.0.202] in master_sm module (../src/amf/amf-sm.c:818) [32m09/05 13:47:03.291[0m: [[33mamf[0m] [1;37mDEBUG[0m: ngap_state_initial(): ENTRY (../src/amf/ngap-sm.c:28) [32m09/05 13:47:03.291[0m: [[33mamf[0m] [1;37mDEBUG[0m: ngap_state_operational(): ENTRY (../src/amf/ngap-sm.c:55) [32m09/05 13:47:03.291[0m: [[33mamf[0m] [1;32mINFO[0m: [Added] Number of gNBs is now 1 (../src/amf/context.c:1277) [32m09/05 13:47:03.291[0m: [[33mamf[0m] [1;37mDEBUG[0m: SCTP_ASSOC_CHANGE:[T:32769, F:0x0, S:0, I/O:64/30] (../src/amf/ngap-sctp.c:152) [32m09/05 13:47:03.291[0m: [[33mamf[0m] [1;37mDEBUG[0m: SCTP_COMM_UP (../src/amf/ngap-sctp.c:161) [32m09/05 13:47:03.291[0m: [[33mamf[0m] [1;37mDEBUG[0m: amf_state_operational(): AMF_EVENT_NGAP_LO_SCTP_COMM_UP (../src/amf/amf-sm.c:83) [32m09/05 13:47:03.291[0m: [[33mamf[0m] [1;32mINFO[0m: gNB-N2[127.0.0.202] max_num_of_ostreams : 30 (../src/amf/amf-sm.c:865) TC_normal_reg_emergency_services_fallback-NGAP1(863)@34589de6d3da: Warning: sizes of 'struct sctp_event_subscribe': compile-time 14, kernel: 14 [32m09/05 13:47:03.299[0m: [[33mamf[0m] [1;32mINFO[0m: gNB-N2 accepted[127.0.0.202]:50001 in ng-path module (../src/amf/ngap-sctp.c:113) [32m09/05 13:47:03.299[0m: [[33mamf[0m] [1;37mDEBUG[0m: amf_state_operational(): AMF_EVENT_NGAP_LO_ACCEPT (../src/amf/amf-sm.c:83) [32m09/05 13:47:03.299[0m: [[33mamf[0m] [1;32mINFO[0m: gNB-N2 accepted[127.0.0.202] in master_sm module (../src/amf/amf-sm.c:818) [32m09/05 13:47:03.303[0m: [[33mamf[0m] [1;37mDEBUG[0m: ngap_state_initial(): ENTRY (../src/amf/ngap-sm.c:28) [32m09/05 13:47:03.303[0m: [[33mamf[0m] [1;37mDEBUG[0m: ngap_state_operational(): ENTRY (../src/amf/ngap-sm.c:55) [32m09/05 13:47:03.303[0m: [[33mamf[0m] [1;32mINFO[0m: [Added] Number of gNBs is now 2 (../src/amf/context.c:1277) [32m09/05 13:47:03.303[0m: [[33mamf[0m] [1;37mDEBUG[0m: SCTP_ASSOC_CHANGE:[T:32769, F:0x0, S:0, I/O:64/30] (../src/amf/ngap-sctp.c:152) [32m09/05 13:47:03.303[0m: [[33mamf[0m] [1;37mDEBUG[0m: SCTP_COMM_UP (../src/amf/ngap-sctp.c:161) [32m09/05 13:47:03.303[0m: [[33mamf[0m] [1;37mDEBUG[0m: amf_state_operational(): AMF_EVENT_NGAP_LO_SCTP_COMM_UP (../src/amf/amf-sm.c:83) [32m09/05 13:47:03.303[0m: [[33mamf[0m] [1;32mINFO[0m: gNB-N2[127.0.0.202] max_num_of_ostreams : 30 (../src/amf/amf-sm.c:865) [32m09/05 13:47:03.307[0m: [[33mamf[0m] [1;37mDEBUG[0m: amf_state_operational(): AMF_EVENT_NGAP_MESSAGE (../src/amf/amf-sm.c:83) [32m09/05 13:47:03.307[0m: [[33mamf[0m] [1;37mDEBUG[0m: ngap_state_operational(): AMF_EVENT_NGAP_MESSAGE (../src/amf/ngap-sm.c:55) [32m09/05 13:47:03.307[0m: [[33mamf[0m] [1;37mDEBUG[0m: NGSetupRequest (../src/amf/ngap-handler.c:288) [32m09/05 13:47:03.307[0m: [[33mamf[0m] [1;37mDEBUG[0m: IP[127.0.0.202] GNB_ID[0x0] GNB_ID_LENGTH[22] (../src/amf/ngap-handler.c:386) [32m09/05 13:47:03.307[0m: [[33mamf[0m] [1;37mDEBUG[0m: PLMN_ID[MCC:999 MNC:70] (../src/amf/ngap-handler.c:391) [32m09/05 13:47:03.307[0m: [[33mamf[0m] [1;37mDEBUG[0m: PagingDRX[0] (../src/amf/ngap-handler.c:395) [32m09/05 13:47:03.307[0m: [[33mamf[0m] [1;37mDEBUG[0m: TAC[1] (../src/amf/ngap-handler.c:439) [32m09/05 13:47:03.307[0m: [[33mamf[0m] [1;37mDEBUG[0m: PLMN_ID[MCC:999 MNC:70] (../src/amf/ngap-handler.c:501) [32m09/05 13:47:03.307[0m: [[33mamf[0m] [1;37mDEBUG[0m: S_NSSAI[SST:1 SD:0xffffff] (../src/amf/ngap-handler.c:562) [32m09/05 13:47:03.307[0m: [[33mamf[0m] [1;37mDEBUG[0m: TAC[1] (../src/amf/ngap-handler.c:72) [32m09/05 13:47:03.307[0m: [[33mamf[0m] [1;37mDEBUG[0m: PLMN_ID[MCC:999 MNC:70] (../src/amf/ngap-handler.c:73) [32m09/05 13:47:03.307[0m: [[33mamf[0m] [1;37mDEBUG[0m: SERVED_TAI_INDEX[0] (../src/amf/ngap-handler.c:78) [32m09/05 13:47:03.307[0m: [[33mamf[0m] [1;37mDEBUG[0m: PLMN_ID[MCC:999 MNC:70] (../src/amf/ngap-handler.c:100) [32m09/05 13:47:03.307[0m: [[33mamf[0m] [1;37mDEBUG[0m: S_NSSAI[SST:1 SD:0xffffff] (../src/amf/ngap-handler.c:105) [32m09/05 13:47:03.307[0m: [[33mamf[0m] [1;37mDEBUG[0m: NG-Setup response (../src/amf/ngap-path.c:356) [32m09/05 13:47:03.307[0m: [[33mamf[0m] [1;37mDEBUG[0m: NGSetupResponse (../src/amf/ngap-build.c:91) [32m09/05 13:47:03.307[0m: [[33mamf[0m] [1;37mDEBUG[0m: IP[127.0.0.202] RAN_ID[0] (../src/amf/ngap-path.c:64) MTC@34589de6d3da: setverdict(pass): none -> pass MTC@34589de6d3da: Dynamic test case error: Error message was received from MC: The connect operation refers to test component with component reference 861, which has already terminated. MTC@34589de6d3da: setverdict(error): pass -> error TC_normal_reg_emergency_services_fallback0(864)@34589de6d3da: Final verdict of PTC: none [32m09/05 13:47:03.315[0m: [[33mamf[0m] [1;37mDEBUG[0m: SCTP_SHUTDOWN_EVENT:[T:32773, F:0x0, L:12] (../src/amf/ngap-sctp.c:193) [32m09/05 13:47:03.315[0m: [[33mamf[0m] [1;37mDEBUG[0m: amf_state_operational(): AMF_EVENT_NGAP_LO_CONNREFUSED (../src/amf/amf-sm.c:83) [32m09/05 13:47:03.315[0m: [[33mamf[0m] [1;32mINFO[0m: gNB-N2[127.0.0.202] connection refused!!! (../src/amf/amf-sm.c:878) [32m09/05 13:47:03.315[0m: [[33mamf[0m] [1;37mDEBUG[0m: ngap_state_operational(): EXIT (../src/amf/ngap-sm.c:55) [32m09/05 13:47:03.315[0m: [[33mamf[0m] [1;37mDEBUG[0m: ngap_state_final(): EXIT (../src/amf/ngap-sm.c:37) [32m09/05 13:47:03.315[0m: [[33mamf[0m] [1;32mINFO[0m: [Removed] Number of gNBs is now 1 (../src/amf/context.c:1305) [32m09/05 13:47:03.315[0m: [[33mamf[0m] [1;37mDEBUG[0m: SCTP_SHUTDOWN_EVENT:[T:32773, F:0x0, L:12] (../src/amf/ngap-sctp.c:193) [32m09/05 13:47:03.315[0m: [[33mamf[0m] [1;37mDEBUG[0m: amf_state_operational(): AMF_EVENT_NGAP_LO_CONNREFUSED (../src/amf/amf-sm.c:83) [32m09/05 13:47:03.315[0m: [[33mamf[0m] [1;32mINFO[0m: gNB-N2[127.0.0.202] connection refused!!! (../src/amf/amf-sm.c:878) [32m09/05 13:47:03.315[0m: [[33mamf[0m] [1;37mDEBUG[0m: ngap_state_operational(): EXIT (../src/amf/ngap-sm.c:55) [32m09/05 13:47:03.315[0m: [[33mamf[0m] [1;37mDEBUG[0m: ngap_state_final(): EXIT (../src/amf/ngap-sm.c:37) [32m09/05 13:47:03.315[0m: [[33mamf[0m] [1;32mINFO[0m: [Removed] Number of gNBs is now 0 (../src/amf/context.c:1305) TC_normal_reg_emergency_services_fallback-NGAP1(863)@34589de6d3da: Final verdict of PTC: none TC_normal_reg_emergency_services_fallback-NGAP0(862)@34589de6d3da: Final verdict of PTC: none MTC@34589de6d3da: Setting final verdict of the test case. MTC@34589de6d3da: Local verdict of MTC: error MTC@34589de6d3da: Local verdict of PTC GTP1U_EM(861): error (error -> error) MTC@34589de6d3da: Local verdict of PTC TC_normal_reg_emergency_services_fallback-NGAP0(862): none (error -> error) MTC@34589de6d3da: Local verdict of PTC TC_normal_reg_emergency_services_fallback-NGAP1(863): none (error -> error) MTC@34589de6d3da: Local verdict of PTC TC_normal_reg_emergency_services_fallback0(864): none (error -> error) MTC@34589de6d3da: Test case TC_normal_reg_emergency_services_fallback finished. Verdict: error MTC@34589de6d3da: Starting external command `<
https://jenkins.osmocom.org/jenkins/job/ttcn3-5gc-test-ogs-latest/ws/src/os…
> C5G_Tests.TC_normal_reg_emergency_services_fallback error'. (13:47:03) load average: 3.51, 2.79, 2.35 [1;31m------ C5G_Tests.TC_normal_reg_emergency_services_fallback error ------[0m Waiting for packet dumper to finish... 0 (prev_count=-1, count=224) Waiting for packet dumper to finish... 1 (prev_count=224, count=4788) MTC@34589de6d3da: External command `<
https://jenkins.osmocom.org/jenkins/job/ttcn3-5gc-test-ogs-latest/ws/src/os…
> C5G_Tests.TC_normal_reg_emergency_services_fallback error' was executed successfully (exit status: 0). MTC@34589de6d3da: Starting external command `<
https://jenkins.osmocom.org/jenkins/job/ttcn3-5gc-test-ogs-latest/ws/src/os…
> C5G_Tests.TC_emergency_registration'. ------ C5G_Tests.TC_emergency_registration ------ (13:47:05) load average: 3.51, 2.79, 2.35 /usr/bin/dumpcap -q -s 1520 -n -i any -w "<
https://jenkins.osmocom.org/jenkins/job/ttcn3-5gc-test-ogs-latest/297/artif…
"> ><
https://jenkins.osmocom.org/jenkins/job/ttcn3-5gc-test-ogs-latest/297/artif…
> 2>/tmp/cmderr & Waiting for packet dumper to start... 0 MTC@34589de6d3da: External command `<
https://jenkins.osmocom.org/jenkins/job/ttcn3-5gc-test-ogs-latest/ws/src/os…
> C5G_Tests.TC_emergency_registration' was executed successfully (exit status: 0). MTC@34589de6d3da: Test case TC_emergency_registration started. GTP1U_EM(865)@34589de6d3da: Warning: sizes of 'struct sctp_event_subscribe': compile-time 14, kernel: 14 GTP1U_EM(865)@34589de6d3da: setverdict(fail): none -> fail reason: "Could not connect UECUPS socket, check your configuration", new component reason: "Could not connect UECUPS socket, check your configuration" GTP1U_EM(865)@34589de6d3da: Dynamic test case error: testcase.stop GTP1U_EM(865)@34589de6d3da: setverdict(error): fail -> error GTP1U_EM(865)@34589de6d3da: Final verdict of PTC: error TC_emergency_registration-NGAP0(866)@34589de6d3da: Warning: sizes of 'struct sctp_event_subscribe': compile-time 14, kernel: 14 [32m09/05 13:47:06.471[0m: [[33mamf[0m] [1;32mINFO[0m: gNB-N2 accepted[127.0.0.202]:50000 in ng-path module (../src/amf/ngap-sctp.c:113) [32m09/05 13:47:06.471[0m: [[33mamf[0m] [1;37mDEBUG[0m: amf_state_operational(): AMF_EVENT_NGAP_LO_ACCEPT (../src/amf/amf-sm.c:83) [32m09/05 13:47:06.471[0m: [[33mamf[0m] [1;32mINFO[0m: gNB-N2 accepted[127.0.0.202] in master_sm module (../src/amf/amf-sm.c:818) [32m09/05 13:47:06.476[0m: [[33mamf[0m] [1;37mDEBUG[0m: ngap_state_initial(): ENTRY (../src/amf/ngap-sm.c:28) [32m09/05 13:47:06.476[0m: [[33mamf[0m] [1;37mDEBUG[0m: ngap_state_operational(): ENTRY (../src/amf/ngap-sm.c:55) [32m09/05 13:47:06.476[0m: [[33mamf[0m] [1;32mINFO[0m: [Added] Number of gNBs is now 1 (../src/amf/context.c:1277) [32m09/05 13:47:06.476[0m: [[33mamf[0m] [1;37mDEBUG[0m: SCTP_ASSOC_CHANGE:[T:32769, F:0x0, S:0, I/O:64/30] (../src/amf/ngap-sctp.c:152) [32m09/05 13:47:06.476[0m: [[33mamf[0m] [1;37mDEBUG[0m: SCTP_COMM_UP (../src/amf/ngap-sctp.c:161) [32m09/05 13:47:06.476[0m: [[33mamf[0m] [1;37mDEBUG[0m: amf_state_operational(): AMF_EVENT_NGAP_LO_SCTP_COMM_UP (../src/amf/amf-sm.c:83) [32m09/05 13:47:06.476[0m: [[33mamf[0m] [1;32mINFO[0m: gNB-N2[127.0.0.202] max_num_of_ostreams : 30 (../src/amf/amf-sm.c:865) TC_emergency_registration-NGAP1(867)@34589de6d3da: Warning: sizes of 'struct sctp_event_subscribe': compile-time 14, kernel: 14 [32m09/05 13:47:06.480[0m: [[33mamf[0m] [1;32mINFO[0m: gNB-N2 accepted[127.0.0.202]:50001 in ng-path module (../src/amf/ngap-sctp.c:113) [32m09/05 13:47:06.480[0m: [[33mamf[0m] [1;37mDEBUG[0m: amf_state_operational(): AMF_EVENT_NGAP_LO_ACCEPT (../src/amf/amf-sm.c:83) [32m09/05 13:47:06.480[0m: [[33mamf[0m] [1;32mINFO[0m: gNB-N2 accepted[127.0.0.202] in master_sm module (../src/amf/amf-sm.c:818) [32m09/05 13:47:06.484[0m: [[33mamf[0m] [1;37mDEBUG[0m: ngap_state_initial(): ENTRY (../src/amf/ngap-sm.c:28) [32m09/05 13:47:06.484[0m: [[33mamf[0m] [1;37mDEBUG[0m: ngap_state_operational(): ENTRY (../src/amf/ngap-sm.c:55) [32m09/05 13:47:06.484[0m: [[33mamf[0m] [1;32mINFO[0m: [Added] Number of gNBs is now 2 (../src/amf/context.c:1277) [32m09/05 13:47:06.484[0m: [[33mamf[0m] [1;37mDEBUG[0m: SCTP_ASSOC_CHANGE:[T:32769, F:0x0, S:0, I/O:64/30] (../src/amf/ngap-sctp.c:152) [32m09/05 13:47:06.484[0m: [[33mamf[0m] [1;37mDEBUG[0m: SCTP_COMM_UP (../src/amf/ngap-sctp.c:161) [32m09/05 13:47:06.484[0m: [[33mamf[0m] [1;37mDEBUG[0m: amf_state_operational(): AMF_EVENT_NGAP_LO_SCTP_COMM_UP (../src/amf/amf-sm.c:83) [32m09/05 13:47:06.484[0m: [[33mamf[0m] [1;32mINFO[0m: gNB-N2[127.0.0.202] max_num_of_ostreams : 30 (../src/amf/amf-sm.c:865) [32m09/05 13:47:06.488[0m: [[33mamf[0m] [1;37mDEBUG[0m: amf_state_operational(): AMF_EVENT_NGAP_MESSAGE (../src/amf/amf-sm.c:83) [32m09/05 13:47:06.488[0m: [[33mamf[0m] [1;37mDEBUG[0m: ngap_state_operational(): AMF_EVENT_NGAP_MESSAGE (../src/amf/ngap-sm.c:55) [32m09/05 13:47:06.488[0m: [[33mamf[0m] [1;37mDEBUG[0m: NGSetupRequest (../src/amf/ngap-handler.c:288) [32m09/05 13:47:06.488[0m: [[33mamf[0m] [1;37mDEBUG[0m: IP[127.0.0.202] GNB_ID[0x0] GNB_ID_LENGTH[22] (../src/amf/ngap-handler.c:386) [32m09/05 13:47:06.488[0m: [[33mamf[0m] [1;37mDEBUG[0m: PLMN_ID[MCC:999 MNC:70] (../src/amf/ngap-handler.c:391) [32m09/05 13:47:06.488[0m: [[33mamf[0m] [1;37mDEBUG[0m: PagingDRX[0] (../src/amf/ngap-handler.c:395) [32m09/05 13:47:06.488[0m: [[33mamf[0m] [1;37mDEBUG[0m: TAC[1] (../src/amf/ngap-handler.c:439) [32m09/05 13:47:06.488[0m: [[33mamf[0m] [1;37mDEBUG[0m: PLMN_ID[MCC:999 MNC:70] (../src/amf/ngap-handler.c:501) [32m09/05 13:47:06.488[0m: [[33mamf[0m] [1;37mDEBUG[0m: S_NSSAI[SST:1 SD:0xffffff] (../src/amf/ngap-handler.c:562) [32m09/05 13:47:06.488[0m: [[33mamf[0m] [1;37mDEBUG[0m: TAC[1] (../src/amf/ngap-handler.c:72) [32m09/05 13:47:06.488[0m: [[33mamf[0m] [1;37mDEBUG[0m: PLMN_ID[MCC:999 MNC:70] (../src/amf/ngap-handler.c:73) [32m09/05 13:47:06.488[0m: [[33mamf[0m] [1;37mDEBUG[0m: SERVED_TAI_INDEX[0] (../src/amf/ngap-handler.c:78) [32m09/05 13:47:06.488[0m: [[33mamf[0m] [1;37mDEBUG[0m: PLMN_ID[MCC:999 MNC:70] (../src/amf/ngap-handler.c:100) [32m09/05 13:47:06.488[0m: [[33mamf[0m] [1;37mDEBUG[0m: S_NSSAI[SST:1 SD:0xffffff] (../src/amf/ngap-handler.c:105) [32m09/05 13:47:06.488[0m: [[33mamf[0m] [1;37mDEBUG[0m: NG-Setup response (../src/amf/ngap-path.c:356) [32m09/05 13:47:06.488[0m: [[33mamf[0m] [1;37mDEBUG[0m: NGSetupResponse (../src/amf/ngap-build.c:91) [32m09/05 13:47:06.488[0m: [[33mamf[0m] [1;37mDEBUG[0m: IP[127.0.0.202] RAN_ID[0] (../src/amf/ngap-path.c:64) MTC@34589de6d3da: setverdict(pass): none -> pass MTC@34589de6d3da: Dynamic test case error: Error message was received from MC: The connect operation refers to test component with component reference 865, which has already terminated. MTC@34589de6d3da: setverdict(error): pass -> error [32m09/05 13:47:06.496[0m: [[33mamf[0m] [1;37mDEBUG[0m: SCTP_SHUTDOWN_EVENT:[T:32773, F:0x0, L:12] (../src/amf/ngap-sctp.c:193) [32m09/05 13:47:06.496[0m: [[33mamf[0m] [1;37mDEBUG[0m: amf_state_operational(): AMF_EVENT_NGAP_LO_CONNREFUSED (../src/amf/amf-sm.c:83) [32m09/05 13:47:06.496[0m: [[33mamf[0m] [1;32mINFO[0m: gNB-N2[127.0.0.202] connection refused!!! (../src/amf/amf-sm.c:878) [32m09/05 13:47:06.496[0m: [[33mamf[0m] [1;37mDEBUG[0m: ngap_state_operational(): EXIT (../src/amf/ngap-sm.c:55) [32m09/05 13:47:06.496[0m: [[33mamf[0m] [1;37mDEBUG[0m: ngap_state_final(): EXIT (../src/amf/ngap-sm.c:37) TC_emergency_registration0(868)@34589de6d3da: Final verdict of PTC: none [32m09/05 13:47:06.496[0m: [[33mamf[0m] [1;32mINFO[0m: [Removed] Number of gNBs is now 1 (../src/amf/context.c:1305) [32m09/05 13:47:06.496[0m: [[33mamf[0m] [1;37mDEBUG[0m: SCTP_SHUTDOWN_EVENT:[T:32773, F:0x0, L:12] (../src/amf/ngap-sctp.c:193) [32m09/05 13:47:06.496[0m: [[33mamf[0m] [1;37mDEBUG[0m: amf_state_operational(): AMF_EVENT_NGAP_LO_CONNREFUSED (../src/amf/amf-sm.c:83) [32m09/05 13:47:06.496[0m: [[33mamf[0m] [1;32mINFO[0m: gNB-N2[127.0.0.202] connection refused!!! (../src/amf/amf-sm.c:878) [32m09/05 13:47:06.496[0m: [[33mamf[0m] [1;37mDEBUG[0m: ngap_state_operational(): EXIT (../src/amf/ngap-sm.c:55) [32m09/05 13:47:06.496[0m: [[33mamf[0m] [1;37mDEBUG[0m: ngap_state_final(): EXIT (../src/amf/ngap-sm.c:37) [32m09/05 13:47:06.496[0m: [[33mamf[0m] [1;32mINFO[0m: [Removed] Number of gNBs is now 0 (../src/amf/context.c:1305) TC_emergency_registration-NGAP1(867)@34589de6d3da: Final verdict of PTC: none TC_emergency_registration-NGAP0(866)@34589de6d3da: Final verdict of PTC: none MTC@34589de6d3da: Setting final verdict of the test case. MTC@34589de6d3da: Local verdict of MTC: error MTC@34589de6d3da: Local verdict of PTC GTP1U_EM(865): error (error -> error) MTC@34589de6d3da: Local verdict of PTC TC_emergency_registration-NGAP0(866): none (error -> error) MTC@34589de6d3da: Local verdict of PTC TC_emergency_registration-NGAP1(867): none (error -> error) MTC@34589de6d3da: Local verdict of PTC TC_emergency_registration0(868): none (error -> error) MTC@34589de6d3da: Test case TC_emergency_registration finished. Verdict: error MTC@34589de6d3da: Starting external command `<
https://jenkins.osmocom.org/jenkins/job/ttcn3-5gc-test-ogs-latest/ws/src/os…
> C5G_Tests.TC_emergency_registration error'. (13:47:06) load average: 3.51, 2.79, 2.35 [1;31m------ C5G_Tests.TC_emergency_registration error ------[0m Waiting for packet dumper to finish... 0 (prev_count=-1, count=440) Waiting for packet dumper to finish... 1 (prev_count=440, count=4676) MTC@34589de6d3da: External command `<
https://jenkins.osmocom.org/jenkins/job/ttcn3-5gc-test-ogs-latest/ws/src/os…
> C5G_Tests.TC_emergency_registration error' was executed successfully (exit status: 0). MTC@34589de6d3da: Starting external command `<
https://jenkins.osmocom.org/jenkins/job/ttcn3-5gc-test-ogs-latest/ws/src/os…
> C5G_Tests.TC_handover_inter_ngran_n2'. ------ C5G_Tests.TC_handover_inter_ngran_n2 ------ (13:47:08) load average: 3.31, 2.76, 2.34 /usr/bin/dumpcap -q -s 1520 -n -i any -w "<
https://jenkins.osmocom.org/jenkins/job/ttcn3-5gc-test-ogs-latest/297/artif…
"> ><
https://jenkins.osmocom.org/jenkins/job/ttcn3-5gc-test-ogs-latest/297/artif…
> 2>/tmp/cmderr & Waiting for packet dumper to start... 0 [1;34m[testenv] Stopping podman container[0m [0;94m[testenv] + ['podman', 'kill', 'testenv-5gc-osmocom-latest-20260905-1343-7b528284-1'][0m testenv-5gc-osmocom-latest-20260905-1343-7b528284-1 [0;94m[testenv] Skipping clean up scripts, podman container has already stopped[0m [1;34m[testenv] Stopping testsuite (725954)[0m Error: container has already been removed Error: container has already been removed Error: container has already been removed Error: container has already been removed Error: container has already been removed [0;94m[testenv] feed_watchdog_loop: podman container has stopped[0m [1;34m[testenv] Logs saved to:
https://jenkins.osmocom.org/jenkins/job/ttcn3-5gc-test-ogs-latest/297/artif…
[0m + RC=1 + [ 1 = 0 ] + uptime + grep --color=always -o load.* [01;31m[Kload average: 3.31, 2.76, 2.34[m[K + exit 1 Build step 'Execute shell' marked build as failure Recording test results [Checks API] No suitable checks publisher found.
1
0
0
0
Build failed in Jenkins: ttcn3-bts-test-asan #812
by jenkins@lists.osmocom.org
05 Sep '26
05 Sep '26
See <
https://jenkins.osmocom.org/jenkins/job/ttcn3-bts-test-asan/812/display/red…
> Changes: ------------------------------------------ [...truncated 12.42 MiB...] <failure type='fail-verdict'>"BTS_Tests.ttcn:732 : Tguard timeout" BTS_Tests.ttcn:9557 BTS_Tests control part BTS_Tests.ttcn:7525 TC_rll_rel_req testcase </failure> </testcase> <testcase classname='BTS_Tests:hopping' name='TC_rll_unit_data_req_DCCH' time='2.373098'/> <testcase classname='BTS_Tests:hopping' name='TC_rll_unit_data_req_ACCH' time='5.330908'/> <testcase classname='BTS_Tests:hopping' name='TC_rll_unit_data_ind_DCCH' time='2.902570'/> <testcase classname='BTS_Tests:hopping' name='TC_rll_unit_data_ind_ACCH' time='10.589984'/> <testcase classname='BTS_Tests:hopping' name='TC_chan_act_a51' time='2.644789'/> <testcase classname='BTS_Tests:hopping' name='TC_chan_act_a52' time='2.732014'/> <testcase classname='BTS_Tests:hopping' name='TC_chan_act_a53' time='2.719138'/> <testcase classname='BTS_Tests:hopping' name='TC_chan_act_a54' time='2.778889'/> <testcase classname='BTS_Tests:hopping' name='TC_encr_cmd_a51' time='5.245847'/> <testcase classname='BTS_Tests:hopping' name='TC_encr_cmd_a52' time='5.225019'/> <testcase classname='BTS_Tests:hopping' name='TC_encr_cmd_a53' time='5.217072'/> <testcase classname='BTS_Tests:hopping' name='TC_encr_cmd_a54' time='5.235731'/> <testcase classname='BTS_Tests:hopping' name='TC_err_rep_wrong_mdisc' time='1.231386'/> <testcase classname='BTS_Tests:hopping' name='TC_err_rep_wrong_msg_type' time='1.293920'/> <testcase classname='BTS_Tests:hopping' name='TC_err_rep_wrong_sequence' time='1.287850'/> <testcase classname='BTS_Tests:hopping' name='TC_lapdm_selftest' time='0.024934'/> <testcase classname='BTS_Tests:hopping' name='TC_tch_sign_l2_fill_frame' time='18.414402'/> <testcase classname='BTS_Tests:hopping' name='TC_tch_sign_l2_fill_frame_dtxd' time='2.135621'> <failure type='fail-verdict'>Received DTX TCH fill frame with bad frame number: 175 (mod 104: 71) (mod 26: 19) BTS_Tests.ttcn:9579 BTS_Tests control part BTS_Tests.ttcn:8110 TC_tch_sign_l2_fill_frame_dtxd testcase </failure> </testcase> <testcase classname='BTS_Tests:hopping' name='TC_chopped_ipa_ping' time='24.721468'/> <testcase classname='BTS_Tests:hopping' name='TC_chopped_ipa_payload' time='42.610791'/> <testcase classname='BTS_Tests:hopping' name='TC_ms_pwr_ctrl_constant' time='16.890380'/> <testcase classname='BTS_Tests:hopping' name='TC_ms_pwr_ctrl_pf_ewma' time='32.004907'/> <testcase classname='BTS_Tests:hopping' name='TC_speech_no_rtp_tchf' time='7.418268'/> <testcase classname='BTS_Tests:hopping' name='TC_speech_no_rtp_tchh' time='5.450701'/> <testcase classname='BTS_Tests:hopping' name='TC_speech_rtp_tchf' time='7.712212'/> <testcase classname='BTS_Tests:hopping' name='TC_speech_rtp_tchh' time='5.472445'/> <testcase classname='BTS_Tests:hopping' name='TC_speech_osmux_tchf' time='3.389859'/> <testcase classname='BTS_Tests:hopping' name='TC_speech_osmux_tchh' time='3.446470'/> <testcase classname='BTS_Tests:hopping' name='TC_data_rtp_tchf144' time='2.085045'/> <testcase classname='BTS_Tests:hopping' name='TC_data_rtp_tchf96' time='2.225284'/> <testcase classname='BTS_Tests:hopping' name='TC_data_rtp_tchf48' time='2.226826'/> <testcase classname='BTS_Tests:hopping' name='TC_data_rtp_tchh48' time='5.303300'> <failure type='fail-verdict'>Timeout waiting for matching Downlink data frame BTS_Tests.ttcn:9597 BTS_Tests control part BTS_Tests.ttcn:8880 TC_data_rtp_tchh48 testcase </failure> </testcase> <testcase classname='BTS_Tests:hopping' name='TC_data_rtp_tchf24' time='1.810828'/> <testcase classname='BTS_Tests:hopping' name='TC_data_rtp_tchh24' time='5.346409'> <failure type='fail-verdict'>Timeout waiting for matching Downlink data frame BTS_Tests.ttcn:9599 BTS_Tests control part BTS_Tests.ttcn:8949 TC_data_rtp_tchh24 testcase </failure> </testcase> <testcase classname='BTS_Tests:hopping' name='TC_data_facch_tchf144' time='2.003592'/> <testcase classname='BTS_Tests:hopping' name='TC_data_facch_tchf96' time='2.025395'/> <testcase classname='BTS_Tests:hopping' name='TC_data_facch_tchf48' time='2.038871'/> <testcase classname='BTS_Tests:hopping' name='TC_data_facch_tchh48' time='2.168423'/> <testcase classname='BTS_Tests:hopping' name='TC_data_facch_tchf24' time='2.114960'/> <testcase classname='BTS_Tests:hopping' name='TC_data_facch_tchh24' time='2.183181'/> <testcase classname='BTS_Tests:hopping' name='TC_early_immediate_assignment' time='3.565384'/> <testcase classname='BTS_Tests:hopping' name='TC_acch_overpower_rxqual_thresh' time='9.085471'> <failure type='fail-verdict'>Timeout waiting for L1CTL DATA.ind BTS_Tests.ttcn:9610 BTS_Tests control part BTS_Tests.ttcn:9244 TC_acch_overpower_rxqual_thresh testcase </failure> </testcase> <testcase classname='BTS_Tests:hopping' name='TC_acch_overpower_rxqual_thresh_dtx' time='9.038736'> <failure type='fail-verdict'>Timeout waiting for L1CTL DATA.ind BTS_Tests.ttcn:9611 BTS_Tests control part BTS_Tests.ttcn:9285 TC_acch_overpower_rxqual_thresh_dtx testcase </failure> </testcase> <testcase classname='BTS_Tests:hopping' name='TC_acch_overpower_always_on_facch' time='9.025439'> <failure type='fail-verdict'>Timeout waiting for L1CTL DATA.ind BTS_Tests.ttcn:9612 BTS_Tests control part BTS_Tests.ttcn:9317 TC_acch_overpower_always_on_facch testcase </failure> </testcase> <testcase classname='BTS_Tests:hopping' name='TC_acch_overpower_always_on_sacch' time='9.048964'> <failure type='fail-verdict'>Timeout waiting for L1CTL DATA.ind BTS_Tests.ttcn:9613 BTS_Tests control part BTS_Tests.ttcn:9349 TC_acch_overpower_always_on_sacch testcase </failure> </testcase> <testcase classname='BTS_Tests:hopping' name='TC_acch_overpower_limit' time='9.047440'> <failure type='fail-verdict'>Timeout waiting for L1CTL DATA.ind BTS_Tests.ttcn:9614 BTS_Tests control part BTS_Tests.ttcn:9380 TC_acch_overpower_limit testcase </failure> </testcase> <testcase classname='BTS_Tests_SMSCB:hopping' name='TC_cbch_load_idle_no_cbch' time='11.165898'/> <testcase classname='BTS_Tests_SMSCB:hopping' name='TC_sms_cb_cmd_sdcch4_1block' time='14.263999'/> <testcase classname='BTS_Tests_SMSCB:hopping' name='TC_sms_cb_cmd_sdcch4_2block' time='14.201127'/> <testcase classname='BTS_Tests_SMSCB:hopping' name='TC_sms_cb_cmd_sdcch4_3block' time='14.218588'/> <testcase classname='BTS_Tests_SMSCB:hopping' name='TC_sms_cb_cmd_sdcch4_4block' time='14.225706'/> <testcase classname='BTS_Tests_SMSCB:hopping' name='TC_sms_cb_cmd_sdcch4_multi' time='20.222077'/> <testcase classname='BTS_Tests_SMSCB:hopping' name='TC_sms_cb_cmd_sdcch4_schedule' time='14.143212'/> <testcase classname='BTS_Tests_SMSCB:hopping' name='TC_sms_cb_cmd_sdcch4_default_only' time='16.211399'/> <testcase classname='BTS_Tests_SMSCB:hopping' name='TC_sms_cb_cmd_sdcch4_default_and_normal' time='17.193154'/> <testcase classname='BTS_Tests_SMSCB:hopping' name='TC_sms_cb_cmd_sdcch4_default_then_null' time='26.174242'/> <testcase classname='BTS_Tests_SMSCB:hopping' name='TC_cbc_sdcch4_load_idle' time='16.058773'/> <testcase classname='BTS_Tests_SMSCB:hopping' name='TC_cbc_sdcch4_load_overload' time='18.220937'/> <testcase classname='BTS_Tests_SMSCB:hopping' name='TC_sms_cb_cmd_sdcch8_1block' time='14.258377'/> <testcase classname='BTS_Tests_SMSCB:hopping' name='TC_sms_cb_cmd_sdcch8_2block' time='14.228796'/> <testcase classname='BTS_Tests_SMSCB:hopping' name='TC_sms_cb_cmd_sdcch8_3block' time='14.211236'/> <testcase classname='BTS_Tests_SMSCB:hopping' name='TC_sms_cb_cmd_sdcch8_4block' time='14.210475'/> <testcase classname='BTS_Tests_SMSCB:hopping' name='TC_sms_cb_cmd_sdcch8_multi' time='20.207725'/> <testcase classname='BTS_Tests_SMSCB:hopping' name='TC_sms_cb_cmd_sdcch8_schedule' time='14.197506'/> <testcase classname='BTS_Tests_SMSCB:hopping' name='TC_sms_cb_cmd_sdcch8_default_only' time='16.235928'/> <testcase classname='BTS_Tests_SMSCB:hopping' name='TC_sms_cb_cmd_sdcch8_default_and_normal' time='17.243045'/> <testcase classname='BTS_Tests_SMSCB:hopping' name='TC_cbc_sdcch8_load_idle' time='16.269774'/> <testcase classname='BTS_Tests_SMSCB:hopping' name='TC_cbc_sdcch8_load_overload' time='18.173098'/> <testcase classname='BTS_Tests_SMSCB:hopping' name='TC_etws_p1ro' time='12.184144'/> <testcase classname='BTS_Tests_SMSCB:hopping' name='TC_etws_p1ro_end' time='16.171305'/> <testcase classname='BTS_Tests_SMSCB:hopping' name='TC_etws_pcu' time='1.160426'/> <testcase classname='BTS_Tests_LAPDm:hopping' name='TC_sabm_ua_dcch_sapi0' time='2.898619'/> <testcase classname='BTS_Tests_LAPDm:hopping' name='TC_sabm_ua_dcch_sapi0_nopayload' time='21.410426'/> <testcase classname='BTS_Tests_LAPDm:hopping' name='TC_sabm_ua_dcch_sapi3' time='21.378200'/> <testcase classname='BTS_Tests_LAPDm:hopping' name='TC_sabm_ua_dcch_sapi4' time='21.367184'/> <testcase classname='BTS_Tests_LAPDm:hopping' name='TC_sabm_contention' time='21.355938'/> <testcase classname='BTS_Tests_LAPDm:hopping' name='TC_sabm_retransmit' time='3.157656'/> <testcase classname='BTS_Tests_LAPDm:hopping' name='TC_sabm_retransmit_bts' time='81.479848'/> <testcase classname='BTS_Tests_LAPDm:hopping' name='TC_sabm_invalid_resp' time='23.381008'/> <testcase classname='BTS_Tests_LAPDm:hopping' name='TC_sabm_dm' time='14.016584'/> <testcase classname='BTS_Tests_LAPDm:hopping' name='TC_establish_ign_first_sabm' time='8.181511'/> <testcase classname='BTS_Tests_LAPDm:hopping' name='TC_iframe_seq_and_ack' time='29.586355'> <failure type='fail-verdict'>Received RSL ERROR IND { msg_disc := { msg_group := RSL_MDISC_RLL (1), transparent := false }, msg_type := RSL_MT_ERROR_IND (3), ies := { { iei := RSL_IE_CHAN_NR (1), body := { chan_nr := { u := { sdcch8 := { tag := '01'B, sub_chan := 4 } }, tn := 6 } } }, { iei := RSL_IE_LINK_IDENT (2), body := { link_id := { c := FACCH_SDCCH (0), na := false, prio := SAPI0_PRIO_NORMAL (0), sapi := 0 } } }, { iei := RSL_IE_RLM_CAUSE (22), body := { rlm_cause := { len := 1, payload := '01'O } } } } } BTS_Tests_LAPDm.ttcn:1484 BTS_Tests_LAPDm control part BTS_Tests_LAPDm.ttcn:579 TC_iframe_seq_and_ack testcase </failure> </testcase> <testcase classname='BTS_Tests_LAPDm:hopping' name='TC_iframe_timer_recovery' time='24.609387'> <failure type='fail-verdict'>Received RSL ERROR IND { msg_disc := { msg_group := RSL_MDISC_RLL (1), transparent := false }, msg_type := RSL_MT_ERROR_IND (3), ies := { { iei := RSL_IE_CHAN_NR (1), body := { chan_nr := { u := { sdcch8 := { tag := '01'B, sub_chan := 4 } }, tn := 6 } } }, { iei := RSL_IE_LINK_IDENT (2), body := { link_id := { c := FACCH_SDCCH (0), na := false, prio := SAPI0_PRIO_NORMAL (0), sapi := 0 } } }, { iei := RSL_IE_RLM_CAUSE (22), body := { rlm_cause := { len := 1, payload := '01'O } } } } } BTS_Tests_LAPDm.ttcn:1485 BTS_Tests_LAPDm control part BTS_Tests_LAPDm.ttcn:685 TC_iframe_timer_recovery testcase </failure> </testcase> <testcase classname='BTS_Tests_LAPDm:hopping' name='TC_ns_seq_error' time='29.620082'> <failure type='fail-verdict'>"BTS_Tests.ttcn:732 : Tguard timeout" BTS_Tests_LAPDm.ttcn:1486 BTS_Tests_LAPDm control part BTS_Tests_LAPDm.ttcn:768 TC_ns_seq_error testcase </failure> </testcase> <testcase classname='BTS_Tests_LAPDm:hopping' name='TC_nr_seq_error' time='2.891266'/> <testcase classname='BTS_Tests_LAPDm:hopping' name='TC_rec_invalid_frame' time='119.187293'> <failure type='fail-verdict'>"BTS_Tests_LAPDm.ttcn:909 : Missing LAPDm_RR RSP" BTS_Tests_LAPDm.ttcn:1488 BTS_Tests_LAPDm control part BTS_Tests_LAPDm.ttcn:961 TC_rec_invalid_frame testcase </failure> </testcase> <testcase classname='BTS_Tests_LAPDm:hopping' name='TC_segm_concat_dcch' time='13.491471'> <failure type='fail-verdict'>"BTS_Tests_LAPDm.ttcn:1023 : received unexpected LAPDm { sacch := false, sapi := 0, lapdm := { ab := { addr := { spare := '0'B, lpd := 0, sapi := 0, c_r := false, ea := true }, ctrl := { s := { n_r := 1, p_f := false, s := '10'B, spare := '01'B } }, len := 0, m := false, el := 1, payload := ''O, padding := '2B2B2B2B2B2B2B2B2B2B2B2B2B2B2B2B2B2B2B2B'O (\"++++++++++++++++++++\") } } }" BTS_Tests_LAPDm.ttcn:1489 BTS_Tests_LAPDm control part BTS_Tests_LAPDm.ttcn:1088 TC_segm_concat_dcch testcase </failure> </testcase> <testcase classname='BTS_Tests_LAPDm:hopping' name='TC_segm_concat_sacch' time='48.543256'> <failure type='fail-verdict'>"BTS_Tests_LAPDm.ttcn:1023 : received unexpected LAPDm { sacch := true, sapi := 0, lapdm := { ab := { addr := { spare := '0'B, lpd := 0, sapi := 0, c_r := false, ea := true }, ctrl := { u := { u := '011'B, p_f := true, u2 := '00'B, spare := '11'B } }, len := 0, m := false, el := 1, payload := ''O, padding := '2B2B2B2B2B2B2B2B2B2B2B2B2B2B2B2B2B2B'O (\"++++++++++++++++++\") } } }" BTS_Tests_LAPDm.ttcn:1490 BTS_Tests_LAPDm control part BTS_Tests_LAPDm.ttcn:1093 TC_segm_concat_sacch testcase </failure> </testcase> <testcase classname='BTS_Tests_LAPDm:hopping' name='TC_t200_n200' time='39.841087'> <failure type='fail-verdict'>Missing RSL RLL ERROR INDICATION BTS_Tests_LAPDm.ttcn:1491 BTS_Tests_LAPDm control part BTS_Tests_LAPDm.ttcn:1182 TC_t200_n200 testcase </failure> </testcase> <testcase classname='BTS_Tests_LAPDm:hopping' name='TC_rr_response_frame_loss' time='6.702552'> <failure type='fail-verdict'>Timeout waiting for RR or REJ BTS_Tests_LAPDm.ttcn:1492 BTS_Tests_LAPDm control part BTS_Tests_LAPDm.ttcn:1239 TC_rr_response_frame_loss testcase </failure> </testcase> <testcase classname='BTS_Tests_LAPDm:hopping' name='TC_incorrect_cr' time='15.828958'/> <testcase classname='BTS_Tests_LAPDm:hopping' name='TC_sabm_incorrect_c' time='23.319016'> <failure type='fail-verdict'>"BTS_Tests.ttcn:732 : Tguard timeout" BTS_Tests_LAPDm.ttcn:1494 BTS_Tests_LAPDm control part BTS_Tests_LAPDm.ttcn:1341 TC_sabm_incorrect_c testcase </failure> </testcase> <testcase classname='BTS_Tests_LAPDm:hopping' name='TC_normal_reestablishment' time='16.129681'> <failure type='fail-verdict'>"BTS_Tests_LAPDm.ttcn:1023 : received unexpected LAPDm { sacch := false, sapi := 0, lapdm := { ab := { addr := { spare := '0'B, lpd := 0, sapi := 0, c_r := false, ea := true }, ctrl := { u := { u := '011'B, p_f := true, u2 := '00'B, spare := '11'B } }, len := 5, m := false, el := 1, payload := '933879BAFD'O, padding := '2B2B2B2B2B2B2B2B2B2B2B2B2B2B2B'O (\"+++++++++++++++\") } } }" BTS_Tests_LAPDm.ttcn:1495 BTS_Tests_LAPDm control part BTS_Tests_LAPDm.ttcn:1403 TC_normal_reestablishment testcase </failure> </testcase> <testcase classname='BTS_Tests_LAPDm:hopping' name='TC_normal_reestablishment_state_unacked' time='30.155476'> <failure type='fail-verdict'>"BTS_Tests.ttcn:732 : Tguard timeout" BTS_Tests_LAPDm.ttcn:1496 BTS_Tests_LAPDm control part BTS_Tests_LAPDm.ttcn:1470 TC_normal_reestablishment_state_unacked testcase </failure> </testcase> <testcase classname='BTS_Tests_VAMOS:hopping' name='TC_vamos_chan_act_vff' time='2.326826'/> <testcase classname='BTS_Tests_VAMOS:hopping' name='TC_vamos_chan_act_vhh' time='2.573868'/> <testcase classname='BTS_Tests_VAMOS:hopping' name='TC_vamos_chan_act_hvhh' time='2.602642'/> <testcase classname='BTS_Tests_VAMOS:hopping' name='TC_vamos_chan_act_dyn_ipa_vff' time='2.534408'/> <testcase classname='BTS_Tests_VAMOS:hopping' name='TC_vamos_chan_act_dyn_osmo_vff' time='2.551156'/> <testcase classname='BTS_Tests_VAMOS:hopping' name='TC_vamos_chan_act_dyn_osmo_vhh' time='2.565129'/> <testcase classname='BTS_Tests_VAMOS:hopping' name='TC_vamos_chan_act_dyn_osmo_hvhh' time='2.596324'/> <testcase classname='BTS_Tests_VAMOS:hopping' name='TC_vamos_chan_mode_modify_vff' time='1.442022'/> <testcase classname='BTS_Tests_VAMOS:hopping' name='TC_vamos_chan_mode_modify_vhh' time='1.424091'/> <testcase classname='BTS_Tests_VAMOS:hopping' name='TC_vamos_chan_mode_modify_hvhh' time='1.396116'/> <testcase classname='BTS_Tests_VAMOS:hopping' name='TC_vamos_chan_mode_modify_dyn_ipa_vff' time='1.403146'/> <testcase classname='BTS_Tests_VAMOS:hopping' name='TC_vamos_chan_mode_modify_dyn_osmo_vff' time='1.409918'/> <testcase classname='BTS_Tests_VAMOS:hopping' name='TC_vamos_chan_mode_modify_dyn_osmo_vhh' time='1.395328'/> <testcase classname='BTS_Tests_VAMOS:hopping' name='TC_vamos_chan_mode_modify_dyn_osmo_hvhh' time='1.397584'/> <testcase classname='BTS_Tests_ASCI:hopping' name='TC_vbs_notification' time='4.699305'/> <testcase classname='BTS_Tests_ASCI:hopping' name='TC_vgcs_uplink_free_and_busy' time='1.863686'/> <testcase classname='BTS_Tests_ASCI:hopping' name='TC_vgcs_talker_fail' time='17.033063'/> <testcase classname='BTS_Tests_ASCI:hopping' name='TC_vgcs_talker_est_rel' time='1.443104'/> <testcase classname='BTS_Tests_ASCI:hopping' name='TC_vgcs_listener_det' time='3.398710'/> </testsuite> <?xml version="1.0"?> <testsuite name='Titan' tests='17' failures='0' errors='0' skipped='0' inconc='0' time='96.00'> <testcase classname='BTS_Tests_OML' name='TC_wrong_mdisc' time='10.539216'/> <testcase classname='BTS_Tests_OML' name='TC_wrong_msgtype' time='0.720563'/> <testcase classname='BTS_Tests_OML' name='TC_short_length' time='0.731551'/> <testcase classname='BTS_Tests_OML' name='TC_long_length' time='0.664386'/> <testcase classname='BTS_Tests_OML' name='TC_wrong_placement' time='0.712925'/> <testcase classname='BTS_Tests_OML' name='TC_wrong_seq' time='0.716765'/> <testcase classname='BTS_Tests_OML' name='TC_wrong_obj_class' time='0.728146'/> <testcase classname='BTS_Tests_OML' name='TC_wrong_bts_nr' time='0.711867'/> <testcase classname='BTS_Tests_OML' name='TC_wrong_trx_nr' time='0.723465'/> <testcase classname='BTS_Tests_OML' name='TC_radio_carrier_opstart_noattr' time='0.712367'/> <testcase classname='BTS_Tests_OML' name='TC_bts_opstart' time='0.719342'/> <testcase classname='BTS_Tests_OML' name='TC_bts_opstart_noattr' time='0.712622'/> <testcase classname='BTS_Tests_OML' name='TC_ts_opstart' time='0.676661'/> <testcase classname='BTS_Tests_OML' name='TC_ts_opstart_noattr' time='0.710295'/> <testcase classname='BTS_Tests_OML' name='TC_initial_state_reports' time='0.698709'/> <testcase classname='BTS_Tests_OML' name='TC_ipa_osmo_pcu_anr_fwd' time='0.713347'/> <testcase classname='BTS_Tests_OML' name='TC_ipa_rsl_connect_nack' time='0.726393'/> </testsuite> + check_respawn_count + set +x [0;31m ================================================================ WARNING: osmo-bts was respawned 4 times (expected: 3)! (OS#6794) ================================================================ [0m+ RC=1 + uptime + grep --color=always -o load.* [01;31m[Kload average: 0.31, 0.45, 0.51[m[K + exit 1 Build step 'Execute shell' marked build as failure Recording test results [Checks API] No suitable checks publisher found.
1
4
0
0
Build failed in Jenkins: ttcn3-bts-test-latest #2899
by jenkins@lists.osmocom.org
05 Sep '26
05 Sep '26
See <
https://jenkins.osmocom.org/jenkins/job/ttcn3-bts-test-latest/2899/display/…
> Changes: ------------------------------------------ [...truncated 12.34 MiB...] <failure type='fail-verdict'>"BTS_Tests.ttcn:732 : Tguard timeout" BTS_Tests.ttcn:9557 BTS_Tests control part BTS_Tests.ttcn:7525 TC_rll_rel_req testcase </failure> </testcase> <testcase classname='BTS_Tests:hopping' name='TC_rll_unit_data_req_DCCH' time='2.350348'/> <testcase classname='BTS_Tests:hopping' name='TC_rll_unit_data_req_ACCH' time='5.312582'/> <testcase classname='BTS_Tests:hopping' name='TC_rll_unit_data_ind_DCCH' time='2.933278'/> <testcase classname='BTS_Tests:hopping' name='TC_rll_unit_data_ind_ACCH' time='10.543431'/> <testcase classname='BTS_Tests:hopping' name='TC_chan_act_a51' time='2.664050'/> <testcase classname='BTS_Tests:hopping' name='TC_chan_act_a52' time='2.737015'/> <testcase classname='BTS_Tests:hopping' name='TC_chan_act_a53' time='2.732869'/> <testcase classname='BTS_Tests:hopping' name='TC_chan_act_a54' time='2.737905'/> <testcase classname='BTS_Tests:hopping' name='TC_encr_cmd_a51' time='5.214061'/> <testcase classname='BTS_Tests:hopping' name='TC_encr_cmd_a52' time='5.214297'/> <testcase classname='BTS_Tests:hopping' name='TC_encr_cmd_a53' time='5.216595'/> <testcase classname='BTS_Tests:hopping' name='TC_encr_cmd_a54' time='5.222033'/> <testcase classname='BTS_Tests:hopping' name='TC_err_rep_wrong_mdisc' time='1.222618'/> <testcase classname='BTS_Tests:hopping' name='TC_err_rep_wrong_msg_type' time='1.271931'/> <testcase classname='BTS_Tests:hopping' name='TC_err_rep_wrong_sequence' time='1.259939'/> <testcase classname='BTS_Tests:hopping' name='TC_lapdm_selftest' time='0.005402'/> <testcase classname='BTS_Tests:hopping' name='TC_tch_sign_l2_fill_frame' time='18.454871'/> <testcase classname='BTS_Tests:hopping' name='TC_tch_sign_l2_fill_frame_dtxd' time='2.116021'> <failure type='fail-verdict'>Received DTX TCH fill frame with bad frame number: 175 (mod 104: 71) (mod 26: 19) BTS_Tests.ttcn:9579 BTS_Tests control part BTS_Tests.ttcn:8110 TC_tch_sign_l2_fill_frame_dtxd testcase </failure> </testcase> <testcase classname='BTS_Tests:hopping' name='TC_chopped_ipa_ping' time='24.731854'/> <testcase classname='BTS_Tests:hopping' name='TC_chopped_ipa_payload' time='42.619299'/> <testcase classname='BTS_Tests:hopping' name='TC_ms_pwr_ctrl_constant' time='16.900886'/> <testcase classname='BTS_Tests:hopping' name='TC_ms_pwr_ctrl_pf_ewma' time='31.994556'/> <testcase classname='BTS_Tests:hopping' name='TC_speech_no_rtp_tchf' time='7.418810'/> <testcase classname='BTS_Tests:hopping' name='TC_speech_no_rtp_tchh' time='5.519996'/> <testcase classname='BTS_Tests:hopping' name='TC_speech_rtp_tchf' time='7.695605'/> <testcase classname='BTS_Tests:hopping' name='TC_speech_rtp_tchh' time='5.479838'/> <testcase classname='BTS_Tests:hopping' name='TC_speech_osmux_tchf' time='3.423534'/> <testcase classname='BTS_Tests:hopping' name='TC_speech_osmux_tchh' time='3.452673'/> <testcase classname='BTS_Tests:hopping' name='TC_data_rtp_tchf144' time='2.165231'/> <testcase classname='BTS_Tests:hopping' name='TC_data_rtp_tchf96' time='2.098496'/> <testcase classname='BTS_Tests:hopping' name='TC_data_rtp_tchf48' time='2.143761'/> <testcase classname='BTS_Tests:hopping' name='TC_data_rtp_tchh48' time='5.307768'> <failure type='fail-verdict'>Timeout waiting for matching Downlink data frame BTS_Tests.ttcn:9597 BTS_Tests control part BTS_Tests.ttcn:8880 TC_data_rtp_tchh48 testcase </failure> </testcase> <testcase classname='BTS_Tests:hopping' name='TC_data_rtp_tchf24' time='1.759004'/> <testcase classname='BTS_Tests:hopping' name='TC_data_rtp_tchh24' time='5.322843'> <failure type='fail-verdict'>Timeout waiting for matching Downlink data frame BTS_Tests.ttcn:9599 BTS_Tests control part BTS_Tests.ttcn:8949 TC_data_rtp_tchh24 testcase </failure> </testcase> <testcase classname='BTS_Tests:hopping' name='TC_data_facch_tchf144' time='2.015812'/> <testcase classname='BTS_Tests:hopping' name='TC_data_facch_tchf96' time='2.016561'/> <testcase classname='BTS_Tests:hopping' name='TC_data_facch_tchf48' time='2.041092'/> <testcase classname='BTS_Tests:hopping' name='TC_data_facch_tchh48' time='2.137796'/> <testcase classname='BTS_Tests:hopping' name='TC_data_facch_tchf24' time='1.996336'/> <testcase classname='BTS_Tests:hopping' name='TC_data_facch_tchh24' time='2.207798'/> <testcase classname='BTS_Tests:hopping' name='TC_early_immediate_assignment' time='3.533310'/> <testcase classname='BTS_Tests:hopping' name='TC_acch_overpower_rxqual_thresh' time='9.055108'> <failure type='fail-verdict'>Timeout waiting for L1CTL DATA.ind BTS_Tests.ttcn:9610 BTS_Tests control part BTS_Tests.ttcn:9244 TC_acch_overpower_rxqual_thresh testcase </failure> </testcase> <testcase classname='BTS_Tests:hopping' name='TC_acch_overpower_rxqual_thresh_dtx' time='9.021965'> <failure type='fail-verdict'>Timeout waiting for L1CTL DATA.ind BTS_Tests.ttcn:9611 BTS_Tests control part BTS_Tests.ttcn:9285 TC_acch_overpower_rxqual_thresh_dtx testcase </failure> </testcase> <testcase classname='BTS_Tests:hopping' name='TC_acch_overpower_always_on_facch' time='9.025921'> <failure type='fail-verdict'>Timeout waiting for L1CTL DATA.ind BTS_Tests.ttcn:9612 BTS_Tests control part BTS_Tests.ttcn:9317 TC_acch_overpower_always_on_facch testcase </failure> </testcase> <testcase classname='BTS_Tests:hopping' name='TC_acch_overpower_always_on_sacch' time='9.019321'> <failure type='fail-verdict'>Timeout waiting for L1CTL DATA.ind BTS_Tests.ttcn:9613 BTS_Tests control part BTS_Tests.ttcn:9349 TC_acch_overpower_always_on_sacch testcase </failure> </testcase> <testcase classname='BTS_Tests:hopping' name='TC_acch_overpower_limit' time='9.009830'> <failure type='fail-verdict'>Timeout waiting for L1CTL DATA.ind BTS_Tests.ttcn:9614 BTS_Tests control part BTS_Tests.ttcn:9380 TC_acch_overpower_limit testcase </failure> </testcase> <testcase classname='BTS_Tests_SMSCB:hopping' name='TC_cbch_load_idle_no_cbch' time='11.166961'/> <testcase classname='BTS_Tests_SMSCB:hopping' name='TC_sms_cb_cmd_sdcch4_1block' time='14.235028'/> <testcase classname='BTS_Tests_SMSCB:hopping' name='TC_sms_cb_cmd_sdcch4_2block' time='14.195155'/> <testcase classname='BTS_Tests_SMSCB:hopping' name='TC_sms_cb_cmd_sdcch4_3block' time='14.199097'/> <testcase classname='BTS_Tests_SMSCB:hopping' name='TC_sms_cb_cmd_sdcch4_4block' time='14.202855'/> <testcase classname='BTS_Tests_SMSCB:hopping' name='TC_sms_cb_cmd_sdcch4_multi' time='20.206520'/> <testcase classname='BTS_Tests_SMSCB:hopping' name='TC_sms_cb_cmd_sdcch4_schedule' time='14.170128'/> <testcase classname='BTS_Tests_SMSCB:hopping' name='TC_sms_cb_cmd_sdcch4_default_only' time='16.222548'/> <testcase classname='BTS_Tests_SMSCB:hopping' name='TC_sms_cb_cmd_sdcch4_default_and_normal' time='17.198893'/> <testcase classname='BTS_Tests_SMSCB:hopping' name='TC_sms_cb_cmd_sdcch4_default_then_null' time='26.165863'/> <testcase classname='BTS_Tests_SMSCB:hopping' name='TC_cbc_sdcch4_load_idle' time='16.064825'/> <testcase classname='BTS_Tests_SMSCB:hopping' name='TC_cbc_sdcch4_load_overload' time='18.160379'/> <testcase classname='BTS_Tests_SMSCB:hopping' name='TC_sms_cb_cmd_sdcch8_1block' time='14.230958'/> <testcase classname='BTS_Tests_SMSCB:hopping' name='TC_sms_cb_cmd_sdcch8_2block' time='14.223744'/> <testcase classname='BTS_Tests_SMSCB:hopping' name='TC_sms_cb_cmd_sdcch8_3block' time='14.221568'/> <testcase classname='BTS_Tests_SMSCB:hopping' name='TC_sms_cb_cmd_sdcch8_4block' time='14.223689'/> <testcase classname='BTS_Tests_SMSCB:hopping' name='TC_sms_cb_cmd_sdcch8_multi' time='20.216867'/> <testcase classname='BTS_Tests_SMSCB:hopping' name='TC_sms_cb_cmd_sdcch8_schedule' time='14.189136'/> <testcase classname='BTS_Tests_SMSCB:hopping' name='TC_sms_cb_cmd_sdcch8_default_only' time='16.209399'/> <testcase classname='BTS_Tests_SMSCB:hopping' name='TC_sms_cb_cmd_sdcch8_default_and_normal' time='17.231693'/> <testcase classname='BTS_Tests_SMSCB:hopping' name='TC_cbc_sdcch8_load_idle' time='16.205172'/> <testcase classname='BTS_Tests_SMSCB:hopping' name='TC_cbc_sdcch8_load_overload' time='18.218403'/> <testcase classname='BTS_Tests_SMSCB:hopping' name='TC_etws_p1ro' time='12.188580'/> <testcase classname='BTS_Tests_SMSCB:hopping' name='TC_etws_p1ro_end' time='16.164099'/> <testcase classname='BTS_Tests_SMSCB:hopping' name='TC_etws_pcu' time='1.129672'/> <testcase classname='BTS_Tests_LAPDm:hopping' name='TC_sabm_ua_dcch_sapi0' time='2.872576'/> <testcase classname='BTS_Tests_LAPDm:hopping' name='TC_sabm_ua_dcch_sapi0_nopayload' time='21.548459'/> <testcase classname='BTS_Tests_LAPDm:hopping' name='TC_sabm_ua_dcch_sapi3' time='21.318412'/> <testcase classname='BTS_Tests_LAPDm:hopping' name='TC_sabm_ua_dcch_sapi4' time='21.362744'/> <testcase classname='BTS_Tests_LAPDm:hopping' name='TC_sabm_contention' time='21.301266'/> <testcase classname='BTS_Tests_LAPDm:hopping' name='TC_sabm_retransmit' time='3.183150'/> <testcase classname='BTS_Tests_LAPDm:hopping' name='TC_sabm_retransmit_bts' time='81.480276'/> <testcase classname='BTS_Tests_LAPDm:hopping' name='TC_sabm_invalid_resp' time='23.370132'/> <testcase classname='BTS_Tests_LAPDm:hopping' name='TC_sabm_dm' time='14.019642'/> <testcase classname='BTS_Tests_LAPDm:hopping' name='TC_establish_ign_first_sabm' time='7.970048'/> <testcase classname='BTS_Tests_LAPDm:hopping' name='TC_iframe_seq_and_ack' time='29.583402'> <failure type='fail-verdict'>Received RSL ERROR IND { msg_disc := { msg_group := RSL_MDISC_RLL (1), transparent := false }, msg_type := RSL_MT_ERROR_IND (3), ies := { { iei := RSL_IE_CHAN_NR (1), body := { chan_nr := { u := { sdcch8 := { tag := '01'B, sub_chan := 4 } }, tn := 6 } } }, { iei := RSL_IE_LINK_IDENT (2), body := { link_id := { c := FACCH_SDCCH (0), na := false, prio := SAPI0_PRIO_NORMAL (0), sapi := 0 } } }, { iei := RSL_IE_RLM_CAUSE (22), body := { rlm_cause := { len := 1, payload := '01'O } } } } } BTS_Tests_LAPDm.ttcn:1484 BTS_Tests_LAPDm control part BTS_Tests_LAPDm.ttcn:579 TC_iframe_seq_and_ack testcase </failure> </testcase> <testcase classname='BTS_Tests_LAPDm:hopping' name='TC_iframe_timer_recovery' time='24.608991'> <failure type='fail-verdict'>Received RSL ERROR IND { msg_disc := { msg_group := RSL_MDISC_RLL (1), transparent := false }, msg_type := RSL_MT_ERROR_IND (3), ies := { { iei := RSL_IE_CHAN_NR (1), body := { chan_nr := { u := { sdcch8 := { tag := '01'B, sub_chan := 4 } }, tn := 6 } } }, { iei := RSL_IE_LINK_IDENT (2), body := { link_id := { c := FACCH_SDCCH (0), na := false, prio := SAPI0_PRIO_NORMAL (0), sapi := 0 } } }, { iei := RSL_IE_RLM_CAUSE (22), body := { rlm_cause := { len := 1, payload := '01'O } } } } } BTS_Tests_LAPDm.ttcn:1485 BTS_Tests_LAPDm control part BTS_Tests_LAPDm.ttcn:685 TC_iframe_timer_recovery testcase </failure> </testcase> <testcase classname='BTS_Tests_LAPDm:hopping' name='TC_ns_seq_error' time='29.835194'> <failure type='fail-verdict'>"BTS_Tests.ttcn:732 : Tguard timeout" BTS_Tests_LAPDm.ttcn:1486 BTS_Tests_LAPDm control part BTS_Tests_LAPDm.ttcn:768 TC_ns_seq_error testcase </failure> </testcase> <testcase classname='BTS_Tests_LAPDm:hopping' name='TC_nr_seq_error' time='2.891384'/> <testcase classname='BTS_Tests_LAPDm:hopping' name='TC_rec_invalid_frame' time='119.148479'> <failure type='fail-verdict'>"BTS_Tests_LAPDm.ttcn:909 : Missing LAPDm_RR RSP" BTS_Tests_LAPDm.ttcn:1488 BTS_Tests_LAPDm control part BTS_Tests_LAPDm.ttcn:961 TC_rec_invalid_frame testcase </failure> </testcase> <testcase classname='BTS_Tests_LAPDm:hopping' name='TC_segm_concat_dcch' time='13.532764'> <failure type='fail-verdict'>"BTS_Tests_LAPDm.ttcn:1023 : received unexpected LAPDm { sacch := false, sapi := 0, lapdm := { ab := { addr := { spare := '0'B, lpd := 0, sapi := 0, c_r := false, ea := true }, ctrl := { s := { n_r := 1, p_f := false, s := '10'B, spare := '01'B } }, len := 0, m := false, el := 1, payload := ''O, padding := '2B2B2B2B2B2B2B2B2B2B2B2B2B2B2B2B2B2B2B2B'O (\"++++++++++++++++++++\") } } }" BTS_Tests_LAPDm.ttcn:1489 BTS_Tests_LAPDm control part BTS_Tests_LAPDm.ttcn:1088 TC_segm_concat_dcch testcase </failure> </testcase> <testcase classname='BTS_Tests_LAPDm:hopping' name='TC_segm_concat_sacch' time='48.521164'> <failure type='fail-verdict'>"BTS_Tests_LAPDm.ttcn:1023 : received unexpected LAPDm { sacch := true, sapi := 0, lapdm := { ab := { addr := { spare := '0'B, lpd := 0, sapi := 0, c_r := false, ea := true }, ctrl := { u := { u := '011'B, p_f := true, u2 := '00'B, spare := '11'B } }, len := 0, m := false, el := 1, payload := ''O, padding := '2B2B2B2B2B2B2B2B2B2B2B2B2B2B2B2B2B2B'O (\"++++++++++++++++++\") } } }" BTS_Tests_LAPDm.ttcn:1490 BTS_Tests_LAPDm control part BTS_Tests_LAPDm.ttcn:1093 TC_segm_concat_sacch testcase </failure> </testcase> <testcase classname='BTS_Tests_LAPDm:hopping' name='TC_t200_n200' time='39.830872'> <failure type='fail-verdict'>Missing RSL RLL ERROR INDICATION BTS_Tests_LAPDm.ttcn:1491 BTS_Tests_LAPDm control part BTS_Tests_LAPDm.ttcn:1182 TC_t200_n200 testcase </failure> </testcase> <testcase classname='BTS_Tests_LAPDm:hopping' name='TC_rr_response_frame_loss' time='6.685968'> <failure type='fail-verdict'>Timeout waiting for RR or REJ BTS_Tests_LAPDm.ttcn:1492 BTS_Tests_LAPDm control part BTS_Tests_LAPDm.ttcn:1239 TC_rr_response_frame_loss testcase </failure> </testcase> <testcase classname='BTS_Tests_LAPDm:hopping' name='TC_incorrect_cr' time='15.739364'/> <testcase classname='BTS_Tests_LAPDm:hopping' name='TC_sabm_incorrect_c' time='23.320257'> <failure type='fail-verdict'>"BTS_Tests.ttcn:732 : Tguard timeout" BTS_Tests_LAPDm.ttcn:1494 BTS_Tests_LAPDm control part BTS_Tests_LAPDm.ttcn:1341 TC_sabm_incorrect_c testcase </failure> </testcase> <testcase classname='BTS_Tests_LAPDm:hopping' name='TC_normal_reestablishment' time='16.145310'> <failure type='fail-verdict'>"BTS_Tests_LAPDm.ttcn:1023 : received unexpected LAPDm { sacch := false, sapi := 0, lapdm := { ab := { addr := { spare := '0'B, lpd := 0, sapi := 0, c_r := false, ea := true }, ctrl := { u := { u := '011'B, p_f := true, u2 := '00'B, spare := '11'B } }, len := 5, m := false, el := 1, payload := '73AD749F72'O, padding := '2B2B2B2B2B2B2B2B2B2B2B2B2B2B2B'O (\"+++++++++++++++\") } } }" BTS_Tests_LAPDm.ttcn:1495 BTS_Tests_LAPDm control part BTS_Tests_LAPDm.ttcn:1403 TC_normal_reestablishment testcase </failure> </testcase> <testcase classname='BTS_Tests_LAPDm:hopping' name='TC_normal_reestablishment_state_unacked' time='12.386010'> <failure type='fail-verdict'>"BTS_Tests_LAPDm.ttcn:1023 : received unexpected LAPDm { sacch := false, sapi := 0, lapdm := { ab := { addr := { spare := '0'B, lpd := 0, sapi := 0, c_r := false, ea := true }, ctrl := { s := { n_r := 1, p_f := false, s := '10'B, spare := '01'B } }, len := 0, m := false, el := 1, payload := ''O, padding := '2B2B2B2B2B2B2B2B2B2B2B2B2B2B2B2B2B2B2B2B'O (\"++++++++++++++++++++\") } } }" BTS_Tests_LAPDm.ttcn:1496 BTS_Tests_LAPDm control part BTS_Tests_LAPDm.ttcn:1470 TC_normal_reestablishment_state_unacked testcase </failure> </testcase> <testcase classname='BTS_Tests_VAMOS:hopping' name='TC_vamos_chan_act_vff' time='2.463909'/> <testcase classname='BTS_Tests_VAMOS:hopping' name='TC_vamos_chan_act_vhh' time='2.587186'/> <testcase classname='BTS_Tests_VAMOS:hopping' name='TC_vamos_chan_act_hvhh' time='2.522888'/> <testcase classname='BTS_Tests_VAMOS:hopping' name='TC_vamos_chan_act_dyn_ipa_vff' time='2.537688'/> <testcase classname='BTS_Tests_VAMOS:hopping' name='TC_vamos_chan_act_dyn_osmo_vff' time='2.549299'/> <testcase classname='BTS_Tests_VAMOS:hopping' name='TC_vamos_chan_act_dyn_osmo_vhh' time='2.596033'/> <testcase classname='BTS_Tests_VAMOS:hopping' name='TC_vamos_chan_act_dyn_osmo_hvhh' time='2.569035'/> <testcase classname='BTS_Tests_VAMOS:hopping' name='TC_vamos_chan_mode_modify_vff' time='1.342184'/> <testcase classname='BTS_Tests_VAMOS:hopping' name='TC_vamos_chan_mode_modify_vhh' time='1.396333'/> <testcase classname='BTS_Tests_VAMOS:hopping' name='TC_vamos_chan_mode_modify_hvhh' time='1.328221'/> <testcase classname='BTS_Tests_VAMOS:hopping' name='TC_vamos_chan_mode_modify_dyn_ipa_vff' time='1.343292'/> <testcase classname='BTS_Tests_VAMOS:hopping' name='TC_vamos_chan_mode_modify_dyn_osmo_vff' time='1.345475'/> <testcase classname='BTS_Tests_VAMOS:hopping' name='TC_vamos_chan_mode_modify_dyn_osmo_vhh' time='1.362589'/> <testcase classname='BTS_Tests_VAMOS:hopping' name='TC_vamos_chan_mode_modify_dyn_osmo_hvhh' time='1.339957'/> <testcase classname='BTS_Tests_ASCI:hopping' name='TC_vbs_notification' time='4.669504'/> <testcase classname='BTS_Tests_ASCI:hopping' name='TC_vgcs_uplink_free_and_busy' time='1.793044'/> <testcase classname='BTS_Tests_ASCI:hopping' name='TC_vgcs_talker_fail' time='16.554646'/> <testcase classname='BTS_Tests_ASCI:hopping' name='TC_vgcs_talker_est_rel' time='1.383257'/> <testcase classname='BTS_Tests_ASCI:hopping' name='TC_vgcs_listener_det' time='3.366684'/> </testsuite> <?xml version="1.0"?> <testsuite name='Titan' tests='17' failures='0' errors='0' skipped='0' inconc='0' time='95.00'> <testcase classname='BTS_Tests_OML' name='TC_wrong_mdisc' time='10.893808'/> <testcase classname='BTS_Tests_OML' name='TC_wrong_msgtype' time='0.696791'/> <testcase classname='BTS_Tests_OML' name='TC_short_length' time='0.701760'/> <testcase classname='BTS_Tests_OML' name='TC_long_length' time='0.684165'/> <testcase classname='BTS_Tests_OML' name='TC_wrong_placement' time='0.680512'/> <testcase classname='BTS_Tests_OML' name='TC_wrong_seq' time='0.692670'/> <testcase classname='BTS_Tests_OML' name='TC_wrong_obj_class' time='0.691187'/> <testcase classname='BTS_Tests_OML' name='TC_wrong_bts_nr' time='0.676402'/> <testcase classname='BTS_Tests_OML' name='TC_wrong_trx_nr' time='0.690015'/> <testcase classname='BTS_Tests_OML' name='TC_radio_carrier_opstart_noattr' time='0.693577'/> <testcase classname='BTS_Tests_OML' name='TC_bts_opstart' time='0.707775'/> <testcase classname='BTS_Tests_OML' name='TC_bts_opstart_noattr' time='0.691416'/> <testcase classname='BTS_Tests_OML' name='TC_ts_opstart' time='0.692375'/> <testcase classname='BTS_Tests_OML' name='TC_ts_opstart_noattr' time='0.675833'/> <testcase classname='BTS_Tests_OML' name='TC_initial_state_reports' time='0.691598'/> <testcase classname='BTS_Tests_OML' name='TC_ipa_osmo_pcu_anr_fwd' time='0.718732'/> <testcase classname='BTS_Tests_OML' name='TC_ipa_rsl_connect_nack' time='0.680379'/> </testsuite> + check_respawn_count + set +x [0;31m ================================================================ WARNING: osmo-bts was respawned 5 times (expected: 3)! (OS#6794) ================================================================ [0m+ RC=1 + uptime + grep --color=always -o load.* [01;31m[Kload average: 0.50, 0.53, 0.55[m[K + exit 1 Build step 'Execute shell' marked build as failure Recording test results [Checks API] No suitable checks publisher found.
1
3
0
0
Build failed in Jenkins: ttcn3-5gc-test-ogs #469
by jenkins@lists.osmocom.org
04 Sep '26
04 Sep '26
See <
https://jenkins.osmocom.org/jenkins/job/ttcn3-5gc-test-ogs/469/display/redi…
> Changes: [Oliver Smith] deps/Makefile: error if repo _commit is missing [Oliver Smith] sgsn: fix running against current stable osmo-sgsn [Pau Espin Pedrol] deps: Remove unused titan.ProtocolModules.JSON_v07_2006 ------------------------------------------ [...truncated 243.38 MiB...] [32m09/04 09:32:38.545[0m: [[33msbi[0m] [1;37mDEBUG[0m: [PATCH] /nnrf-nfm/v1/nf-instances/2c4b24b2-a843-41f1-92c5-2dd8304da01b (../lib/sbi/nghttp2-server.c:1308) [32m09/04 09:32:38.545[0m: [[33msbi[0m] [1;37mDEBUG[0m: RECEIVED: 101 (../lib/sbi/nghttp2-server.c:1312) [32m09/04 09:32:38.545[0m: [[33msbi[0m] [1;37mDEBUG[0m: [{"op":"replace","path":"/nfStatus","value":"REGISTERED"},{"op":"replace","path":"/load","value":25}] (../lib/sbi/nghttp2-server.c:1314) [32m09/04 09:32:38.545[0m: [[33mnrf[0m] [1;37mDEBUG[0m: nrf_state_operational(): OGS_EVENT_NAME_SBI_SERVER (../src/nrf/nrf-sm.c:54) [32m09/04 09:32:38.545[0m: [[33mnrf[0m] [1;37mDEBUG[0m: nrf_nf_state_registered(): OGS_EVENT_NAME_SBI_SERVER (../src/nrf/nf-sm.c:201) [32m09/04 09:32:38.545[0m: [[33msbi[0m] [1;37mDEBUG[0m: STATUS [204] (../lib/sbi/nghttp2-server.c:702) [32m09/04 09:32:38.545[0m: [[33msbi[0m] [1;37mDEBUG[0m: STREAM closed [561] (../lib/sbi/nghttp2-server.c:1431) 0000: 00000301 05000002 3189f5be ........1... [32m09/04 09:32:38.545[0m: [[33msbi[0m] [1;37mDEBUG[0m: [204:PATCH]
http://127.0.0.10:7777/nnrf-nfm/v1/nf-instances/2c4b24b2-a843-41f1-92c5-2dd…
(../lib/sbi/client.c:744) [32m09/04 09:32:38.545[0m: [[33msbi[0m] [1;37mDEBUG[0m: RECEIVED[0] (../lib/sbi/client.c:755) [32m09/04 09:32:38.546[0m: [[33msbi[0m] [1;37mDEBUG[0m: STATUS [204] (../lib/sbi/nghttp2-server.c:702) [32m09/04 09:32:38.546[0m: [[33msbi[0m] [1;37mDEBUG[0m: STREAM closed [4717] (../lib/sbi/nghttp2-server.c:1431) 0000: 00001a01 05000012 6d89c261 96c361be ........m..a..a. 0010: 94034a6e 2d6a0802 71403f71 915c65e5 ..Jn-j..q(a)?q.\e. 0020: 3168df 1h. [32m09/04 09:32:38.546[0m: [[33msbi[0m] [1;37mDEBUG[0m: [204:PATCH]
http://127.0.0.200:7777/nnrf-nfm/v1/nf-instances/2c4b24b2-a843-41f1-92c5-2d…
(../lib/sbi/client.c:744) [32m09/04 09:32:38.546[0m: [[33msbi[0m] [1;37mDEBUG[0m: RECEIVED[0] (../lib/sbi/client.c:755) [32m09/04 09:32:38.546[0m: [[33mausf[0m] [1;37mDEBUG[0m: ausf_state_operational(): OGS_EVENT_NAME_SBI_CLIENT (../src/ausf/ausf-sm.c:56) [32m09/04 09:32:38.546[0m: [[33msbi[0m] [1;37mDEBUG[0m: ogs_sbi_nf_state_registered(): OGS_EVENT_NAME_SBI_CLIENT (../lib/sbi/nf-sm.c:312) [32m09/04 09:32:38.793[0m: [[33mudm[0m] [1;37mDEBUG[0m: udm_state_operational(): OGS_EVENT_NAME_SBI_TIMER (../src/udm/udm-sm.c:61) [32m09/04 09:32:38.793[0m: [[33msbi[0m] [1;37mDEBUG[0m: ogs_sbi_nf_state_registered(): OGS_EVENT_NAME_SBI_TIMER (../lib/sbi/nf-sm.c:312) [32m09/04 09:32:38.793[0m: [[33msbi[0m] [1;37mDEBUG[0m: [PATCH]
http://127.0.0.200:7777/nnrf-nfm/v1/nf-instances/2c726162-a843-41f1-a7bf-45…
(../lib/sbi/client.c:797) [32m09/04 09:32:38.793[0m: [[33msbi[0m] [1;37mDEBUG[0m: SENDING...[101] (../lib/sbi/client.c:546) [32m09/04 09:32:38.793[0m: [[33msbi[0m] [1;37mDEBUG[0m: [{"op":"replace","path":"/nfStatus","value":"REGISTERED"},{"op":"replace","path":"/load","value":25}] (../lib/sbi/client.c:548) [32m09/04 09:32:38.794[0m: [[33msbi[0m] [1;37mDEBUG[0m: STREAM added [13009] (../lib/sbi/nghttp2-server.c:1749) [32m09/04 09:32:38.794[0m: [[33msbi[0m] [1;37mDEBUG[0m: [PATCH] /nnrf-nfm/v1/nf-instances/2c726162-a843-41f1-a7bf-455e3de4da2b (../lib/sbi/nghttp2-server.c:1308) [32m09/04 09:32:38.794[0m: [[33msbi[0m] [1;37mDEBUG[0m: RECEIVED: 101 (../lib/sbi/nghttp2-server.c:1312) [32m09/04 09:32:38.794[0m: [[33msbi[0m] [1;37mDEBUG[0m: [{"op":"replace","path":"/nfStatus","value":"REGISTERED"},{"op":"replace","path":"/load","value":25}] (../lib/sbi/nghttp2-server.c:1314) [32m09/04 09:32:38.794[0m: [[33msbi[0m] [1;37mDEBUG[0m: [PATCH]
http://127.0.0.10:7777/nnrf-nfm/v1/nf-instances/2c726162-a843-41f1-a7bf-455…
(../lib/sbi/client.c:797) [32m09/04 09:32:38.794[0m: [[33msbi[0m] [1;37mDEBUG[0m: SENDING...[101] (../lib/sbi/client.c:546) [32m09/04 09:32:38.794[0m: [[33msbi[0m] [1;37mDEBUG[0m: [{"op":"replace","path":"/nfStatus","value":"REGISTERED"},{"op":"replace","path":"/load","value":25}] (../lib/sbi/client.c:548) [32m09/04 09:32:38.794[0m: [[33msbi[0m] [1;37mDEBUG[0m: STREAM added [563] (../lib/sbi/nghttp2-server.c:1749) [32m09/04 09:32:38.794[0m: [[33msbi[0m] [1;37mDEBUG[0m: [PATCH] /nnrf-nfm/v1/nf-instances/2c726162-a843-41f1-a7bf-455e3de4da2b (../lib/sbi/nghttp2-server.c:1308) [32m09/04 09:32:38.794[0m: [[33msbi[0m] [1;37mDEBUG[0m: RECEIVED: 101 (../lib/sbi/nghttp2-server.c:1312) [32m09/04 09:32:38.794[0m: [[33msbi[0m] [1;37mDEBUG[0m: [{"op":"replace","path":"/nfStatus","value":"REGISTERED"},{"op":"replace","path":"/load","value":25}] (../lib/sbi/nghttp2-server.c:1314) [32m09/04 09:32:38.794[0m: [[33mnrf[0m] [1;37mDEBUG[0m: nrf_state_operational(): OGS_EVENT_NAME_SBI_SERVER (../src/nrf/nrf-sm.c:54) [32m09/04 09:32:38.794[0m: [[33mnrf[0m] [1;37mDEBUG[0m: nrf_nf_state_registered(): OGS_EVENT_NAME_SBI_SERVER (../src/nrf/nf-sm.c:201) [32m09/04 09:32:38.794[0m: [[33msbi[0m] [1;37mDEBUG[0m: STATUS [204] (../lib/sbi/nghttp2-server.c:702) [32m09/04 09:32:38.794[0m: [[33msbi[0m] [1;37mDEBUG[0m: STREAM closed [563] (../lib/sbi/nghttp2-server.c:1431) 0000: 00000301 05000002 3389f5be ........3... [32m09/04 09:32:38.795[0m: [[33msbi[0m] [1;37mDEBUG[0m: [204:PATCH]
http://127.0.0.10:7777/nnrf-nfm/v1/nf-instances/2c726162-a843-41f1-a7bf-455…
(../lib/sbi/client.c:744) [32m09/04 09:32:38.795[0m: [[33msbi[0m] [1;37mDEBUG[0m: RECEIVED[0] (../lib/sbi/client.c:755) [32m09/04 09:32:38.795[0m: [[33msbi[0m] [1;37mDEBUG[0m: STATUS [204] (../lib/sbi/nghttp2-server.c:702) [32m09/04 09:32:38.795[0m: [[33msbi[0m] [1;37mDEBUG[0m: STREAM closed [13009] (../lib/sbi/nghttp2-server.c:1431) 0000: 00001a01 05000032 d189c461 96c361be .......2...a..a. 0010: 94034a6e 2d6a0802 71403f71 915c65e5 ..Jn-j..q(a)?q.\e. 0020: 3168df 1h. [32m09/04 09:32:38.795[0m: [[33msbi[0m] [1;37mDEBUG[0m: [204:PATCH]
http://127.0.0.200:7777/nnrf-nfm/v1/nf-instances/2c726162-a843-41f1-a7bf-45…
(../lib/sbi/client.c:744) [32m09/04 09:32:38.795[0m: [[33msbi[0m] [1;37mDEBUG[0m: RECEIVED[0] (../lib/sbi/client.c:755) [32m09/04 09:32:38.795[0m: [[33mudm[0m] [1;37mDEBUG[0m: udm_state_operational(): OGS_EVENT_NAME_SBI_CLIENT (../src/udm/udm-sm.c:61) [32m09/04 09:32:38.795[0m: [[33msbi[0m] [1;37mDEBUG[0m: ogs_sbi_nf_state_registered(): OGS_EVENT_NAME_SBI_CLIENT (../lib/sbi/nf-sm.c:312) [32m09/04 09:32:39.039[0m: [[33mudr[0m] [1;37mDEBUG[0m: udr_state_operational(): OGS_EVENT_NAME_SBI_TIMER (../src/udr/udr-sm.c:53) [32m09/04 09:32:39.039[0m: [[33msbi[0m] [1;37mDEBUG[0m: ogs_sbi_nf_state_registered(): OGS_EVENT_NAME_SBI_TIMER (../lib/sbi/nf-sm.c:312) [32m09/04 09:32:39.039[0m: [[33msbi[0m] [1;37mDEBUG[0m: [PATCH]
http://127.0.0.200:7777/nnrf-nfm/v1/nf-instances/2c97d406-a843-41f1-b6bf-57…
(../lib/sbi/client.c:797) [32m09/04 09:32:39.039[0m: [[33msbi[0m] [1;37mDEBUG[0m: SENDING...[100] (../lib/sbi/client.c:546) [32m09/04 09:32:39.039[0m: [[33msbi[0m] [1;37mDEBUG[0m: [{"op":"replace","path":"/nfStatus","value":"REGISTERED"},{"op":"replace","path":"/load","value":0}] (../lib/sbi/client.c:548) [32m09/04 09:32:39.040[0m: [[33msbi[0m] [1;37mDEBUG[0m: STREAM added [57] (../lib/sbi/nghttp2-server.c:1749) [32m09/04 09:32:39.040[0m: [[33msbi[0m] [1;37mDEBUG[0m: [PATCH] /nnrf-nfm/v1/nf-instances/2c97d406-a843-41f1-b6bf-57e53ec988f2 (../lib/sbi/nghttp2-server.c:1308) [32m09/04 09:32:39.040[0m: [[33msbi[0m] [1;37mDEBUG[0m: RECEIVED: 100 (../lib/sbi/nghttp2-server.c:1312) [32m09/04 09:32:39.040[0m: [[33msbi[0m] [1;37mDEBUG[0m: [{"op":"replace","path":"/nfStatus","value":"REGISTERED"},{"op":"replace","path":"/load","value":0}] (../lib/sbi/nghttp2-server.c:1314) [32m09/04 09:32:39.040[0m: [[33msbi[0m] [1;37mDEBUG[0m: [PATCH]
http://127.0.0.10:7777/nnrf-nfm/v1/nf-instances/2c97d406-a843-41f1-b6bf-57e…
(../lib/sbi/client.c:797) [32m09/04 09:32:39.040[0m: [[33msbi[0m] [1;37mDEBUG[0m: SENDING...[100] (../lib/sbi/client.c:546) [32m09/04 09:32:39.040[0m: [[33msbi[0m] [1;37mDEBUG[0m: [{"op":"replace","path":"/nfStatus","value":"REGISTERED"},{"op":"replace","path":"/load","value":0}] (../lib/sbi/client.c:548) [32m09/04 09:32:39.040[0m: [[33msbi[0m] [1;37mDEBUG[0m: STREAM added [565] (../lib/sbi/nghttp2-server.c:1749) [32m09/04 09:32:39.040[0m: [[33msbi[0m] [1;37mDEBUG[0m: [PATCH] /nnrf-nfm/v1/nf-instances/2c97d406-a843-41f1-b6bf-57e53ec988f2 (../lib/sbi/nghttp2-server.c:1308) [32m09/04 09:32:39.040[0m: [[33msbi[0m] [1;37mDEBUG[0m: RECEIVED: 100 (../lib/sbi/nghttp2-server.c:1312) [32m09/04 09:32:39.040[0m: [[33msbi[0m] [1;37mDEBUG[0m: [{"op":"replace","path":"/nfStatus","value":"REGISTERED"},{"op":"replace","path":"/load","value":0}] (../lib/sbi/nghttp2-server.c:1314) [32m09/04 09:32:39.040[0m: [[33mnrf[0m] [1;37mDEBUG[0m: nrf_state_operational(): OGS_EVENT_NAME_SBI_SERVER (../src/nrf/nrf-sm.c:54) [32m09/04 09:32:39.040[0m: [[33mnrf[0m] [1;37mDEBUG[0m: nrf_nf_state_registered(): OGS_EVENT_NAME_SBI_SERVER (../src/nrf/nf-sm.c:201) [32m09/04 09:32:39.040[0m: [[33msbi[0m] [1;37mDEBUG[0m: STATUS [204] (../lib/sbi/nghttp2-server.c:702) [32m09/04 09:32:39.040[0m: [[33msbi[0m] [1;37mDEBUG[0m: STREAM closed [565] (../lib/sbi/nghttp2-server.c:1431) 0000: 00001a01 05000002 3589f561 96c361be ........5..a..a. 0010: 94034a6e 2d6a0802 71403f71 915c65f5 ..Jn-j..q(a)?q.\e. 0020: 3168df 1h. [32m09/04 09:32:39.041[0m: [[33msbi[0m] [1;37mDEBUG[0m: [204:PATCH]
http://127.0.0.10:7777/nnrf-nfm/v1/nf-instances/2c97d406-a843-41f1-b6bf-57e…
(../lib/sbi/client.c:744) [32m09/04 09:32:39.041[0m: [[33msbi[0m] [1;37mDEBUG[0m: RECEIVED[0] (../lib/sbi/client.c:755) [32m09/04 09:32:39.041[0m: [[33msbi[0m] [1;37mDEBUG[0m: STATUS [204] (../lib/sbi/nghttp2-server.c:702) [32m09/04 09:32:39.041[0m: [[33msbi[0m] [1;37mDEBUG[0m: STREAM closed [57] (../lib/sbi/nghttp2-server.c:1431) 0000: 00001a01 05000000 3989d161 96c361be ........9..a..a. 0010: 94034a6e 2d6a0802 71403f71 915c65f5 ..Jn-j..q(a)?q.\e. 0020: 3168df 1h. [32m09/04 09:32:39.041[0m: [[33msbi[0m] [1;37mDEBUG[0m: [204:PATCH]
http://127.0.0.200:7777/nnrf-nfm/v1/nf-instances/2c97d406-a843-41f1-b6bf-57…
(../lib/sbi/client.c:744) [32m09/04 09:32:39.041[0m: [[33msbi[0m] [1;37mDEBUG[0m: RECEIVED[0] (../lib/sbi/client.c:755) [32m09/04 09:32:39.041[0m: [[33mudr[0m] [1;37mDEBUG[0m: udr_state_operational(): OGS_EVENT_NAME_SBI_CLIENT (../src/udr/udr-sm.c:53) [32m09/04 09:32:39.041[0m: [[33msbi[0m] [1;37mDEBUG[0m: ogs_sbi_nf_state_registered(): OGS_EVENT_NAME_SBI_CLIENT (../lib/sbi/nf-sm.c:312) [32m09/04 09:32:39.181[0m: [[33mpcf[0m] [1;37mDEBUG[0m: pcf_state_operational(): OGS_EVENT_NAME_SBI_TIMER (../src/pcf/pcf-sm.c:64) [32m09/04 09:32:39.181[0m: [[33msbi[0m] [1;37mDEBUG[0m: ogs_sbi_nf_state_registered(): OGS_EVENT_NAME_SBI_TIMER (../lib/sbi/nf-sm.c:312) [32m09/04 09:32:39.181[0m: [[33msbi[0m] [1;37mDEBUG[0m: [PATCH]
http://127.0.0.200:7777/nnrf-nfm/v1/nf-instances/2cac17a4-a843-41f1-ba5b-95…
(../lib/sbi/client.c:797) [32m09/04 09:32:39.181[0m: [[33msbi[0m] [1;37mDEBUG[0m: SENDING...[101] (../lib/sbi/client.c:546) [32m09/04 09:32:39.181[0m: [[33msbi[0m] [1;37mDEBUG[0m: [{"op":"replace","path":"/nfStatus","value":"REGISTERED"},{"op":"replace","path":"/load","value":25}] (../lib/sbi/client.c:548) [32m09/04 09:32:39.181[0m: [[33msbi[0m] [1;37mDEBUG[0m: STREAM added [5757] (../lib/sbi/nghttp2-server.c:1749) [32m09/04 09:32:39.181[0m: [[33msbi[0m] [1;37mDEBUG[0m: [PATCH] /nnrf-nfm/v1/nf-instances/2cac17a4-a843-41f1-ba5b-95494485b9a1 (../lib/sbi/nghttp2-server.c:1308) [32m09/04 09:32:39.181[0m: [[33msbi[0m] [1;37mDEBUG[0m: RECEIVED: 101 (../lib/sbi/nghttp2-server.c:1312) [32m09/04 09:32:39.181[0m: [[33msbi[0m] [1;37mDEBUG[0m: [{"op":"replace","path":"/nfStatus","value":"REGISTERED"},{"op":"replace","path":"/load","value":25}] (../lib/sbi/nghttp2-server.c:1314) [32m09/04 09:32:39.182[0m: [[33msbi[0m] [1;37mDEBUG[0m: [PATCH]
http://127.0.0.10:7777/nnrf-nfm/v1/nf-instances/2cac17a4-a843-41f1-ba5b-954…
(../lib/sbi/client.c:797) [32m09/04 09:32:39.182[0m: [[33msbi[0m] [1;37mDEBUG[0m: SENDING...[101] (../lib/sbi/client.c:546) [32m09/04 09:32:39.182[0m: [[33msbi[0m] [1;37mDEBUG[0m: [{"op":"replace","path":"/nfStatus","value":"REGISTERED"},{"op":"replace","path":"/load","value":25}] (../lib/sbi/client.c:548) [32m09/04 09:32:39.182[0m: [[33msbi[0m] [1;37mDEBUG[0m: STREAM added [567] (../lib/sbi/nghttp2-server.c:1749) [32m09/04 09:32:39.182[0m: [[33msbi[0m] [1;37mDEBUG[0m: [PATCH] /nnrf-nfm/v1/nf-instances/2cac17a4-a843-41f1-ba5b-95494485b9a1 (../lib/sbi/nghttp2-server.c:1308) [32m09/04 09:32:39.182[0m: [[33msbi[0m] [1;37mDEBUG[0m: RECEIVED: 101 (../lib/sbi/nghttp2-server.c:1312) [32m09/04 09:32:39.182[0m: [[33msbi[0m] [1;37mDEBUG[0m: [{"op":"replace","path":"/nfStatus","value":"REGISTERED"},{"op":"replace","path":"/load","value":25}] (../lib/sbi/nghttp2-server.c:1314) [32m09/04 09:32:39.182[0m: [[33mnrf[0m] [1;37mDEBUG[0m: nrf_state_operational(): OGS_EVENT_NAME_SBI_SERVER (../src/nrf/nrf-sm.c:54) [32m09/04 09:32:39.182[0m: [[33mnrf[0m] [1;37mDEBUG[0m: nrf_nf_state_registered(): OGS_EVENT_NAME_SBI_SERVER (../src/nrf/nf-sm.c:201) [32m09/04 09:32:39.182[0m: [[33msbi[0m] [1;37mDEBUG[0m: STATUS [204] (../lib/sbi/nghttp2-server.c:702) [32m09/04 09:32:39.182[0m: [[33msbi[0m] [1;37mDEBUG[0m: STREAM closed [567] (../lib/sbi/nghttp2-server.c:1431) 0000: 00000301 05000002 3789f6be ........7... [32m09/04 09:32:39.182[0m: [[33msbi[0m] [1;37mDEBUG[0m: [204:PATCH]
http://127.0.0.10:7777/nnrf-nfm/v1/nf-instances/2cac17a4-a843-41f1-ba5b-954…
(../lib/sbi/client.c:744) [32m09/04 09:32:39.182[0m: [[33msbi[0m] [1;37mDEBUG[0m: RECEIVED[0] (../lib/sbi/client.c:755) [32m09/04 09:32:39.182[0m: [[33msbi[0m] [1;37mDEBUG[0m: STATUS [204] (../lib/sbi/nghttp2-server.c:702) [32m09/04 09:32:39.183[0m: [[33msbi[0m] [1;37mDEBUG[0m: STREAM closed [5757] (../lib/sbi/nghttp2-server.c:1431) 0000: 00001a01 05000016 7d89f861 96c361be ........}..a..a. 0010: 94034a6e 2d6a0802 71403f71 915c65f5 ..Jn-j..q(a)?q.\e. 0020: 3168df 1h. [32m09/04 09:32:39.183[0m: [[33msbi[0m] [1;37mDEBUG[0m: [204:PATCH]
http://127.0.0.200:7777/nnrf-nfm/v1/nf-instances/2cac17a4-a843-41f1-ba5b-95…
(../lib/sbi/client.c:744) [32m09/04 09:32:39.183[0m: [[33msbi[0m] [1;37mDEBUG[0m: RECEIVED[0] (../lib/sbi/client.c:755) [32m09/04 09:32:39.183[0m: [[33mpcf[0m] [1;37mDEBUG[0m: pcf_state_operational(): OGS_EVENT_NAME_SBI_CLIENT (../src/pcf/pcf-sm.c:64) [32m09/04 09:32:39.183[0m: [[33msbi[0m] [1;37mDEBUG[0m: ogs_sbi_nf_state_registered(): OGS_EVENT_NAME_SBI_CLIENT (../lib/sbi/nf-sm.c:312) MTC@e30ab461b77c: External command `<
https://jenkins.osmocom.org/jenkins/job/ttcn3-5gc-test-ogs/ws/src/osmo-ttcn…
> C5G_Tests.TC_ue_service_request_cm_connected' was executed successfully (exit status: 0). MTC@e30ab461b77c: Test case TC_ue_service_request_cm_connected started. GTP1U_EM(841)@e30ab461b77c: Warning: sizes of 'struct sctp_event_subscribe': compile-time 14, kernel: 14 GTP1U_EM(841)@e30ab461b77c: setverdict(fail): none -> fail reason: "Could not connect UECUPS socket, check your configuration", new component reason: "Could not connect UECUPS socket, check your configuration" GTP1U_EM(841)@e30ab461b77c: Dynamic test case error: testcase.stop GTP1U_EM(841)@e30ab461b77c: setverdict(error): fail -> error GTP1U_EM(841)@e30ab461b77c: Final verdict of PTC: error TC_ue_service_request_cm_connected-NGAP0(842)@e30ab461b77c: Warning: sizes of 'struct sctp_event_subscribe': compile-time 14, kernel: 14 [32m09/04 09:32:39.245[0m: [[33mamf[0m] [1;32mINFO[0m: gNB-N2 accepted[127.0.0.202]:50000 in ng-path module (../src/amf/ngap-sctp.c:113) [32m09/04 09:32:39.245[0m: [[33mamf[0m] [1;37mDEBUG[0m: amf_state_operational(): AMF_EVENT_NGAP_LO_ACCEPT (../src/amf/amf-sm.c:84) [32m09/04 09:32:39.245[0m: [[33mamf[0m] [1;32mINFO[0m: gNB-N2 accepted[127.0.0.202] in master_sm module (../src/amf/amf-sm.c:822) [32m09/04 09:32:39.252[0m: [[33mamf[0m] [1;37mDEBUG[0m: ngap_state_initial(): ENTRY (../src/amf/ngap-sm.c:28) [32m09/04 09:32:39.252[0m: [[33mamf[0m] [1;37mDEBUG[0m: ngap_state_operational(): ENTRY (../src/amf/ngap-sm.c:55) [32m09/04 09:32:39.252[0m: [[33mamf[0m] [1;32mINFO[0m: [Added] Number of gNBs is now 1 (../src/amf/context.c:1277) [32m09/04 09:32:39.252[0m: [[33mamf[0m] [1;37mDEBUG[0m: SCTP_ASSOC_CHANGE:[T:32769, F:0x0, S:0, I/O:64/30] (../src/amf/ngap-sctp.c:152) [32m09/04 09:32:39.252[0m: [[33mamf[0m] [1;37mDEBUG[0m: SCTP_COMM_UP (../src/amf/ngap-sctp.c:161) [32m09/04 09:32:39.252[0m: [[33mamf[0m] [1;37mDEBUG[0m: amf_state_operational(): AMF_EVENT_NGAP_LO_SCTP_COMM_UP (../src/amf/amf-sm.c:84) [32m09/04 09:32:39.252[0m: [[33mamf[0m] [1;32mINFO[0m: gNB-N2[127.0.0.202] max_num_of_ostreams : 30 (../src/amf/amf-sm.c:869) TC_ue_service_request_cm_connected-NGAP1(843)@e30ab461b77c: Warning: sizes of 'struct sctp_event_subscribe': compile-time 14, kernel: 14 [32m09/04 09:32:39.254[0m: [[33mamf[0m] [1;32mINFO[0m: gNB-N2 accepted[127.0.0.202]:50001 in ng-path module (../src/amf/ngap-sctp.c:113) [32m09/04 09:32:39.254[0m: [[33mamf[0m] [1;37mDEBUG[0m: amf_state_operational(): AMF_EVENT_NGAP_LO_ACCEPT (../src/amf/amf-sm.c:84) [32m09/04 09:32:39.254[0m: [[33mamf[0m] [1;32mINFO[0m: gNB-N2 accepted[127.0.0.202] in master_sm module (../src/amf/amf-sm.c:822) [32m09/04 09:32:39.259[0m: [[33mamf[0m] [1;37mDEBUG[0m: ngap_state_initial(): ENTRY (../src/amf/ngap-sm.c:28) [32m09/04 09:32:39.259[0m: [[33mamf[0m] [1;37mDEBUG[0m: ngap_state_operational(): ENTRY (../src/amf/ngap-sm.c:55) [32m09/04 09:32:39.259[0m: [[33mamf[0m] [1;32mINFO[0m: [Added] Number of gNBs is now 2 (../src/amf/context.c:1277) [32m09/04 09:32:39.259[0m: [[33mamf[0m] [1;37mDEBUG[0m: SCTP_ASSOC_CHANGE:[T:32769, F:0x0, S:0, I/O:64/30] (../src/amf/ngap-sctp.c:152) [32m09/04 09:32:39.259[0m: [[33mamf[0m] [1;37mDEBUG[0m: SCTP_COMM_UP (../src/amf/ngap-sctp.c:161) [32m09/04 09:32:39.259[0m: [[33mamf[0m] [1;37mDEBUG[0m: amf_state_operational(): AMF_EVENT_NGAP_LO_SCTP_COMM_UP (../src/amf/amf-sm.c:84) [32m09/04 09:32:39.259[0m: [[33mamf[0m] [1;32mINFO[0m: gNB-N2[127.0.0.202] max_num_of_ostreams : 30 (../src/amf/amf-sm.c:869) [32m09/04 09:32:39.259[0m: [[33mamf[0m] [1;37mDEBUG[0m: amf_state_operational(): AMF_EVENT_NGAP_MESSAGE (../src/amf/amf-sm.c:84) [32m09/04 09:32:39.259[0m: [[33mamf[0m] [1;37mDEBUG[0m: ngap_state_operational(): AMF_EVENT_NGAP_MESSAGE (../src/amf/ngap-sm.c:55) [32m09/04 09:32:39.259[0m: [[33mamf[0m] [1;37mDEBUG[0m: NGSetupRequest (../src/amf/ngap-handler.c:288) [32m09/04 09:32:39.259[0m: [[33mamf[0m] [1;37mDEBUG[0m: IP[127.0.0.202] GNB_ID[0x0] GNB_ID_LENGTH[22] (../src/amf/ngap-handler.c:386) [32m09/04 09:32:39.259[0m: [[33mamf[0m] [1;37mDEBUG[0m: PLMN_ID[MCC:999 MNC:70] (../src/amf/ngap-handler.c:391) [32m09/04 09:32:39.259[0m: [[33mamf[0m] [1;37mDEBUG[0m: PagingDRX[0] (../src/amf/ngap-handler.c:395) [32m09/04 09:32:39.259[0m: [[33mamf[0m] [1;37mDEBUG[0m: TAC[1] (../src/amf/ngap-handler.c:439) [32m09/04 09:32:39.259[0m: [[33mamf[0m] [1;37mDEBUG[0m: PLMN_ID[MCC:999 MNC:70] (../src/amf/ngap-handler.c:501) [32m09/04 09:32:39.259[0m: [[33mamf[0m] [1;37mDEBUG[0m: S_NSSAI[SST:1 SD:0xffffff] (../src/amf/ngap-handler.c:562) [32m09/04 09:32:39.259[0m: [[33mamf[0m] [1;37mDEBUG[0m: TAC[1] (../src/amf/ngap-handler.c:72) [32m09/04 09:32:39.259[0m: [[33mamf[0m] [1;37mDEBUG[0m: PLMN_ID[MCC:999 MNC:70] (../src/amf/ngap-handler.c:73) [32m09/04 09:32:39.259[0m: [[33mamf[0m] [1;37mDEBUG[0m: SERVED_TAI_INDEX[0] (../src/amf/ngap-handler.c:78) [32m09/04 09:32:39.259[0m: [[33mamf[0m] [1;37mDEBUG[0m: PLMN_ID[MCC:999 MNC:70] (../src/amf/ngap-handler.c:100) [32m09/04 09:32:39.259[0m: [[33mamf[0m] [1;37mDEBUG[0m: S_NSSAI[SST:1 SD:0xffffff] (../src/amf/ngap-handler.c:105) [32m09/04 09:32:39.259[0m: [[33mamf[0m] [1;37mDEBUG[0m: NG-Setup response (../src/amf/ngap-path.c:356) [32m09/04 09:32:39.259[0m: [[33mamf[0m] [1;37mDEBUG[0m: NGSetupResponse (../src/amf/ngap-build.c:91) [32m09/04 09:32:39.259[0m: [[33mamf[0m] [1;37mDEBUG[0m: IP[127.0.0.202] RAN_ID[0] (../src/amf/ngap-path.c:64) MTC@e30ab461b77c: setverdict(pass): none -> pass MTC@e30ab461b77c: Dynamic test case error: Error message was received from MC: The connect operation refers to test component with component reference 841, which has already terminated. MTC@e30ab461b77c: setverdict(error): pass -> error TC_ue_service_request_cm_connected0(844)@e30ab461b77c: Final verdict of PTC: none [32m09/04 09:32:39.266[0m: [[33mamf[0m] [1;37mDEBUG[0m: SCTP_SHUTDOWN_EVENT:[T:32773, F:0x0, L:12] (../src/amf/ngap-sctp.c:193) [32m09/04 09:32:39.266[0m: [[33mamf[0m] [1;37mDEBUG[0m: amf_state_operational(): AMF_EVENT_NGAP_LO_CONNREFUSED (../src/amf/amf-sm.c:84) [32m09/04 09:32:39.266[0m: [[33mamf[0m] [1;32mINFO[0m: gNB-N2[127.0.0.202] connection refused!!! (../src/amf/amf-sm.c:882) [32m09/04 09:32:39.266[0m: [[33mamf[0m] [1;37mDEBUG[0m: ngap_state_operational(): EXIT (../src/amf/ngap-sm.c:55) [32m09/04 09:32:39.266[0m: [[33mamf[0m] [1;37mDEBUG[0m: ngap_state_final(): EXIT (../src/amf/ngap-sm.c:37) [32m09/04 09:32:39.266[0m: [[33mamf[0m] [1;32mINFO[0m: [Removed] Number of gNBs is now 1 (../src/amf/context.c:1305) [32m09/04 09:32:39.266[0m: [[33mamf[0m] [1;37mDEBUG[0m: SCTP_SHUTDOWN_EVENT:[T:32773, F:0x0, L:12] (../src/amf/ngap-sctp.c:193) [32m09/04 09:32:39.266[0m: [[33mamf[0m] [1;37mDEBUG[0m: amf_state_operational(): AMF_EVENT_NGAP_LO_CONNREFUSED (../src/amf/amf-sm.c:84) [32m09/04 09:32:39.266[0m: [[33mamf[0m] [1;32mINFO[0m: gNB-N2[127.0.0.202] connection refused!!! (../src/amf/amf-sm.c:882) [32m09/04 09:32:39.266[0m: [[33mamf[0m] [1;37mDEBUG[0m: ngap_state_operational(): EXIT (../src/amf/ngap-sm.c:55) [32m09/04 09:32:39.266[0m: [[33mamf[0m] [1;37mDEBUG[0m: ngap_state_final(): EXIT (../src/amf/ngap-sm.c:37) [32m09/04 09:32:39.266[0m: [[33mamf[0m] [1;32mINFO[0m: [Removed] Number of gNBs is now 0 (../src/amf/context.c:1305) TC_ue_service_request_cm_connected-NGAP1(843)@e30ab461b77c: Final verdict of PTC: none TC_ue_service_request_cm_connected-NGAP0(842)@e30ab461b77c: Final verdict of PTC: none MTC@e30ab461b77c: Setting final verdict of the test case. MTC@e30ab461b77c: Local verdict of MTC: error MTC@e30ab461b77c: Local verdict of PTC GTP1U_EM(841): error (error -> error) MTC@e30ab461b77c: Local verdict of PTC TC_ue_service_request_cm_connected-NGAP0(842): none (error -> error) MTC@e30ab461b77c: Local verdict of PTC TC_ue_service_request_cm_connected-NGAP1(843): none (error -> error) MTC@e30ab461b77c: Local verdict of PTC TC_ue_service_request_cm_connected0(844): none (error -> error) MTC@e30ab461b77c: Test case TC_ue_service_request_cm_connected finished. Verdict: error MTC@e30ab461b77c: Starting external command `<
https://jenkins.osmocom.org/jenkins/job/ttcn3-5gc-test-ogs/ws/src/osmo-ttcn…
> C5G_Tests.TC_ue_service_request_cm_connected error'. (09:32:39) load average: 1.86, 2.01, 1.43 [1;31m------ C5G_Tests.TC_ue_service_request_cm_connected error ------[0m Waiting for packet dumper to finish... 0 (prev_count=-1, count=1284) [32m09/04 09:32:39.453[0m: [[33mamf[0m] [1;37mDEBUG[0m: amf_state_operational(): OGS_EVENT_NAME_SBI_TIMER (../src/amf/amf-sm.c:84) [32m09/04 09:32:39.453[0m: [[33msbi[0m] [1;37mDEBUG[0m: ogs_sbi_nf_state_registered(): OGS_EVENT_NAME_SBI_TIMER (../lib/sbi/nf-sm.c:312) [32m09/04 09:32:39.454[0m: [[33msbi[0m] [1;37mDEBUG[0m: [PATCH]
http://127.0.0.200:7777/nnrf-nfm/v1/nf-instances/2cdb9240-a843-41f1-9f0d-01…
(../lib/sbi/client.c:797) [32m09/04 09:32:39.454[0m: [[33msbi[0m] [1;37mDEBUG[0m: SENDING...[100] (../lib/sbi/client.c:546) [32m09/04 09:32:39.454[0m: [[33msbi[0m] [1;37mDEBUG[0m: [{"op":"replace","path":"/nfStatus","value":"REGISTERED"},{"op":"replace","path":"/load","value":0}] (../lib/sbi/client.c:548) [32m09/04 09:32:39.454[0m: [[33msbi[0m] [1;37mDEBUG[0m: STREAM added [22351] (../lib/sbi/nghttp2-server.c:1749) [32m09/04 09:32:39.454[0m: [[33msbi[0m] [1;37mDEBUG[0m: [PATCH] /nnrf-nfm/v1/nf-instances/2cdb9240-a843-41f1-9f0d-01a9933afe85 (../lib/sbi/nghttp2-server.c:1308) [32m09/04 09:32:39.454[0m: [[33msbi[0m] [1;37mDEBUG[0m: RECEIVED: 100 (../lib/sbi/nghttp2-server.c:1312) [32m09/04 09:32:39.454[0m: [[33msbi[0m] [1;37mDEBUG[0m: [{"op":"replace","path":"/nfStatus","value":"REGISTERED"},{"op":"replace","path":"/load","value":0}] (../lib/sbi/nghttp2-server.c:1314) [32m09/04 09:32:39.454[0m: [[33msbi[0m] [1;37mDEBUG[0m: [PATCH]
http://127.0.0.10:7777/nnrf-nfm/v1/nf-instances/2cdb9240-a843-41f1-9f0d-01a…
(../lib/sbi/client.c:797) [32m09/04 09:32:39.454[0m: [[33msbi[0m] [1;37mDEBUG[0m: SENDING...[100] (../lib/sbi/client.c:546) [32m09/04 09:32:39.454[0m: [[33msbi[0m] [1;37mDEBUG[0m: [{"op":"replace","path":"/nfStatus","value":"REGISTERED"},{"op":"replace","path":"/load","value":0}] (../lib/sbi/client.c:548) [32m09/04 09:32:39.454[0m: [[33msbi[0m] [1;37mDEBUG[0m: STREAM added [569] (../lib/sbi/nghttp2-server.c:1749) [32m09/04 09:32:39.455[0m: [[33msbi[0m] [1;37mDEBUG[0m: [PATCH] /nnrf-nfm/v1/nf-instances/2cdb9240-a843-41f1-9f0d-01a9933afe85 (../lib/sbi/nghttp2-server.c:1308) [32m09/04 09:32:39.455[0m: [[33msbi[0m] [1;37mDEBUG[0m: RECEIVED: 100 (../lib/sbi/nghttp2-server.c:1312) [32m09/04 09:32:39.455[0m: [[33msbi[0m] [1;37mDEBUG[0m: [{"op":"replace","path":"/nfStatus","value":"REGISTERED"},{"op":"replace","path":"/load","value":0}] (../lib/sbi/nghttp2-server.c:1314) [32m09/04 09:32:39.455[0m: [[33mnrf[0m] [1;37mDEBUG[0m: nrf_state_operational(): OGS_EVENT_NAME_SBI_SERVER (../src/nrf/nrf-sm.c:54) [32m09/04 09:32:39.455[0m: [[33mnrf[0m] [1;37mDEBUG[0m: nrf_nf_state_registered(): OGS_EVENT_NAME_SBI_SERVER (../src/nrf/nf-sm.c:201) [32m09/04 09:32:39.455[0m: [[33msbi[0m] [1;37mDEBUG[0m: STATUS [204] (../lib/sbi/nghttp2-server.c:702) [32m09/04 09:32:39.455[0m: [[33msbi[0m] [1;37mDEBUG[0m: STREAM closed [569] (../lib/sbi/nghttp2-server.c:1431) 0000: 00000301 05000002 3989f6be ........9... [32m09/04 09:32:39.455[0m: [[33msbi[0m] [1;37mDEBUG[0m: [204:PATCH]
http://127.0.0.10:7777/nnrf-nfm/v1/nf-instances/2cdb9240-a843-41f1-9f0d-01a…
(../lib/sbi/client.c:744) [32m09/04 09:32:39.455[0m: [[33msbi[0m] [1;37mDEBUG[0m: RECEIVED[0] (../lib/sbi/client.c:755) [32m09/04 09:32:39.455[0m: [[33msbi[0m] [1;37mDEBUG[0m: STATUS [204] (../lib/sbi/nghttp2-server.c:702) [32m09/04 09:32:39.455[0m: [[33msbi[0m] [1;37mDEBUG[0m: STREAM closed [22351] (../lib/sbi/nghttp2-server.c:1431) 0000: 00001a01 05000057 4f89c461 96c361be .......WO..a..a. 0010: 94034a6e 2d6a0802 71403f71 915c65f5 ..Jn-j..q(a)?q.\e. 0020: 3168df 1h. [32m09/04 09:32:39.455[0m: [[33msbi[0m] [1;37mDEBUG[0m: [204:PATCH]
http://127.0.0.200:7777/nnrf-nfm/v1/nf-instances/2cdb9240-a843-41f1-9f0d-01…
(../lib/sbi/client.c:744) [32m09/04 09:32:39.455[0m: [[33msbi[0m] [1;37mDEBUG[0m: RECEIVED[0] (../lib/sbi/client.c:755) [32m09/04 09:32:39.455[0m: [[33mamf[0m] [1;37mDEBUG[0m: amf_state_operational(): OGS_EVENT_NAME_SBI_CLIENT (../src/amf/amf-sm.c:84) [32m09/04 09:32:39.456[0m: [[33msbi[0m] [1;37mDEBUG[0m: ogs_sbi_nf_state_registered(): OGS_EVENT_NAME_SBI_CLIENT (../lib/sbi/nf-sm.c:312) Waiting for packet dumper to finish... 1 (prev_count=1284, count=10080) MTC@e30ab461b77c: External command `<
https://jenkins.osmocom.org/jenkins/job/ttcn3-5gc-test-ogs/ws/src/osmo-ttcn…
> C5G_Tests.TC_ue_service_request_cm_connected error' was executed successfully (exit status: 0). MTC@e30ab461b77c: Starting external command `<
https://jenkins.osmocom.org/jenkins/job/ttcn3-5gc-test-ogs/ws/src/osmo-ttcn…
> C5G_Tests.TC_net_triggered_service_req'. ------ C5G_Tests.TC_net_triggered_service_req ------ (09:32:41) load average: 1.86, 2.01, 1.43 /usr/bin/dumpcap -q -s 1520 -n -i any -w "<
https://jenkins.osmocom.org/jenkins/job/ttcn3-5gc-test-ogs/469/artifact/log…
"> ><
https://jenkins.osmocom.org/jenkins/job/ttcn3-5gc-test-ogs/469/artifact/log…
> 2>/tmp/cmderr & Waiting for packet dumper to start... 0 [1;34m[testenv] Stopping podman container[0m [0;94m[testenv] + ['podman', 'kill', 'testenv-5gc-osmocom-nightly-20260904-0929-ecec0382-1'][0m testenv-5gc-osmocom-nightly-20260904-0929-ecec0382-1 [0;94m[testenv] Skipping clean up scripts, podman container has already stopped[0m [1;34m[testenv] Stopping testsuite (2671508)[0m Error: container has already been removed [0;94m[testenv] feed_watchdog_loop: podman container has stopped[0m [1;34m[testenv] Logs saved to:
https://jenkins.osmocom.org/jenkins/job/ttcn3-5gc-test-ogs/469/artifact/log…
[0m + RC=1 + [ 1 = 0 ] + uptime + grep --color=always -o load.* [01;31m[Kload average: 1.79, 1.99, 1.43[m[K + exit 1 Build step 'Execute shell' marked build as failure Recording test results [Checks API] No suitable checks publisher found.
1
0
0
0
← Newer
1
2
3
4
5
6
Older →
Jump to page:
1
2
3
4
5
6
Results per page:
10
25
50
100
200