lists.osmocom.org
Sign In
Sign Up
Sign In
Sign Up
Manage this list
×
Keyboard Shortcuts
Thread View
j
: Next unread message
k
: Previous unread message
j a
: Jump to all threads
j l
: Jump to MailingList overview
2026
September
August
July
June
May
April
March
February
January
2025
December
November
October
September
August
July
June
May
April
March
February
January
2024
December
November
October
September
August
July
June
May
April
March
February
January
2023
December
November
October
September
August
July
June
May
April
March
February
January
2022
December
November
October
September
August
July
June
May
April
March
February
January
2021
December
November
October
September
August
July
June
May
April
March
February
January
2020
December
November
October
September
August
July
June
May
April
March
February
January
2019
December
November
October
September
August
July
June
May
April
March
List overview
Download
jenkins-notifications
----- 2026 -----
September 2026
August 2026
July 2026
June 2026
May 2026
April 2026
March 2026
February 2026
January 2026
----- 2025 -----
December 2025
November 2025
October 2025
September 2025
August 2025
July 2025
June 2025
May 2025
April 2025
March 2025
February 2025
January 2025
----- 2024 -----
December 2024
November 2024
October 2024
September 2024
August 2024
July 2024
June 2024
May 2024
April 2024
March 2024
February 2024
January 2024
----- 2023 -----
December 2023
November 2023
October 2023
September 2023
August 2023
July 2023
June 2023
May 2023
April 2023
March 2023
February 2023
January 2023
----- 2022 -----
December 2022
November 2022
October 2022
September 2022
August 2022
July 2022
June 2022
May 2022
April 2022
March 2022
February 2022
January 2022
----- 2021 -----
December 2021
November 2021
October 2021
September 2021
August 2021
July 2021
June 2021
May 2021
April 2021
March 2021
February 2021
January 2021
----- 2020 -----
December 2020
November 2020
October 2020
September 2020
August 2020
July 2020
June 2020
May 2020
April 2020
March 2020
February 2020
January 2020
----- 2019 -----
December 2019
November 2019
October 2019
September 2019
August 2019
July 2019
June 2019
May 2019
April 2019
March 2019
jenkins-notifications@lists.osmocom.org
1 participants
6691 discussions
Start a n
N
ew thread
Build failed in Jenkins: ttcn3-bts-test-io_uring #847
by jenkins@lists.osmocom.org
06 Sep '26
06 Sep '26
See <
https://jenkins.osmocom.org/jenkins/job/ttcn3-bts-test-io_uring/847/display…
> Changes: ------------------------------------------ [...truncated 12.58 MiB...] <testcase classname='BTS_Tests:hopping' name='TC_rll_unit_data_req_DCCH' time='2.137096'/> <testcase classname='BTS_Tests:hopping' name='TC_rll_unit_data_req_ACCH' time='4.862558'/> <testcase classname='BTS_Tests:hopping' name='TC_rll_unit_data_ind_DCCH' time='2.958486'/> <testcase classname='BTS_Tests:hopping' name='TC_rll_unit_data_ind_ACCH' time='10.529464'/> <testcase classname='BTS_Tests:hopping' name='TC_chan_act_a51' time='2.652258'/> <testcase classname='BTS_Tests:hopping' name='TC_chan_act_a52' time='2.737797'/> <testcase classname='BTS_Tests:hopping' name='TC_chan_act_a53' time='2.751223'/> <testcase classname='BTS_Tests:hopping' name='TC_chan_act_a54' time='3.583296'/> <testcase classname='BTS_Tests:hopping' name='TC_encr_cmd_a51' time='5.075870'/> <testcase classname='BTS_Tests:hopping' name='TC_encr_cmd_a52' time='5.299131'/> <testcase classname='BTS_Tests:hopping' name='TC_encr_cmd_a53' time='5.142851'/> <testcase classname='BTS_Tests:hopping' name='TC_encr_cmd_a54' time='5.282632'/> <testcase classname='BTS_Tests:hopping' name='TC_err_rep_wrong_mdisc' time='1.219429'/> <testcase classname='BTS_Tests:hopping' name='TC_err_rep_wrong_msg_type' time='1.255050'/> <testcase classname='BTS_Tests:hopping' name='TC_err_rep_wrong_sequence' time='1.217939'/> <testcase classname='BTS_Tests:hopping' name='TC_lapdm_selftest' time='0.001939'/> <testcase classname='BTS_Tests:hopping' name='TC_tch_sign_l2_fill_frame' time='18.968800'/> <testcase classname='BTS_Tests:hopping' name='TC_tch_sign_l2_fill_frame_dtxd' time='6.549145'> <failure type='fail-verdict'>Received DTX TCH fill frame with bad frame number: 175 (mod 104: 71) (mod 26: 19) BTS_Tests.ttcn:9579 BTS_Tests control part BTS_Tests.ttcn:8110 TC_tch_sign_l2_fill_frame_dtxd testcase </failure> </testcase> <testcase classname='BTS_Tests:hopping' name='TC_chopped_ipa_ping' time='24.721963'/> <testcase classname='BTS_Tests:hopping' name='TC_chopped_ipa_payload' time='42.590520'/> <testcase classname='BTS_Tests:hopping' name='TC_ms_pwr_ctrl_constant' time='16.462185'/> <testcase classname='BTS_Tests:hopping' name='TC_ms_pwr_ctrl_pf_ewma' time='31.862823'/> <testcase classname='BTS_Tests:hopping' name='TC_speech_no_rtp_tchf' time='7.243355'/> <testcase classname='BTS_Tests:hopping' name='TC_speech_no_rtp_tchh' time='5.462037'/> <testcase classname='BTS_Tests:hopping' name='TC_speech_rtp_tchf' time='7.586540'/> <testcase classname='BTS_Tests:hopping' name='TC_speech_rtp_tchh' time='5.447588'/> <testcase classname='BTS_Tests:hopping' name='TC_speech_osmux_tchf' time='3.402067'/> <testcase classname='BTS_Tests:hopping' name='TC_speech_osmux_tchh' time='3.490049'/> <testcase classname='BTS_Tests:hopping' name='TC_data_rtp_tchf144' time='5.708088'> <failure type='fail-verdict'>Timeout waiting for matching Downlink data frame BTS_Tests.ttcn:9594 BTS_Tests control part BTS_Tests.ttcn:8781 TC_data_rtp_tchf144 testcase </failure> </testcase> <testcase classname='BTS_Tests:hopping' name='TC_data_rtp_tchf96' time='2.081161'/> <testcase classname='BTS_Tests:hopping' name='TC_data_rtp_tchf48' time='2.189588'/> <testcase classname='BTS_Tests:hopping' name='TC_data_rtp_tchh48' time='5.286833'> <failure type='fail-verdict'>Timeout waiting for matching Downlink data frame BTS_Tests.ttcn:9597 BTS_Tests control part BTS_Tests.ttcn:8880 TC_data_rtp_tchh48 testcase </failure> </testcase> <testcase classname='BTS_Tests:hopping' name='TC_data_rtp_tchf24' time='1.699529'/> <testcase classname='BTS_Tests:hopping' name='TC_data_rtp_tchh24' time='5.346339'> <failure type='fail-verdict'>Timeout waiting for matching Downlink data frame BTS_Tests.ttcn:9599 BTS_Tests control part BTS_Tests.ttcn:8949 TC_data_rtp_tchh24 testcase </failure> </testcase> <testcase classname='BTS_Tests:hopping' name='TC_data_facch_tchf144' time='2.011798'/> <testcase classname='BTS_Tests:hopping' name='TC_data_facch_tchf96' time='1.968112'/> <testcase classname='BTS_Tests:hopping' name='TC_data_facch_tchf48' time='1.958818'/> <testcase classname='BTS_Tests:hopping' name='TC_data_facch_tchh48' time='4.993575'/> <testcase classname='BTS_Tests:hopping' name='TC_data_facch_tchf24' time='2.042464'/> <testcase classname='BTS_Tests:hopping' name='TC_data_facch_tchh24' time='2.260499'/> <testcase classname='BTS_Tests:hopping' name='TC_early_immediate_assignment' time='3.564887'/> <testcase classname='BTS_Tests:hopping' name='TC_acch_overpower_rxqual_thresh' time='9.122230'> <failure type='fail-verdict'>Timeout waiting for L1CTL DATA.ind BTS_Tests.ttcn:9610 BTS_Tests control part BTS_Tests.ttcn:9244 TC_acch_overpower_rxqual_thresh testcase </failure> </testcase> <testcase classname='BTS_Tests:hopping' name='TC_acch_overpower_rxqual_thresh_dtx' time='9.043781'> <failure type='fail-verdict'>Timeout waiting for L1CTL DATA.ind BTS_Tests.ttcn:9611 BTS_Tests control part BTS_Tests.ttcn:9285 TC_acch_overpower_rxqual_thresh_dtx testcase </failure> </testcase> <testcase classname='BTS_Tests:hopping' name='TC_acch_overpower_always_on_facch' time='9.054946'> <failure type='fail-verdict'>Timeout waiting for L1CTL DATA.ind BTS_Tests.ttcn:9612 BTS_Tests control part BTS_Tests.ttcn:9317 TC_acch_overpower_always_on_facch testcase </failure> </testcase> <testcase classname='BTS_Tests:hopping' name='TC_acch_overpower_always_on_sacch' time='9.049748'> <failure type='fail-verdict'>Timeout waiting for L1CTL DATA.ind BTS_Tests.ttcn:9613 BTS_Tests control part BTS_Tests.ttcn:9349 TC_acch_overpower_always_on_sacch testcase </failure> </testcase> <testcase classname='BTS_Tests:hopping' name='TC_acch_overpower_limit' time='8.892584'> <failure type='fail-verdict'>Timeout waiting for L1CTL DATA.ind BTS_Tests.ttcn:9614 BTS_Tests control part BTS_Tests.ttcn:9380 TC_acch_overpower_limit testcase </failure> </testcase> <testcase classname='BTS_Tests_SMSCB:hopping' name='TC_cbch_load_idle_no_cbch' time='11.161859'/> <testcase classname='BTS_Tests_SMSCB:hopping' name='TC_sms_cb_cmd_sdcch4_1block' time='14.286414'/> <testcase classname='BTS_Tests_SMSCB:hopping' name='TC_sms_cb_cmd_sdcch4_2block' time='14.237211'/> <testcase classname='BTS_Tests_SMSCB:hopping' name='TC_sms_cb_cmd_sdcch4_3block' time='14.231942'/> <testcase classname='BTS_Tests_SMSCB:hopping' name='TC_sms_cb_cmd_sdcch4_4block' time='14.240504'/> <testcase classname='BTS_Tests_SMSCB:hopping' name='TC_sms_cb_cmd_sdcch4_multi' time='20.221730'/> <testcase classname='BTS_Tests_SMSCB:hopping' name='TC_sms_cb_cmd_sdcch4_schedule' time='14.183731'/> <testcase classname='BTS_Tests_SMSCB:hopping' name='TC_sms_cb_cmd_sdcch4_default_only' time='16.214315'/> <testcase classname='BTS_Tests_SMSCB:hopping' name='TC_sms_cb_cmd_sdcch4_default_and_normal' time='17.173790'/> <testcase classname='BTS_Tests_SMSCB:hopping' name='TC_sms_cb_cmd_sdcch4_default_then_null' time='26.184989'/> <testcase classname='BTS_Tests_SMSCB:hopping' name='TC_cbc_sdcch4_load_idle' time='16.074420'/> <testcase classname='BTS_Tests_SMSCB:hopping' name='TC_cbc_sdcch4_load_overload' time='18.138932'/> <testcase classname='BTS_Tests_SMSCB:hopping' name='TC_sms_cb_cmd_sdcch8_1block' time='14.225396'/> <testcase classname='BTS_Tests_SMSCB:hopping' name='TC_sms_cb_cmd_sdcch8_2block' time='14.219648'/> <testcase classname='BTS_Tests_SMSCB:hopping' name='TC_sms_cb_cmd_sdcch8_3block' time='14.233456'/> <testcase classname='BTS_Tests_SMSCB:hopping' name='TC_sms_cb_cmd_sdcch8_4block' time='14.222577'/> <testcase classname='BTS_Tests_SMSCB:hopping' name='TC_sms_cb_cmd_sdcch8_multi' time='20.296548'/> <testcase classname='BTS_Tests_SMSCB:hopping' name='TC_sms_cb_cmd_sdcch8_schedule' time='14.162612'/> <testcase classname='BTS_Tests_SMSCB:hopping' name='TC_sms_cb_cmd_sdcch8_default_only' time='16.226698'/> <testcase classname='BTS_Tests_SMSCB:hopping' name='TC_sms_cb_cmd_sdcch8_default_and_normal' time='17.189145'/> <testcase classname='BTS_Tests_SMSCB:hopping' name='TC_cbc_sdcch8_load_idle' time='16.202532'/> <testcase classname='BTS_Tests_SMSCB:hopping' name='TC_cbc_sdcch8_load_overload' time='18.201792'/> <testcase classname='BTS_Tests_SMSCB:hopping' name='TC_etws_p1ro' time='12.182404'/> <testcase classname='BTS_Tests_SMSCB:hopping' name='TC_etws_p1ro_end' time='16.159123'/> <testcase classname='BTS_Tests_SMSCB:hopping' name='TC_etws_pcu' time='1.114093'/> <testcase classname='BTS_Tests_LAPDm:hopping' name='TC_sabm_ua_dcch_sapi0' time='2.892140'/> <testcase classname='BTS_Tests_LAPDm:hopping' name='TC_sabm_ua_dcch_sapi0_nopayload' time='21.497267'/> <testcase classname='BTS_Tests_LAPDm:hopping' name='TC_sabm_ua_dcch_sapi3' time='21.304909'/> <testcase classname='BTS_Tests_LAPDm:hopping' name='TC_sabm_ua_dcch_sapi4' time='21.352081'/> <testcase classname='BTS_Tests_LAPDm:hopping' name='TC_sabm_contention' time='21.256699'/> <testcase classname='BTS_Tests_LAPDm:hopping' name='TC_sabm_retransmit' time='3.159034'/> <testcase classname='BTS_Tests_LAPDm:hopping' name='TC_sabm_retransmit_bts' time='81.445686'/> <testcase classname='BTS_Tests_LAPDm:hopping' name='TC_sabm_invalid_resp' time='23.357491'/> <testcase classname='BTS_Tests_LAPDm:hopping' name='TC_sabm_dm' time='14.020441'/> <testcase classname='BTS_Tests_LAPDm:hopping' name='TC_establish_ign_first_sabm' time='8.208077'/> <testcase classname='BTS_Tests_LAPDm:hopping' name='TC_iframe_seq_and_ack' time='29.591761'> <failure type='fail-verdict'>Received RSL ERROR IND { msg_disc := { msg_group := RSL_MDISC_RLL (1), transparent := false }, msg_type := RSL_MT_ERROR_IND (3), ies := { { iei := RSL_IE_CHAN_NR (1), body := { chan_nr := { u := { sdcch8 := { tag := '01'B, sub_chan := 4 } }, tn := 6 } } }, { iei := RSL_IE_LINK_IDENT (2), body := { link_id := { c := FACCH_SDCCH (0), na := false, prio := SAPI0_PRIO_NORMAL (0), sapi := 0 } } }, { iei := RSL_IE_RLM_CAUSE (22), body := { rlm_cause := { len := 1, payload := '01'O } } } } } BTS_Tests_LAPDm.ttcn:1484 BTS_Tests_LAPDm control part BTS_Tests_LAPDm.ttcn:579 TC_iframe_seq_and_ack testcase </failure> </testcase> <testcase classname='BTS_Tests_LAPDm:hopping' name='TC_iframe_timer_recovery' time='24.623417'> <failure type='fail-verdict'>Received RSL ERROR IND { msg_disc := { msg_group := RSL_MDISC_RLL (1), transparent := false }, msg_type := RSL_MT_ERROR_IND (3), ies := { { iei := RSL_IE_CHAN_NR (1), body := { chan_nr := { u := { sdcch8 := { tag := '01'B, sub_chan := 4 } }, tn := 6 } } }, { iei := RSL_IE_LINK_IDENT (2), body := { link_id := { c := FACCH_SDCCH (0), na := false, prio := SAPI0_PRIO_NORMAL (0), sapi := 0 } } }, { iei := RSL_IE_RLM_CAUSE (22), body := { rlm_cause := { len := 1, payload := '01'O } } } } } BTS_Tests_LAPDm.ttcn:1485 BTS_Tests_LAPDm control part BTS_Tests_LAPDm.ttcn:685 TC_iframe_timer_recovery testcase </failure> </testcase> <testcase classname='BTS_Tests_LAPDm:hopping' name='TC_ns_seq_error' time='29.621621'> <failure type='fail-verdict'>"BTS_Tests.ttcn:732 : Tguard timeout" BTS_Tests_LAPDm.ttcn:1486 BTS_Tests_LAPDm control part BTS_Tests_LAPDm.ttcn:768 TC_ns_seq_error testcase </failure> </testcase> <testcase classname='BTS_Tests_LAPDm:hopping' name='TC_nr_seq_error' time='2.878890'/> <testcase classname='BTS_Tests_LAPDm:hopping' name='TC_rec_invalid_frame' time='119.140150'> <failure type='fail-verdict'>"BTS_Tests_LAPDm.ttcn:909 : Missing LAPDm_RR RSP" BTS_Tests_LAPDm.ttcn:1488 BTS_Tests_LAPDm control part BTS_Tests_LAPDm.ttcn:961 TC_rec_invalid_frame testcase </failure> </testcase> <testcase classname='BTS_Tests_LAPDm:hopping' name='TC_segm_concat_dcch' time='13.507767'> <failure type='fail-verdict'>"BTS_Tests_LAPDm.ttcn:1023 : received unexpected LAPDm { sacch := false, sapi := 0, lapdm := { ab := { addr := { spare := '0'B, lpd := 0, sapi := 0, c_r := false, ea := true }, ctrl := { s := { n_r := 1, p_f := false, s := '10'B, spare := '01'B } }, len := 0, m := false, el := 1, payload := ''O, padding := '2B2B2B2B2B2B2B2B2B2B2B2B2B2B2B2B2B2B2B2B'O (\"++++++++++++++++++++\") } } }" BTS_Tests_LAPDm.ttcn:1489 BTS_Tests_LAPDm control part BTS_Tests_LAPDm.ttcn:1088 TC_segm_concat_dcch testcase </failure> </testcase> <testcase classname='BTS_Tests_LAPDm:hopping' name='TC_segm_concat_sacch' time='48.556569'> <failure type='fail-verdict'>"BTS_Tests_LAPDm.ttcn:1023 : received unexpected LAPDm { sacch := true, sapi := 0, lapdm := { ab := { addr := { spare := '0'B, lpd := 0, sapi := 0, c_r := false, ea := true }, ctrl := { u := { u := '011'B, p_f := true, u2 := '00'B, spare := '11'B } }, len := 0, m := false, el := 1, payload := ''O, padding := '2B2B2B2B2B2B2B2B2B2B2B2B2B2B2B2B2B2B'O (\"++++++++++++++++++\") } } }" BTS_Tests_LAPDm.ttcn:1490 BTS_Tests_LAPDm control part BTS_Tests_LAPDm.ttcn:1093 TC_segm_concat_sacch testcase </failure> </testcase> <testcase classname='BTS_Tests_LAPDm:hopping' name='TC_t200_n200' time='39.835909'> <failure type='fail-verdict'>Missing RSL RLL ERROR INDICATION BTS_Tests_LAPDm.ttcn:1491 BTS_Tests_LAPDm control part BTS_Tests_LAPDm.ttcn:1182 TC_t200_n200 testcase </failure> </testcase> <testcase classname='BTS_Tests_LAPDm:hopping' name='TC_rr_response_frame_loss' time='6.682834'> <failure type='fail-verdict'>Timeout waiting for RR or REJ BTS_Tests_LAPDm.ttcn:1492 BTS_Tests_LAPDm control part BTS_Tests_LAPDm.ttcn:1239 TC_rr_response_frame_loss testcase </failure> </testcase> <testcase classname='BTS_Tests_LAPDm:hopping' name='TC_incorrect_cr' time='15.780757'/> <testcase classname='BTS_Tests_LAPDm:hopping' name='TC_sabm_incorrect_c' time='23.277534'> <failure type='fail-verdict'>"BTS_Tests.ttcn:732 : Tguard timeout" BTS_Tests_LAPDm.ttcn:1494 BTS_Tests_LAPDm control part BTS_Tests_LAPDm.ttcn:1341 TC_sabm_incorrect_c testcase </failure> </testcase> <testcase classname='BTS_Tests_LAPDm:hopping' name='TC_normal_reestablishment' time='16.085605'> <failure type='fail-verdict'>"BTS_Tests_LAPDm.ttcn:1023 : received unexpected LAPDm { sacch := false, sapi := 0, lapdm := { ab := { addr := { spare := '0'B, lpd := 0, sapi := 0, c_r := false, ea := true }, ctrl := { u := { u := '011'B, p_f := true, u2 := '00'B, spare := '11'B } }, len := 5, m := false, el := 1, payload := '63EC78250C'O, padding := '2B2B2B2B2B2B2B2B2B2B2B2B2B2B2B'O (\"+++++++++++++++\") } } }" BTS_Tests_LAPDm.ttcn:1495 BTS_Tests_LAPDm control part BTS_Tests_LAPDm.ttcn:1403 TC_normal_reestablishment testcase </failure> </testcase> <testcase classname='BTS_Tests_LAPDm:hopping' name='TC_normal_reestablishment_state_unacked' time='12.362057'> <failure type='fail-verdict'>"BTS_Tests_LAPDm.ttcn:1023 : received unexpected LAPDm { sacch := false, sapi := 0, lapdm := { ab := { addr := { spare := '0'B, lpd := 0, sapi := 0, c_r := false, ea := true }, ctrl := { s := { n_r := 1, p_f := false, s := '10'B, spare := '01'B } }, len := 0, m := false, el := 1, payload := ''O, padding := '2B2B2B2B2B2B2B2B2B2B2B2B2B2B2B2B2B2B2B2B'O (\"++++++++++++++++++++\") } } }" BTS_Tests_LAPDm.ttcn:1496 BTS_Tests_LAPDm control part BTS_Tests_LAPDm.ttcn:1470 TC_normal_reestablishment_state_unacked testcase </failure> </testcase> <testcase classname='BTS_Tests_VAMOS:hopping' name='TC_vamos_chan_act_vff' time='2.421712'/> <testcase classname='BTS_Tests_VAMOS:hopping' name='TC_vamos_chan_act_vhh' time='2.597909'/> <testcase classname='BTS_Tests_VAMOS:hopping' name='TC_vamos_chan_act_hvhh' time='2.563563'/> <testcase classname='BTS_Tests_VAMOS:hopping' name='TC_vamos_chan_act_dyn_ipa_vff' time='2.538722'/> <testcase classname='BTS_Tests_VAMOS:hopping' name='TC_vamos_chan_act_dyn_osmo_vff' time='2.535913'/> <testcase classname='BTS_Tests_VAMOS:hopping' name='TC_vamos_chan_act_dyn_osmo_vhh' time='2.607567'/> <testcase classname='BTS_Tests_VAMOS:hopping' name='TC_vamos_chan_act_dyn_osmo_hvhh' time='2.518328'/> <testcase classname='BTS_Tests_VAMOS:hopping' name='TC_vamos_chan_mode_modify_vff' time='1.301436'/> <testcase classname='BTS_Tests_VAMOS:hopping' name='TC_vamos_chan_mode_modify_vhh' time='1.347505'/> <testcase classname='BTS_Tests_VAMOS:hopping' name='TC_vamos_chan_mode_modify_hvhh' time='1.356285'/> <testcase classname='BTS_Tests_VAMOS:hopping' name='TC_vamos_chan_mode_modify_dyn_ipa_vff' time='1.318938'/> <testcase classname='BTS_Tests_VAMOS:hopping' name='TC_vamos_chan_mode_modify_dyn_osmo_vff' time='1.337070'/> <testcase classname='BTS_Tests_VAMOS:hopping' name='TC_vamos_chan_mode_modify_dyn_osmo_vhh' time='1.397271'/> <testcase classname='BTS_Tests_VAMOS:hopping' name='TC_vamos_chan_mode_modify_dyn_osmo_hvhh' time='1.381722'/> <testcase classname='BTS_Tests_ASCI:hopping' name='TC_vbs_notification' time='4.643001'/> <testcase classname='BTS_Tests_ASCI:hopping' name='TC_vgcs_uplink_free_and_busy' time='1.813509'/> <testcase classname='BTS_Tests_ASCI:hopping' name='TC_vgcs_talker_fail' time='17.026227'/> <testcase classname='BTS_Tests_ASCI:hopping' name='TC_vgcs_talker_est_rel' time='1.372257'/> <testcase classname='BTS_Tests_ASCI:hopping' name='TC_vgcs_listener_det' time='3.319690'/> </testsuite> <?xml version="1.0"?> <testsuite name='Titan' tests='17' failures='0' errors='0' skipped='0' inconc='0' time='96.00'> <testcase classname='BTS_Tests_OML' name='TC_wrong_mdisc' time='10.752902'/> <testcase classname='BTS_Tests_OML' name='TC_wrong_msgtype' time='0.685509'/> <testcase classname='BTS_Tests_OML' name='TC_short_length' time='0.685481'/> <testcase classname='BTS_Tests_OML' name='TC_long_length' time='0.758053'/> <testcase classname='BTS_Tests_OML' name='TC_wrong_placement' time='0.745472'/> <testcase classname='BTS_Tests_OML' name='TC_wrong_seq' time='0.733389'/> <testcase classname='BTS_Tests_OML' name='TC_wrong_obj_class' time='0.700126'/> <testcase classname='BTS_Tests_OML' name='TC_wrong_bts_nr' time='0.698662'/> <testcase classname='BTS_Tests_OML' name='TC_wrong_trx_nr' time='0.716569'/> <testcase classname='BTS_Tests_OML' name='TC_radio_carrier_opstart_noattr' time='0.723786'/> <testcase classname='BTS_Tests_OML' name='TC_bts_opstart' time='0.704252'/> <testcase classname='BTS_Tests_OML' name='TC_bts_opstart_noattr' time='0.744955'/> <testcase classname='BTS_Tests_OML' name='TC_ts_opstart' time='0.686142'/> <testcase classname='BTS_Tests_OML' name='TC_ts_opstart_noattr' time='0.677909'/> <testcase classname='BTS_Tests_OML' name='TC_initial_state_reports' time='0.680942'/> <testcase classname='BTS_Tests_OML' name='TC_ipa_osmo_pcu_anr_fwd' time='0.686872'/> <testcase classname='BTS_Tests_OML' name='TC_ipa_rsl_connect_nack' time='0.697006'/> </testsuite> + check_respawn_count + set +x [0;31m ================================================================ WARNING: osmo-bts was respawned 5 times (expected: 3)! (OS#6794) ================================================================ [0m+ RC=1 + uptime + grep --color=always -o load.* [01;31m[Kload average: 0.90, 1.08, 3.26[m[K + exit 1 Build step 'Execute shell' marked build as failure Recording test results [Checks API] No suitable checks publisher found.
1
0
0
0
Build failed in Jenkins: ttcn3-bts-test #3253
by jenkins@lists.osmocom.org
06 Sep '26
06 Sep '26
See <
https://jenkins.osmocom.org/jenkins/job/ttcn3-bts-test/3253/display/redirect
> Changes: ------------------------------------------ [...truncated 12.61 MiB...] <testcase classname='BTS_Tests:hopping' name='TC_rll_unit_data_req_DCCH' time='2.362138'/> <testcase classname='BTS_Tests:hopping' name='TC_rll_unit_data_req_ACCH' time='5.310589'/> <testcase classname='BTS_Tests:hopping' name='TC_rll_unit_data_ind_DCCH' time='2.962768'/> <testcase classname='BTS_Tests:hopping' name='TC_rll_unit_data_ind_ACCH' time='11.507693'/> <testcase classname='BTS_Tests:hopping' name='TC_chan_act_a51' time='2.660208'/> <testcase classname='BTS_Tests:hopping' name='TC_chan_act_a52' time='2.694232'/> <testcase classname='BTS_Tests:hopping' name='TC_chan_act_a53' time='2.722300'/> <testcase classname='BTS_Tests:hopping' name='TC_chan_act_a54' time='2.732358'/> <testcase classname='BTS_Tests:hopping' name='TC_encr_cmd_a51' time='5.233887'/> <testcase classname='BTS_Tests:hopping' name='TC_encr_cmd_a52' time='5.201316'/> <testcase classname='BTS_Tests:hopping' name='TC_encr_cmd_a53' time='5.218450'/> <testcase classname='BTS_Tests:hopping' name='TC_encr_cmd_a54' time='5.233411'/> <testcase classname='BTS_Tests:hopping' name='TC_err_rep_wrong_mdisc' time='1.243760'/> <testcase classname='BTS_Tests:hopping' name='TC_err_rep_wrong_msg_type' time='1.294122'/> <testcase classname='BTS_Tests:hopping' name='TC_err_rep_wrong_sequence' time='1.253848'/> <testcase classname='BTS_Tests:hopping' name='TC_lapdm_selftest' time='0.005677'/> <testcase classname='BTS_Tests:hopping' name='TC_tch_sign_l2_fill_frame' time='18.482168'/> <testcase classname='BTS_Tests:hopping' name='TC_tch_sign_l2_fill_frame_dtxd' time='2.123890'> <failure type='fail-verdict'>Received DTX TCH fill frame with bad frame number: 175 (mod 104: 71) (mod 26: 19) BTS_Tests.ttcn:9579 BTS_Tests control part BTS_Tests.ttcn:8110 TC_tch_sign_l2_fill_frame_dtxd testcase </failure> </testcase> <testcase classname='BTS_Tests:hopping' name='TC_chopped_ipa_ping' time='24.729338'/> <testcase classname='BTS_Tests:hopping' name='TC_chopped_ipa_payload' time='42.624546'/> <testcase classname='BTS_Tests:hopping' name='TC_ms_pwr_ctrl_constant' time='16.921291'/> <testcase classname='BTS_Tests:hopping' name='TC_ms_pwr_ctrl_pf_ewma' time='31.538792'/> <testcase classname='BTS_Tests:hopping' name='TC_speech_no_rtp_tchf' time='7.399658'/> <testcase classname='BTS_Tests:hopping' name='TC_speech_no_rtp_tchh' time='5.435021'/> <testcase classname='BTS_Tests:hopping' name='TC_speech_rtp_tchf' time='7.646737'/> <testcase classname='BTS_Tests:hopping' name='TC_speech_rtp_tchh' time='5.564752'/> <testcase classname='BTS_Tests:hopping' name='TC_speech_osmux_tchf' time='3.441128'/> <testcase classname='BTS_Tests:hopping' name='TC_speech_osmux_tchh' time='3.513000'/> <testcase classname='BTS_Tests:hopping' name='TC_data_rtp_tchf144' time='2.191179'/> <testcase classname='BTS_Tests:hopping' name='TC_data_rtp_tchf96' time='2.100743'/> <testcase classname='BTS_Tests:hopping' name='TC_data_rtp_tchf48' time='2.209684'/> <testcase classname='BTS_Tests:hopping' name='TC_data_rtp_tchh48' time='5.241434'> <failure type='fail-verdict'>Timeout waiting for matching Downlink data frame BTS_Tests.ttcn:9597 BTS_Tests control part BTS_Tests.ttcn:8880 TC_data_rtp_tchh48 testcase </failure> </testcase> <testcase classname='BTS_Tests:hopping' name='TC_data_rtp_tchf24' time='1.791748'/> <testcase classname='BTS_Tests:hopping' name='TC_data_rtp_tchh24' time='5.291150'> <failure type='fail-verdict'>Timeout waiting for matching Downlink data frame BTS_Tests.ttcn:9599 BTS_Tests control part BTS_Tests.ttcn:8949 TC_data_rtp_tchh24 testcase </failure> </testcase> <testcase classname='BTS_Tests:hopping' name='TC_data_facch_tchf144' time='1.944481'/> <testcase classname='BTS_Tests:hopping' name='TC_data_facch_tchf96' time='2.037149'/> <testcase classname='BTS_Tests:hopping' name='TC_data_facch_tchf48' time='2.032078'/> <testcase classname='BTS_Tests:hopping' name='TC_data_facch_tchh48' time='2.154447'/> <testcase classname='BTS_Tests:hopping' name='TC_data_facch_tchf24' time='2.032406'/> <testcase classname='BTS_Tests:hopping' name='TC_data_facch_tchh24' time='2.176167'/> <testcase classname='BTS_Tests:hopping' name='TC_early_immediate_assignment' time='3.555515'/> <testcase classname='BTS_Tests:hopping' name='TC_acch_overpower_rxqual_thresh' time='9.086187'> <failure type='fail-verdict'>Timeout waiting for L1CTL DATA.ind BTS_Tests.ttcn:9610 BTS_Tests control part BTS_Tests.ttcn:9244 TC_acch_overpower_rxqual_thresh testcase </failure> </testcase> <testcase classname='BTS_Tests:hopping' name='TC_acch_overpower_rxqual_thresh_dtx' time='9.041500'> <failure type='fail-verdict'>Timeout waiting for L1CTL DATA.ind BTS_Tests.ttcn:9611 BTS_Tests control part BTS_Tests.ttcn:9285 TC_acch_overpower_rxqual_thresh_dtx testcase </failure> </testcase> <testcase classname='BTS_Tests:hopping' name='TC_acch_overpower_always_on_facch' time='9.035845'> <failure type='fail-verdict'>Timeout waiting for L1CTL DATA.ind BTS_Tests.ttcn:9612 BTS_Tests control part BTS_Tests.ttcn:9317 TC_acch_overpower_always_on_facch testcase </failure> </testcase> <testcase classname='BTS_Tests:hopping' name='TC_acch_overpower_always_on_sacch' time='9.067327'> <failure type='fail-verdict'>Timeout waiting for L1CTL DATA.ind BTS_Tests.ttcn:9613 BTS_Tests control part BTS_Tests.ttcn:9349 TC_acch_overpower_always_on_sacch testcase </failure> </testcase> <testcase classname='BTS_Tests:hopping' name='TC_acch_overpower_limit' time='9.036235'> <failure type='fail-verdict'>Timeout waiting for L1CTL DATA.ind BTS_Tests.ttcn:9614 BTS_Tests control part BTS_Tests.ttcn:9380 TC_acch_overpower_limit testcase </failure> </testcase> <testcase classname='BTS_Tests_SMSCB:hopping' name='TC_cbch_load_idle_no_cbch' time='11.162509'/> <testcase classname='BTS_Tests_SMSCB:hopping' name='TC_sms_cb_cmd_sdcch4_1block' time='14.242780'/> <testcase classname='BTS_Tests_SMSCB:hopping' name='TC_sms_cb_cmd_sdcch4_2block' time='14.197098'/> <testcase classname='BTS_Tests_SMSCB:hopping' name='TC_sms_cb_cmd_sdcch4_3block' time='14.231047'/> <testcase classname='BTS_Tests_SMSCB:hopping' name='TC_sms_cb_cmd_sdcch4_4block' time='14.214239'/> <testcase classname='BTS_Tests_SMSCB:hopping' name='TC_sms_cb_cmd_sdcch4_multi' time='20.219069'/> <testcase classname='BTS_Tests_SMSCB:hopping' name='TC_sms_cb_cmd_sdcch4_schedule' time='14.176361'/> <testcase classname='BTS_Tests_SMSCB:hopping' name='TC_sms_cb_cmd_sdcch4_default_only' time='16.236399'/> <testcase classname='BTS_Tests_SMSCB:hopping' name='TC_sms_cb_cmd_sdcch4_default_and_normal' time='17.201927'/> <testcase classname='BTS_Tests_SMSCB:hopping' name='TC_sms_cb_cmd_sdcch4_default_then_null' time='26.240165'/> <testcase classname='BTS_Tests_SMSCB:hopping' name='TC_cbc_sdcch4_load_idle' time='16.082399'/> <testcase classname='BTS_Tests_SMSCB:hopping' name='TC_cbc_sdcch4_load_overload' time='18.265347'/> <testcase classname='BTS_Tests_SMSCB:hopping' name='TC_sms_cb_cmd_sdcch8_1block' time='14.234067'/> <testcase classname='BTS_Tests_SMSCB:hopping' name='TC_sms_cb_cmd_sdcch8_2block' time='14.239223'/> <testcase classname='BTS_Tests_SMSCB:hopping' name='TC_sms_cb_cmd_sdcch8_3block' time='14.250513'/> <testcase classname='BTS_Tests_SMSCB:hopping' name='TC_sms_cb_cmd_sdcch8_4block' time='14.250632'/> <testcase classname='BTS_Tests_SMSCB:hopping' name='TC_sms_cb_cmd_sdcch8_multi' time='20.249281'/> <testcase classname='BTS_Tests_SMSCB:hopping' name='TC_sms_cb_cmd_sdcch8_schedule' time='14.181159'/> <testcase classname='BTS_Tests_SMSCB:hopping' name='TC_sms_cb_cmd_sdcch8_default_only' time='16.331881'/> <testcase classname='BTS_Tests_SMSCB:hopping' name='TC_sms_cb_cmd_sdcch8_default_and_normal' time='17.168484'/> <testcase classname='BTS_Tests_SMSCB:hopping' name='TC_cbc_sdcch8_load_idle' time='16.139705'/> <testcase classname='BTS_Tests_SMSCB:hopping' name='TC_cbc_sdcch8_load_overload' time='18.184435'/> <testcase classname='BTS_Tests_SMSCB:hopping' name='TC_etws_p1ro' time='12.170730'/> <testcase classname='BTS_Tests_SMSCB:hopping' name='TC_etws_p1ro_end' time='16.151972'/> <testcase classname='BTS_Tests_SMSCB:hopping' name='TC_etws_pcu' time='1.119104'/> <testcase classname='BTS_Tests_LAPDm:hopping' name='TC_sabm_ua_dcch_sapi0' time='2.899001'/> <testcase classname='BTS_Tests_LAPDm:hopping' name='TC_sabm_ua_dcch_sapi0_nopayload' time='21.529266'/> <testcase classname='BTS_Tests_LAPDm:hopping' name='TC_sabm_ua_dcch_sapi3' time='21.359242'/> <testcase classname='BTS_Tests_LAPDm:hopping' name='TC_sabm_ua_dcch_sapi4' time='21.306477'/> <testcase classname='BTS_Tests_LAPDm:hopping' name='TC_sabm_contention' time='21.238274'/> <testcase classname='BTS_Tests_LAPDm:hopping' name='TC_sabm_retransmit' time='3.149510'/> <testcase classname='BTS_Tests_LAPDm:hopping' name='TC_sabm_retransmit_bts' time='81.468029'/> <testcase classname='BTS_Tests_LAPDm:hopping' name='TC_sabm_invalid_resp' time='23.367669'/> <testcase classname='BTS_Tests_LAPDm:hopping' name='TC_sabm_dm' time='14.025744'/> <testcase classname='BTS_Tests_LAPDm:hopping' name='TC_establish_ign_first_sabm' time='8.174421'/> <testcase classname='BTS_Tests_LAPDm:hopping' name='TC_iframe_seq_and_ack' time='29.583312'> <failure type='fail-verdict'>Received RSL ERROR IND { msg_disc := { msg_group := RSL_MDISC_RLL (1), transparent := false }, msg_type := RSL_MT_ERROR_IND (3), ies := { { iei := RSL_IE_CHAN_NR (1), body := { chan_nr := { u := { sdcch8 := { tag := '01'B, sub_chan := 4 } }, tn := 6 } } }, { iei := RSL_IE_LINK_IDENT (2), body := { link_id := { c := FACCH_SDCCH (0), na := false, prio := SAPI0_PRIO_NORMAL (0), sapi := 0 } } }, { iei := RSL_IE_RLM_CAUSE (22), body := { rlm_cause := { len := 1, payload := '01'O } } } } } BTS_Tests_LAPDm.ttcn:1484 BTS_Tests_LAPDm control part BTS_Tests_LAPDm.ttcn:579 TC_iframe_seq_and_ack testcase </failure> </testcase> <testcase classname='BTS_Tests_LAPDm:hopping' name='TC_iframe_timer_recovery' time='24.911618'> <failure type='fail-verdict'>Received RSL ERROR IND { msg_disc := { msg_group := RSL_MDISC_RLL (1), transparent := false }, msg_type := RSL_MT_ERROR_IND (3), ies := { { iei := RSL_IE_CHAN_NR (1), body := { chan_nr := { u := { sdcch8 := { tag := '01'B, sub_chan := 4 } }, tn := 6 } } }, { iei := RSL_IE_LINK_IDENT (2), body := { link_id := { c := FACCH_SDCCH (0), na := false, prio := SAPI0_PRIO_NORMAL (0), sapi := 0 } } }, { iei := RSL_IE_RLM_CAUSE (22), body := { rlm_cause := { len := 1, payload := '01'O } } } } } BTS_Tests_LAPDm.ttcn:1485 BTS_Tests_LAPDm control part BTS_Tests_LAPDm.ttcn:685 TC_iframe_timer_recovery testcase </failure> </testcase> <testcase classname='BTS_Tests_LAPDm:hopping' name='TC_ns_seq_error' time='34.210126'> <failure type='fail-verdict'>"BTS_Tests.ttcn:732 : Tguard timeout" BTS_Tests_LAPDm.ttcn:1486 BTS_Tests_LAPDm control part BTS_Tests_LAPDm.ttcn:768 TC_ns_seq_error testcase </failure> </testcase> <testcase classname='BTS_Tests_LAPDm:hopping' name='TC_nr_seq_error' time='5.371976'> <failure type='fail-verdict'>Missing DISC from BTS BTS_Tests_LAPDm.ttcn:1487 BTS_Tests_LAPDm control part BTS_Tests_LAPDm.ttcn:831 TC_nr_seq_error testcase </failure> </testcase> <testcase classname='BTS_Tests_LAPDm:hopping' name='TC_rec_invalid_frame' time='87.384835'> <failure type='fail-verdict'>"BTS_Tests_LAPDm.ttcn:913 : Missing LAPDm_RR RSP" BTS_Tests_LAPDm.ttcn:1488 BTS_Tests_LAPDm control part BTS_Tests_LAPDm.ttcn:961 TC_rec_invalid_frame testcase </failure> </testcase> <testcase classname='BTS_Tests_LAPDm:hopping' name='TC_segm_concat_dcch' time='10.639287'> <failure type='fail-verdict'>"BTS_Tests_LAPDm.ttcn:1023 : received unexpected LAPDm { sacch := false, sapi := 0, lapdm := { ab := { addr := { spare := '0'B, lpd := 0, sapi := 0, c_r := false, ea := true }, ctrl := { s := { n_r := 1, p_f := false, s := '10'B, spare := '01'B } }, len := 0, m := false, el := 1, payload := ''O, padding := '2B2B2B2B2B2B2B2B2B2B2B2B2B2B2B2B2B2B2B2B'O (\"++++++++++++++++++++\") } } }" BTS_Tests_LAPDm.ttcn:1489 BTS_Tests_LAPDm control part BTS_Tests_LAPDm.ttcn:1088 TC_segm_concat_dcch testcase </failure> </testcase> <testcase classname='BTS_Tests_LAPDm:hopping' name='TC_segm_concat_sacch' time='50.794623'> <failure type='fail-verdict'>"BTS_Tests_LAPDm.ttcn:1023 : received unexpected LAPDm { sacch := true, sapi := 0, lapdm := { ab := { addr := { spare := '0'B, lpd := 0, sapi := 0, c_r := false, ea := true }, ctrl := { u := { u := '011'B, p_f := true, u2 := '00'B, spare := '11'B } }, len := 0, m := false, el := 1, payload := ''O, padding := '2B2B2B2B2B2B2B2B2B2B2B2B2B2B2B2B2B2B'O (\"++++++++++++++++++\") } } }" BTS_Tests_LAPDm.ttcn:1490 BTS_Tests_LAPDm control part BTS_Tests_LAPDm.ttcn:1093 TC_segm_concat_sacch testcase </failure> </testcase> <testcase classname='BTS_Tests_LAPDm:hopping' name='TC_t200_n200' time='40.134733'> <failure type='fail-verdict'>Missing RSL RLL ERROR INDICATION BTS_Tests_LAPDm.ttcn:1491 BTS_Tests_LAPDm control part BTS_Tests_LAPDm.ttcn:1182 TC_t200_n200 testcase </failure> </testcase> <testcase classname='BTS_Tests_LAPDm:hopping' name='TC_rr_response_frame_loss' time='11.391153'> <failure type='fail-verdict'>Timeout waiting for RR or REJ BTS_Tests_LAPDm.ttcn:1492 BTS_Tests_LAPDm control part BTS_Tests_LAPDm.ttcn:1239 TC_rr_response_frame_loss testcase </failure> </testcase> <testcase classname='BTS_Tests_LAPDm:hopping' name='TC_incorrect_cr' time='15.899311'/> <testcase classname='BTS_Tests_LAPDm:hopping' name='TC_sabm_incorrect_c' time='23.408331'> <failure type='fail-verdict'>"BTS_Tests.ttcn:732 : Tguard timeout" BTS_Tests_LAPDm.ttcn:1494 BTS_Tests_LAPDm control part BTS_Tests_LAPDm.ttcn:1341 TC_sabm_incorrect_c testcase </failure> </testcase> <testcase classname='BTS_Tests_LAPDm:hopping' name='TC_normal_reestablishment' time='25.904644'> <failure type='fail-verdict'>"BTS_Tests_LAPDm.ttcn:1023 : received unexpected LAPDm { sacch := false, sapi := 0, lapdm := { ab := { addr := { spare := '0'B, lpd := 0, sapi := 0, c_r := false, ea := true }, ctrl := { s := { n_r := 3, p_f := false, s := '10'B, spare := '01'B } }, len := 0, m := false, el := 1, payload := ''O, padding := '2B2B2B2B2B2B2B2B2B2B2B2B2B2B2B2B2B2B2B2B'O (\"++++++++++++++++++++\") } } }" BTS_Tests_LAPDm.ttcn:1495 BTS_Tests_LAPDm control part BTS_Tests_LAPDm.ttcn:1403 TC_normal_reestablishment testcase </failure> </testcase> <testcase classname='BTS_Tests_LAPDm:hopping' name='TC_normal_reestablishment_state_unacked' time='12.179504'> <failure type='fail-verdict'>"BTS_Tests_LAPDm.ttcn:1023 : received unexpected LAPDm { sacch := false, sapi := 0, lapdm := { ab := { addr := { spare := '0'B, lpd := 0, sapi := 0, c_r := false, ea := true }, ctrl := { s := { n_r := 1, p_f := false, s := '10'B, spare := '01'B } }, len := 0, m := false, el := 1, payload := ''O, padding := '2B2B2B2B2B2B2B2B2B2B2B2B2B2B2B2B2B2B2B2B'O (\"++++++++++++++++++++\") } } }" BTS_Tests_LAPDm.ttcn:1496 BTS_Tests_LAPDm control part BTS_Tests_LAPDm.ttcn:1470 TC_normal_reestablishment_state_unacked testcase </failure> </testcase> <testcase classname='BTS_Tests_VAMOS:hopping' name='TC_vamos_chan_act_vff' time='2.594911'/> <testcase classname='BTS_Tests_VAMOS:hopping' name='TC_vamos_chan_act_vhh' time='2.543865'/> <testcase classname='BTS_Tests_VAMOS:hopping' name='TC_vamos_chan_act_hvhh' time='2.588056'/> <testcase classname='BTS_Tests_VAMOS:hopping' name='TC_vamos_chan_act_dyn_ipa_vff' time='2.540875'/> <testcase classname='BTS_Tests_VAMOS:hopping' name='TC_vamos_chan_act_dyn_osmo_vff' time='5.365692'/> <testcase classname='BTS_Tests_VAMOS:hopping' name='TC_vamos_chan_act_dyn_osmo_vhh' time='2.632379'/> <testcase classname='BTS_Tests_VAMOS:hopping' name='TC_vamos_chan_act_dyn_osmo_hvhh' time='2.530126'/> <testcase classname='BTS_Tests_VAMOS:hopping' name='TC_vamos_chan_mode_modify_vff' time='1.293024'/> <testcase classname='BTS_Tests_VAMOS:hopping' name='TC_vamos_chan_mode_modify_vhh' time='1.385812'/> <testcase classname='BTS_Tests_VAMOS:hopping' name='TC_vamos_chan_mode_modify_hvhh' time='1.347317'/> <testcase classname='BTS_Tests_VAMOS:hopping' name='TC_vamos_chan_mode_modify_dyn_ipa_vff' time='1.388949'/> <testcase classname='BTS_Tests_VAMOS:hopping' name='TC_vamos_chan_mode_modify_dyn_osmo_vff' time='1.342311'/> <testcase classname='BTS_Tests_VAMOS:hopping' name='TC_vamos_chan_mode_modify_dyn_osmo_vhh' time='1.386609'/> <testcase classname='BTS_Tests_VAMOS:hopping' name='TC_vamos_chan_mode_modify_dyn_osmo_hvhh' time='1.530889'/> <testcase classname='BTS_Tests_ASCI:hopping' name='TC_vbs_notification' time='4.707824'/> <testcase classname='BTS_Tests_ASCI:hopping' name='TC_vgcs_uplink_free_and_busy' time='1.830457'/> <testcase classname='BTS_Tests_ASCI:hopping' name='TC_vgcs_talker_fail' time='16.520069'/> <testcase classname='BTS_Tests_ASCI:hopping' name='TC_vgcs_talker_est_rel' time='1.383390'/> <testcase classname='BTS_Tests_ASCI:hopping' name='TC_vgcs_listener_det' time='3.361224'/> </testsuite> <?xml version="1.0"?> <testsuite name='Titan' tests='17' failures='0' errors='0' skipped='0' inconc='0' time='96.00'> <testcase classname='BTS_Tests_OML' name='TC_wrong_mdisc' time='10.647169'/> <testcase classname='BTS_Tests_OML' name='TC_wrong_msgtype' time='0.707657'/> <testcase classname='BTS_Tests_OML' name='TC_short_length' time='0.701020'/> <testcase classname='BTS_Tests_OML' name='TC_long_length' time='0.711224'/> <testcase classname='BTS_Tests_OML' name='TC_wrong_placement' time='0.718254'/> <testcase classname='BTS_Tests_OML' name='TC_wrong_seq' time='0.712302'/> <testcase classname='BTS_Tests_OML' name='TC_wrong_obj_class' time='0.707085'/> <testcase classname='BTS_Tests_OML' name='TC_wrong_bts_nr' time='0.722222'/> <testcase classname='BTS_Tests_OML' name='TC_wrong_trx_nr' time='0.700993'/> <testcase classname='BTS_Tests_OML' name='TC_radio_carrier_opstart_noattr' time='0.707281'/> <testcase classname='BTS_Tests_OML' name='TC_bts_opstart' time='0.708083'/> <testcase classname='BTS_Tests_OML' name='TC_bts_opstart_noattr' time='0.706045'/> <testcase classname='BTS_Tests_OML' name='TC_ts_opstart' time='0.716567'/> <testcase classname='BTS_Tests_OML' name='TC_ts_opstart_noattr' time='0.697146'/> <testcase classname='BTS_Tests_OML' name='TC_initial_state_reports' time='0.711034'/> <testcase classname='BTS_Tests_OML' name='TC_ipa_osmo_pcu_anr_fwd' time='0.740870'/> <testcase classname='BTS_Tests_OML' name='TC_ipa_rsl_connect_nack' time='0.733082'/> </testsuite> + check_respawn_count + set +x [0;31m ================================================================ WARNING: osmo-bts was respawned 5 times (expected: 3)! (OS#6794) ================================================================ [0m+ RC=1 + uptime + grep --color=always -o load.* [01;31m[Kload average: 11.64, 10.36, 5.92[m[K + exit 1 Build step 'Execute shell' marked build as failure Recording test results [Checks API] No suitable checks publisher found.
1
2
0
0
Jenkins build became unstable: ttcn3-bsc-test-io_uring #696
by jenkins@lists.osmocom.org
05 Sep '26
05 Sep '26
See <
https://jenkins.osmocom.org/jenkins/job/ttcn3-bsc-test-io_uring/696/display…
>
1
1
0
0
Build failed in Jenkins: ttcn3-5gc-test-ogs-latest #297
by jenkins@lists.osmocom.org
05 Sep '26
05 Sep '26
See <
https://jenkins.osmocom.org/jenkins/job/ttcn3-5gc-test-ogs-latest/297/displ…
> Changes: ------------------------------------------ [...truncated 251.28 MiB...] [32m09/05 13:47:00.976[0m: [[33msbi[0m] [1;37mDEBUG[0m: [{"op":"replace","path":"/nfStatus","value":"REGISTERED"},{"op":"replace","path":"/load","value":24}] (../lib/sbi/client.c:548) [32m09/05 13:47:00.976[0m: [[33msbi[0m] [1;37mDEBUG[0m: STREAM added [607] (../lib/sbi/nghttp2-server.c:1737) [32m09/05 13:47:00.977[0m: [[33msbi[0m] [1;37mDEBUG[0m: [PATCH] /nnrf-nfm/v1/nf-instances/d3e6d77e-a92f-41f1-baa9-339c3efa7f1a (../lib/sbi/nghttp2-server.c:1308) [32m09/05 13:47:00.977[0m: [[33msbi[0m] [1;37mDEBUG[0m: RECEIVED: 101 (../lib/sbi/nghttp2-server.c:1312) [32m09/05 13:47:00.977[0m: [[33msbi[0m] [1;37mDEBUG[0m: [{"op":"replace","path":"/nfStatus","value":"REGISTERED"},{"op":"replace","path":"/load","value":24}] (../lib/sbi/nghttp2-server.c:1314) [32m09/05 13:47:00.977[0m: [[33mnrf[0m] [1;37mDEBUG[0m: nrf_state_operational(): OGS_EVENT_NAME_SBI_SERVER (../src/nrf/nrf-sm.c:54) [32m09/05 13:47:00.977[0m: [[33mnrf[0m] [1;37mDEBUG[0m: nrf_nf_state_registered(): OGS_EVENT_NAME_SBI_SERVER (../src/nrf/nf-sm.c:201) [32m09/05 13:47:00.977[0m: [[33msbi[0m] [1;37mDEBUG[0m: STATUS [204] (../lib/sbi/nghttp2-server.c:702) [32m09/05 13:47:00.977[0m: [[33msbi[0m] [1;37mDEBUG[0m: STREAM closed [607] (../lib/sbi/nghttp2-server.c:1419) 0000: 00000301 05000002 5f89fbbe ........_... [32m09/05 13:47:00.977[0m: [[33msbi[0m] [1;37mDEBUG[0m: [204:PATCH]
http://127.0.0.10:7777/nnrf-nfm/v1/nf-instances/d3e6d77e-a92f-41f1-baa9-339…
(../lib/sbi/client.c:744) [32m09/05 13:47:00.977[0m: [[33msbi[0m] [1;37mDEBUG[0m: RECEIVED[0] (../lib/sbi/client.c:755) [32m09/05 13:47:00.977[0m: [[33msbi[0m] [1;37mDEBUG[0m: STATUS [204] (../lib/sbi/nghttp2-server.c:702) [32m09/05 13:47:00.977[0m: [[33msbi[0m] [1;37mDEBUG[0m: STREAM closed [5771] (../lib/sbi/nghttp2-server.c:1419) 0000: 00001a01 05000016 8b89c161 96dc34fd ...........a..4. 0010: 2806d4dc 5ad41004 e28166e3 4edc0014 (...Z.....f.N... 0020: c5a37f ... [32m09/05 13:47:00.977[0m: [[33msbi[0m] [1;37mDEBUG[0m: [204:PATCH]
http://127.0.0.200:7777/nnrf-nfm/v1/nf-instances/d3e6d77e-a92f-41f1-baa9-33…
(../lib/sbi/client.c:744) [32m09/05 13:47:00.977[0m: [[33msbi[0m] [1;37mDEBUG[0m: RECEIVED[0] (../lib/sbi/client.c:755) [32m09/05 13:47:00.977[0m: [[33mpcf[0m] [1;37mDEBUG[0m: pcf_state_operational(): OGS_EVENT_NAME_SBI_CLIENT (../src/pcf/pcf-sm.c:64) [32m09/05 13:47:00.977[0m: [[33msbi[0m] [1;37mDEBUG[0m: ogs_sbi_nf_state_registered(): OGS_EVENT_NAME_SBI_CLIENT (../lib/sbi/nf-sm.c:358) Waiting for packet dumper to finish... 1 (prev_count=4320, count=13096) [32m09/05 13:47:01.160[0m: [[33mamf[0m] [1;37mDEBUG[0m: amf_state_operational(): OGS_EVENT_NAME_SBI_TIMER (../src/amf/amf-sm.c:83) [32m09/05 13:47:01.160[0m: [[33msbi[0m] [1;37mDEBUG[0m: ogs_sbi_nf_state_registered(): OGS_EVENT_NAME_SBI_TIMER (../lib/sbi/nf-sm.c:358) [32m09/05 13:47:01.160[0m: [[33msbi[0m] [1;37mDEBUG[0m: [PATCH]
http://127.0.0.200:7777/nnrf-nfm/v1/nf-instances/d40427ca-a92f-41f1-b8dd-df…
(../lib/sbi/client.c:797) [32m09/05 13:47:01.160[0m: [[33msbi[0m] [1;37mDEBUG[0m: SENDING...[100] (../lib/sbi/client.c:546) [32m09/05 13:47:01.160[0m: [[33msbi[0m] [1;37mDEBUG[0m: [{"op":"replace","path":"/nfStatus","value":"REGISTERED"},{"op":"replace","path":"/load","value":0}] (../lib/sbi/client.c:548) [32m09/05 13:47:01.161[0m: [[33msbi[0m] [1;37mDEBUG[0m: STREAM added [23947] (../lib/sbi/nghttp2-server.c:1737) [32m09/05 13:47:01.161[0m: [[33msbi[0m] [1;37mDEBUG[0m: [PATCH] /nnrf-nfm/v1/nf-instances/d40427ca-a92f-41f1-b8dd-df70ec584a7d (../lib/sbi/nghttp2-server.c:1308) [32m09/05 13:47:01.161[0m: [[33msbi[0m] [1;37mDEBUG[0m: RECEIVED: 100 (../lib/sbi/nghttp2-server.c:1312) [32m09/05 13:47:01.161[0m: [[33msbi[0m] [1;37mDEBUG[0m: [{"op":"replace","path":"/nfStatus","value":"REGISTERED"},{"op":"replace","path":"/load","value":0}] (../lib/sbi/nghttp2-server.c:1314) [32m09/05 13:47:01.161[0m: [[33msbi[0m] [1;37mDEBUG[0m: [PATCH]
http://127.0.0.10:7777/nnrf-nfm/v1/nf-instances/d40427ca-a92f-41f1-b8dd-df7…
(../lib/sbi/client.c:797) [32m09/05 13:47:01.161[0m: [[33msbi[0m] [1;37mDEBUG[0m: SENDING...[100] (../lib/sbi/client.c:546) [32m09/05 13:47:01.161[0m: [[33msbi[0m] [1;37mDEBUG[0m: [{"op":"replace","path":"/nfStatus","value":"REGISTERED"},{"op":"replace","path":"/load","value":0}] (../lib/sbi/client.c:548) [32m09/05 13:47:01.161[0m: [[33msbi[0m] [1;37mDEBUG[0m: STREAM added [609] (../lib/sbi/nghttp2-server.c:1737) [32m09/05 13:47:01.161[0m: [[33msbi[0m] [1;37mDEBUG[0m: [PATCH] /nnrf-nfm/v1/nf-instances/d40427ca-a92f-41f1-b8dd-df70ec584a7d (../lib/sbi/nghttp2-server.c:1308) [32m09/05 13:47:01.161[0m: [[33msbi[0m] [1;37mDEBUG[0m: RECEIVED: 100 (../lib/sbi/nghttp2-server.c:1312) [32m09/05 13:47:01.161[0m: [[33msbi[0m] [1;37mDEBUG[0m: [{"op":"replace","path":"/nfStatus","value":"REGISTERED"},{"op":"replace","path":"/load","value":0}] (../lib/sbi/nghttp2-server.c:1314) [32m09/05 13:47:01.161[0m: [[33mnrf[0m] [1;37mDEBUG[0m: nrf_state_operational(): OGS_EVENT_NAME_SBI_SERVER (../src/nrf/nrf-sm.c:54) [32m09/05 13:47:01.162[0m: [[33mnrf[0m] [1;37mDEBUG[0m: nrf_nf_state_registered(): OGS_EVENT_NAME_SBI_SERVER (../src/nrf/nf-sm.c:201) [32m09/05 13:47:01.162[0m: [[33msbi[0m] [1;37mDEBUG[0m: STATUS [204] (../lib/sbi/nghttp2-server.c:702) [32m09/05 13:47:01.162[0m: [[33msbi[0m] [1;37mDEBUG[0m: STREAM closed [609] (../lib/sbi/nghttp2-server.c:1419) 0000: 00001a01 05000002 6189fb61 96dc34fd ........a..a..4. 0010: 2806d4dc 5ad41004 e28166e3 4edc0054 (...Z.....f.N..T 0020: c5a37f ... [32m09/05 13:47:01.162[0m: [[33msbi[0m] [1;37mDEBUG[0m: [204:PATCH]
http://127.0.0.10:7777/nnrf-nfm/v1/nf-instances/d40427ca-a92f-41f1-b8dd-df7…
(../lib/sbi/client.c:744) [32m09/05 13:47:01.162[0m: [[33msbi[0m] [1;37mDEBUG[0m: RECEIVED[0] (../lib/sbi/client.c:755) [32m09/05 13:47:01.162[0m: [[33msbi[0m] [1;37mDEBUG[0m: STATUS [204] (../lib/sbi/nghttp2-server.c:702) [32m09/05 13:47:01.162[0m: [[33msbi[0m] [1;37mDEBUG[0m: STREAM closed [23947] (../lib/sbi/nghttp2-server.c:1419) [32m09/05 13:47:01.162[0m: [[33msbi[0m] [1;37mDEBUG[0m: [204:PATCH]
http://127.0.0.200:7777/nnrf-nfm/v1/nf-instances/d40427ca-a92f-41f1-b8dd-df…
(../lib/sbi/client.c:744) [32m09/05 13:47:01.162[0m: [[33msbi[0m] [1;37mDEBUG[0m: RECEIVED[0] (../lib/sbi/client.c:755) [32m09/05 13:47:01.162[0m: [[33mamf[0m] [1;37mDEBUG[0m: amf_state_operational(): OGS_EVENT_NAME_SBI_CLIENT (../src/amf/amf-sm.c:83) [32m09/05 13:47:01.162[0m: [[33msbi[0m] [1;37mDEBUG[0m: ogs_sbi_nf_state_registered(): OGS_EVENT_NAME_SBI_CLIENT (../lib/sbi/nf-sm.c:358) 0000: 00001a01 0500005d 8b89c961 96dc34fd .......]...a..4. 0010: 2806d4dc 5ad41004 e28166e3 4edc0054 (...Z.....f.N..T 0020: c5a37f ... MTC@34589de6d3da: External command `<
https://jenkins.osmocom.org/jenkins/job/ttcn3-5gc-test-ogs-latest/ws/src/os…
> C5G_Tests.TC_normal_reg_emergency_services error' was executed successfully (exit status: 0). MTC@34589de6d3da: Starting external command `<
https://jenkins.osmocom.org/jenkins/job/ttcn3-5gc-test-ogs-latest/ws/src/os…
> C5G_Tests.TC_normal_reg_emergency_services_fallback'. ------ C5G_Tests.TC_normal_reg_emergency_services_fallback ------ (13:47:02) load average: 3.73, 2.82, 2.36 /usr/bin/dumpcap -q -s 1520 -n -i any -w "<
https://jenkins.osmocom.org/jenkins/job/ttcn3-5gc-test-ogs-latest/297/artif…
"> ><
https://jenkins.osmocom.org/jenkins/job/ttcn3-5gc-test-ogs-latest/297/artif…
> 2>/tmp/cmderr & Waiting for packet dumper to start... 0 MTC@34589de6d3da: External command `<
https://jenkins.osmocom.org/jenkins/job/ttcn3-5gc-test-ogs-latest/ws/src/os…
> C5G_Tests.TC_normal_reg_emergency_services_fallback' was executed successfully (exit status: 0). MTC@34589de6d3da: Test case TC_normal_reg_emergency_services_fallback started. GTP1U_EM(861)@34589de6d3da: Warning: sizes of 'struct sctp_event_subscribe': compile-time 14, kernel: 14 GTP1U_EM(861)@34589de6d3da: setverdict(fail): none -> fail reason: "Could not connect UECUPS socket, check your configuration", new component reason: "Could not connect UECUPS socket, check your configuration" GTP1U_EM(861)@34589de6d3da: Dynamic test case error: testcase.stop GTP1U_EM(861)@34589de6d3da: setverdict(error): fail -> error GTP1U_EM(861)@34589de6d3da: Final verdict of PTC: error TC_normal_reg_emergency_services_fallback-NGAP0(862)@34589de6d3da: Warning: sizes of 'struct sctp_event_subscribe': compile-time 14, kernel: 14 [32m09/05 13:47:03.286[0m: [[33mamf[0m] [1;32mINFO[0m: gNB-N2 accepted[127.0.0.202]:50000 in ng-path module (../src/amf/ngap-sctp.c:113) [32m09/05 13:47:03.286[0m: [[33mamf[0m] [1;37mDEBUG[0m: amf_state_operational(): AMF_EVENT_NGAP_LO_ACCEPT (../src/amf/amf-sm.c:83) [32m09/05 13:47:03.286[0m: [[33mamf[0m] [1;32mINFO[0m: gNB-N2 accepted[127.0.0.202] in master_sm module (../src/amf/amf-sm.c:818) [32m09/05 13:47:03.291[0m: [[33mamf[0m] [1;37mDEBUG[0m: ngap_state_initial(): ENTRY (../src/amf/ngap-sm.c:28) [32m09/05 13:47:03.291[0m: [[33mamf[0m] [1;37mDEBUG[0m: ngap_state_operational(): ENTRY (../src/amf/ngap-sm.c:55) [32m09/05 13:47:03.291[0m: [[33mamf[0m] [1;32mINFO[0m: [Added] Number of gNBs is now 1 (../src/amf/context.c:1277) [32m09/05 13:47:03.291[0m: [[33mamf[0m] [1;37mDEBUG[0m: SCTP_ASSOC_CHANGE:[T:32769, F:0x0, S:0, I/O:64/30] (../src/amf/ngap-sctp.c:152) [32m09/05 13:47:03.291[0m: [[33mamf[0m] [1;37mDEBUG[0m: SCTP_COMM_UP (../src/amf/ngap-sctp.c:161) [32m09/05 13:47:03.291[0m: [[33mamf[0m] [1;37mDEBUG[0m: amf_state_operational(): AMF_EVENT_NGAP_LO_SCTP_COMM_UP (../src/amf/amf-sm.c:83) [32m09/05 13:47:03.291[0m: [[33mamf[0m] [1;32mINFO[0m: gNB-N2[127.0.0.202] max_num_of_ostreams : 30 (../src/amf/amf-sm.c:865) TC_normal_reg_emergency_services_fallback-NGAP1(863)@34589de6d3da: Warning: sizes of 'struct sctp_event_subscribe': compile-time 14, kernel: 14 [32m09/05 13:47:03.299[0m: [[33mamf[0m] [1;32mINFO[0m: gNB-N2 accepted[127.0.0.202]:50001 in ng-path module (../src/amf/ngap-sctp.c:113) [32m09/05 13:47:03.299[0m: [[33mamf[0m] [1;37mDEBUG[0m: amf_state_operational(): AMF_EVENT_NGAP_LO_ACCEPT (../src/amf/amf-sm.c:83) [32m09/05 13:47:03.299[0m: [[33mamf[0m] [1;32mINFO[0m: gNB-N2 accepted[127.0.0.202] in master_sm module (../src/amf/amf-sm.c:818) [32m09/05 13:47:03.303[0m: [[33mamf[0m] [1;37mDEBUG[0m: ngap_state_initial(): ENTRY (../src/amf/ngap-sm.c:28) [32m09/05 13:47:03.303[0m: [[33mamf[0m] [1;37mDEBUG[0m: ngap_state_operational(): ENTRY (../src/amf/ngap-sm.c:55) [32m09/05 13:47:03.303[0m: [[33mamf[0m] [1;32mINFO[0m: [Added] Number of gNBs is now 2 (../src/amf/context.c:1277) [32m09/05 13:47:03.303[0m: [[33mamf[0m] [1;37mDEBUG[0m: SCTP_ASSOC_CHANGE:[T:32769, F:0x0, S:0, I/O:64/30] (../src/amf/ngap-sctp.c:152) [32m09/05 13:47:03.303[0m: [[33mamf[0m] [1;37mDEBUG[0m: SCTP_COMM_UP (../src/amf/ngap-sctp.c:161) [32m09/05 13:47:03.303[0m: [[33mamf[0m] [1;37mDEBUG[0m: amf_state_operational(): AMF_EVENT_NGAP_LO_SCTP_COMM_UP (../src/amf/amf-sm.c:83) [32m09/05 13:47:03.303[0m: [[33mamf[0m] [1;32mINFO[0m: gNB-N2[127.0.0.202] max_num_of_ostreams : 30 (../src/amf/amf-sm.c:865) [32m09/05 13:47:03.307[0m: [[33mamf[0m] [1;37mDEBUG[0m: amf_state_operational(): AMF_EVENT_NGAP_MESSAGE (../src/amf/amf-sm.c:83) [32m09/05 13:47:03.307[0m: [[33mamf[0m] [1;37mDEBUG[0m: ngap_state_operational(): AMF_EVENT_NGAP_MESSAGE (../src/amf/ngap-sm.c:55) [32m09/05 13:47:03.307[0m: [[33mamf[0m] [1;37mDEBUG[0m: NGSetupRequest (../src/amf/ngap-handler.c:288) [32m09/05 13:47:03.307[0m: [[33mamf[0m] [1;37mDEBUG[0m: IP[127.0.0.202] GNB_ID[0x0] GNB_ID_LENGTH[22] (../src/amf/ngap-handler.c:386) [32m09/05 13:47:03.307[0m: [[33mamf[0m] [1;37mDEBUG[0m: PLMN_ID[MCC:999 MNC:70] (../src/amf/ngap-handler.c:391) [32m09/05 13:47:03.307[0m: [[33mamf[0m] [1;37mDEBUG[0m: PagingDRX[0] (../src/amf/ngap-handler.c:395) [32m09/05 13:47:03.307[0m: [[33mamf[0m] [1;37mDEBUG[0m: TAC[1] (../src/amf/ngap-handler.c:439) [32m09/05 13:47:03.307[0m: [[33mamf[0m] [1;37mDEBUG[0m: PLMN_ID[MCC:999 MNC:70] (../src/amf/ngap-handler.c:501) [32m09/05 13:47:03.307[0m: [[33mamf[0m] [1;37mDEBUG[0m: S_NSSAI[SST:1 SD:0xffffff] (../src/amf/ngap-handler.c:562) [32m09/05 13:47:03.307[0m: [[33mamf[0m] [1;37mDEBUG[0m: TAC[1] (../src/amf/ngap-handler.c:72) [32m09/05 13:47:03.307[0m: [[33mamf[0m] [1;37mDEBUG[0m: PLMN_ID[MCC:999 MNC:70] (../src/amf/ngap-handler.c:73) [32m09/05 13:47:03.307[0m: [[33mamf[0m] [1;37mDEBUG[0m: SERVED_TAI_INDEX[0] (../src/amf/ngap-handler.c:78) [32m09/05 13:47:03.307[0m: [[33mamf[0m] [1;37mDEBUG[0m: PLMN_ID[MCC:999 MNC:70] (../src/amf/ngap-handler.c:100) [32m09/05 13:47:03.307[0m: [[33mamf[0m] [1;37mDEBUG[0m: S_NSSAI[SST:1 SD:0xffffff] (../src/amf/ngap-handler.c:105) [32m09/05 13:47:03.307[0m: [[33mamf[0m] [1;37mDEBUG[0m: NG-Setup response (../src/amf/ngap-path.c:356) [32m09/05 13:47:03.307[0m: [[33mamf[0m] [1;37mDEBUG[0m: NGSetupResponse (../src/amf/ngap-build.c:91) [32m09/05 13:47:03.307[0m: [[33mamf[0m] [1;37mDEBUG[0m: IP[127.0.0.202] RAN_ID[0] (../src/amf/ngap-path.c:64) MTC@34589de6d3da: setverdict(pass): none -> pass MTC@34589de6d3da: Dynamic test case error: Error message was received from MC: The connect operation refers to test component with component reference 861, which has already terminated. MTC@34589de6d3da: setverdict(error): pass -> error TC_normal_reg_emergency_services_fallback0(864)@34589de6d3da: Final verdict of PTC: none [32m09/05 13:47:03.315[0m: [[33mamf[0m] [1;37mDEBUG[0m: SCTP_SHUTDOWN_EVENT:[T:32773, F:0x0, L:12] (../src/amf/ngap-sctp.c:193) [32m09/05 13:47:03.315[0m: [[33mamf[0m] [1;37mDEBUG[0m: amf_state_operational(): AMF_EVENT_NGAP_LO_CONNREFUSED (../src/amf/amf-sm.c:83) [32m09/05 13:47:03.315[0m: [[33mamf[0m] [1;32mINFO[0m: gNB-N2[127.0.0.202] connection refused!!! (../src/amf/amf-sm.c:878) [32m09/05 13:47:03.315[0m: [[33mamf[0m] [1;37mDEBUG[0m: ngap_state_operational(): EXIT (../src/amf/ngap-sm.c:55) [32m09/05 13:47:03.315[0m: [[33mamf[0m] [1;37mDEBUG[0m: ngap_state_final(): EXIT (../src/amf/ngap-sm.c:37) [32m09/05 13:47:03.315[0m: [[33mamf[0m] [1;32mINFO[0m: [Removed] Number of gNBs is now 1 (../src/amf/context.c:1305) [32m09/05 13:47:03.315[0m: [[33mamf[0m] [1;37mDEBUG[0m: SCTP_SHUTDOWN_EVENT:[T:32773, F:0x0, L:12] (../src/amf/ngap-sctp.c:193) [32m09/05 13:47:03.315[0m: [[33mamf[0m] [1;37mDEBUG[0m: amf_state_operational(): AMF_EVENT_NGAP_LO_CONNREFUSED (../src/amf/amf-sm.c:83) [32m09/05 13:47:03.315[0m: [[33mamf[0m] [1;32mINFO[0m: gNB-N2[127.0.0.202] connection refused!!! (../src/amf/amf-sm.c:878) [32m09/05 13:47:03.315[0m: [[33mamf[0m] [1;37mDEBUG[0m: ngap_state_operational(): EXIT (../src/amf/ngap-sm.c:55) [32m09/05 13:47:03.315[0m: [[33mamf[0m] [1;37mDEBUG[0m: ngap_state_final(): EXIT (../src/amf/ngap-sm.c:37) [32m09/05 13:47:03.315[0m: [[33mamf[0m] [1;32mINFO[0m: [Removed] Number of gNBs is now 0 (../src/amf/context.c:1305) TC_normal_reg_emergency_services_fallback-NGAP1(863)@34589de6d3da: Final verdict of PTC: none TC_normal_reg_emergency_services_fallback-NGAP0(862)@34589de6d3da: Final verdict of PTC: none MTC@34589de6d3da: Setting final verdict of the test case. MTC@34589de6d3da: Local verdict of MTC: error MTC@34589de6d3da: Local verdict of PTC GTP1U_EM(861): error (error -> error) MTC@34589de6d3da: Local verdict of PTC TC_normal_reg_emergency_services_fallback-NGAP0(862): none (error -> error) MTC@34589de6d3da: Local verdict of PTC TC_normal_reg_emergency_services_fallback-NGAP1(863): none (error -> error) MTC@34589de6d3da: Local verdict of PTC TC_normal_reg_emergency_services_fallback0(864): none (error -> error) MTC@34589de6d3da: Test case TC_normal_reg_emergency_services_fallback finished. Verdict: error MTC@34589de6d3da: Starting external command `<
https://jenkins.osmocom.org/jenkins/job/ttcn3-5gc-test-ogs-latest/ws/src/os…
> C5G_Tests.TC_normal_reg_emergency_services_fallback error'. (13:47:03) load average: 3.51, 2.79, 2.35 [1;31m------ C5G_Tests.TC_normal_reg_emergency_services_fallback error ------[0m Waiting for packet dumper to finish... 0 (prev_count=-1, count=224) Waiting for packet dumper to finish... 1 (prev_count=224, count=4788) MTC@34589de6d3da: External command `<
https://jenkins.osmocom.org/jenkins/job/ttcn3-5gc-test-ogs-latest/ws/src/os…
> C5G_Tests.TC_normal_reg_emergency_services_fallback error' was executed successfully (exit status: 0). MTC@34589de6d3da: Starting external command `<
https://jenkins.osmocom.org/jenkins/job/ttcn3-5gc-test-ogs-latest/ws/src/os…
> C5G_Tests.TC_emergency_registration'. ------ C5G_Tests.TC_emergency_registration ------ (13:47:05) load average: 3.51, 2.79, 2.35 /usr/bin/dumpcap -q -s 1520 -n -i any -w "<
https://jenkins.osmocom.org/jenkins/job/ttcn3-5gc-test-ogs-latest/297/artif…
"> ><
https://jenkins.osmocom.org/jenkins/job/ttcn3-5gc-test-ogs-latest/297/artif…
> 2>/tmp/cmderr & Waiting for packet dumper to start... 0 MTC@34589de6d3da: External command `<
https://jenkins.osmocom.org/jenkins/job/ttcn3-5gc-test-ogs-latest/ws/src/os…
> C5G_Tests.TC_emergency_registration' was executed successfully (exit status: 0). MTC@34589de6d3da: Test case TC_emergency_registration started. GTP1U_EM(865)@34589de6d3da: Warning: sizes of 'struct sctp_event_subscribe': compile-time 14, kernel: 14 GTP1U_EM(865)@34589de6d3da: setverdict(fail): none -> fail reason: "Could not connect UECUPS socket, check your configuration", new component reason: "Could not connect UECUPS socket, check your configuration" GTP1U_EM(865)@34589de6d3da: Dynamic test case error: testcase.stop GTP1U_EM(865)@34589de6d3da: setverdict(error): fail -> error GTP1U_EM(865)@34589de6d3da: Final verdict of PTC: error TC_emergency_registration-NGAP0(866)@34589de6d3da: Warning: sizes of 'struct sctp_event_subscribe': compile-time 14, kernel: 14 [32m09/05 13:47:06.471[0m: [[33mamf[0m] [1;32mINFO[0m: gNB-N2 accepted[127.0.0.202]:50000 in ng-path module (../src/amf/ngap-sctp.c:113) [32m09/05 13:47:06.471[0m: [[33mamf[0m] [1;37mDEBUG[0m: amf_state_operational(): AMF_EVENT_NGAP_LO_ACCEPT (../src/amf/amf-sm.c:83) [32m09/05 13:47:06.471[0m: [[33mamf[0m] [1;32mINFO[0m: gNB-N2 accepted[127.0.0.202] in master_sm module (../src/amf/amf-sm.c:818) [32m09/05 13:47:06.476[0m: [[33mamf[0m] [1;37mDEBUG[0m: ngap_state_initial(): ENTRY (../src/amf/ngap-sm.c:28) [32m09/05 13:47:06.476[0m: [[33mamf[0m] [1;37mDEBUG[0m: ngap_state_operational(): ENTRY (../src/amf/ngap-sm.c:55) [32m09/05 13:47:06.476[0m: [[33mamf[0m] [1;32mINFO[0m: [Added] Number of gNBs is now 1 (../src/amf/context.c:1277) [32m09/05 13:47:06.476[0m: [[33mamf[0m] [1;37mDEBUG[0m: SCTP_ASSOC_CHANGE:[T:32769, F:0x0, S:0, I/O:64/30] (../src/amf/ngap-sctp.c:152) [32m09/05 13:47:06.476[0m: [[33mamf[0m] [1;37mDEBUG[0m: SCTP_COMM_UP (../src/amf/ngap-sctp.c:161) [32m09/05 13:47:06.476[0m: [[33mamf[0m] [1;37mDEBUG[0m: amf_state_operational(): AMF_EVENT_NGAP_LO_SCTP_COMM_UP (../src/amf/amf-sm.c:83) [32m09/05 13:47:06.476[0m: [[33mamf[0m] [1;32mINFO[0m: gNB-N2[127.0.0.202] max_num_of_ostreams : 30 (../src/amf/amf-sm.c:865) TC_emergency_registration-NGAP1(867)@34589de6d3da: Warning: sizes of 'struct sctp_event_subscribe': compile-time 14, kernel: 14 [32m09/05 13:47:06.480[0m: [[33mamf[0m] [1;32mINFO[0m: gNB-N2 accepted[127.0.0.202]:50001 in ng-path module (../src/amf/ngap-sctp.c:113) [32m09/05 13:47:06.480[0m: [[33mamf[0m] [1;37mDEBUG[0m: amf_state_operational(): AMF_EVENT_NGAP_LO_ACCEPT (../src/amf/amf-sm.c:83) [32m09/05 13:47:06.480[0m: [[33mamf[0m] [1;32mINFO[0m: gNB-N2 accepted[127.0.0.202] in master_sm module (../src/amf/amf-sm.c:818) [32m09/05 13:47:06.484[0m: [[33mamf[0m] [1;37mDEBUG[0m: ngap_state_initial(): ENTRY (../src/amf/ngap-sm.c:28) [32m09/05 13:47:06.484[0m: [[33mamf[0m] [1;37mDEBUG[0m: ngap_state_operational(): ENTRY (../src/amf/ngap-sm.c:55) [32m09/05 13:47:06.484[0m: [[33mamf[0m] [1;32mINFO[0m: [Added] Number of gNBs is now 2 (../src/amf/context.c:1277) [32m09/05 13:47:06.484[0m: [[33mamf[0m] [1;37mDEBUG[0m: SCTP_ASSOC_CHANGE:[T:32769, F:0x0, S:0, I/O:64/30] (../src/amf/ngap-sctp.c:152) [32m09/05 13:47:06.484[0m: [[33mamf[0m] [1;37mDEBUG[0m: SCTP_COMM_UP (../src/amf/ngap-sctp.c:161) [32m09/05 13:47:06.484[0m: [[33mamf[0m] [1;37mDEBUG[0m: amf_state_operational(): AMF_EVENT_NGAP_LO_SCTP_COMM_UP (../src/amf/amf-sm.c:83) [32m09/05 13:47:06.484[0m: [[33mamf[0m] [1;32mINFO[0m: gNB-N2[127.0.0.202] max_num_of_ostreams : 30 (../src/amf/amf-sm.c:865) [32m09/05 13:47:06.488[0m: [[33mamf[0m] [1;37mDEBUG[0m: amf_state_operational(): AMF_EVENT_NGAP_MESSAGE (../src/amf/amf-sm.c:83) [32m09/05 13:47:06.488[0m: [[33mamf[0m] [1;37mDEBUG[0m: ngap_state_operational(): AMF_EVENT_NGAP_MESSAGE (../src/amf/ngap-sm.c:55) [32m09/05 13:47:06.488[0m: [[33mamf[0m] [1;37mDEBUG[0m: NGSetupRequest (../src/amf/ngap-handler.c:288) [32m09/05 13:47:06.488[0m: [[33mamf[0m] [1;37mDEBUG[0m: IP[127.0.0.202] GNB_ID[0x0] GNB_ID_LENGTH[22] (../src/amf/ngap-handler.c:386) [32m09/05 13:47:06.488[0m: [[33mamf[0m] [1;37mDEBUG[0m: PLMN_ID[MCC:999 MNC:70] (../src/amf/ngap-handler.c:391) [32m09/05 13:47:06.488[0m: [[33mamf[0m] [1;37mDEBUG[0m: PagingDRX[0] (../src/amf/ngap-handler.c:395) [32m09/05 13:47:06.488[0m: [[33mamf[0m] [1;37mDEBUG[0m: TAC[1] (../src/amf/ngap-handler.c:439) [32m09/05 13:47:06.488[0m: [[33mamf[0m] [1;37mDEBUG[0m: PLMN_ID[MCC:999 MNC:70] (../src/amf/ngap-handler.c:501) [32m09/05 13:47:06.488[0m: [[33mamf[0m] [1;37mDEBUG[0m: S_NSSAI[SST:1 SD:0xffffff] (../src/amf/ngap-handler.c:562) [32m09/05 13:47:06.488[0m: [[33mamf[0m] [1;37mDEBUG[0m: TAC[1] (../src/amf/ngap-handler.c:72) [32m09/05 13:47:06.488[0m: [[33mamf[0m] [1;37mDEBUG[0m: PLMN_ID[MCC:999 MNC:70] (../src/amf/ngap-handler.c:73) [32m09/05 13:47:06.488[0m: [[33mamf[0m] [1;37mDEBUG[0m: SERVED_TAI_INDEX[0] (../src/amf/ngap-handler.c:78) [32m09/05 13:47:06.488[0m: [[33mamf[0m] [1;37mDEBUG[0m: PLMN_ID[MCC:999 MNC:70] (../src/amf/ngap-handler.c:100) [32m09/05 13:47:06.488[0m: [[33mamf[0m] [1;37mDEBUG[0m: S_NSSAI[SST:1 SD:0xffffff] (../src/amf/ngap-handler.c:105) [32m09/05 13:47:06.488[0m: [[33mamf[0m] [1;37mDEBUG[0m: NG-Setup response (../src/amf/ngap-path.c:356) [32m09/05 13:47:06.488[0m: [[33mamf[0m] [1;37mDEBUG[0m: NGSetupResponse (../src/amf/ngap-build.c:91) [32m09/05 13:47:06.488[0m: [[33mamf[0m] [1;37mDEBUG[0m: IP[127.0.0.202] RAN_ID[0] (../src/amf/ngap-path.c:64) MTC@34589de6d3da: setverdict(pass): none -> pass MTC@34589de6d3da: Dynamic test case error: Error message was received from MC: The connect operation refers to test component with component reference 865, which has already terminated. MTC@34589de6d3da: setverdict(error): pass -> error [32m09/05 13:47:06.496[0m: [[33mamf[0m] [1;37mDEBUG[0m: SCTP_SHUTDOWN_EVENT:[T:32773, F:0x0, L:12] (../src/amf/ngap-sctp.c:193) [32m09/05 13:47:06.496[0m: [[33mamf[0m] [1;37mDEBUG[0m: amf_state_operational(): AMF_EVENT_NGAP_LO_CONNREFUSED (../src/amf/amf-sm.c:83) [32m09/05 13:47:06.496[0m: [[33mamf[0m] [1;32mINFO[0m: gNB-N2[127.0.0.202] connection refused!!! (../src/amf/amf-sm.c:878) [32m09/05 13:47:06.496[0m: [[33mamf[0m] [1;37mDEBUG[0m: ngap_state_operational(): EXIT (../src/amf/ngap-sm.c:55) [32m09/05 13:47:06.496[0m: [[33mamf[0m] [1;37mDEBUG[0m: ngap_state_final(): EXIT (../src/amf/ngap-sm.c:37) TC_emergency_registration0(868)@34589de6d3da: Final verdict of PTC: none [32m09/05 13:47:06.496[0m: [[33mamf[0m] [1;32mINFO[0m: [Removed] Number of gNBs is now 1 (../src/amf/context.c:1305) [32m09/05 13:47:06.496[0m: [[33mamf[0m] [1;37mDEBUG[0m: SCTP_SHUTDOWN_EVENT:[T:32773, F:0x0, L:12] (../src/amf/ngap-sctp.c:193) [32m09/05 13:47:06.496[0m: [[33mamf[0m] [1;37mDEBUG[0m: amf_state_operational(): AMF_EVENT_NGAP_LO_CONNREFUSED (../src/amf/amf-sm.c:83) [32m09/05 13:47:06.496[0m: [[33mamf[0m] [1;32mINFO[0m: gNB-N2[127.0.0.202] connection refused!!! (../src/amf/amf-sm.c:878) [32m09/05 13:47:06.496[0m: [[33mamf[0m] [1;37mDEBUG[0m: ngap_state_operational(): EXIT (../src/amf/ngap-sm.c:55) [32m09/05 13:47:06.496[0m: [[33mamf[0m] [1;37mDEBUG[0m: ngap_state_final(): EXIT (../src/amf/ngap-sm.c:37) [32m09/05 13:47:06.496[0m: [[33mamf[0m] [1;32mINFO[0m: [Removed] Number of gNBs is now 0 (../src/amf/context.c:1305) TC_emergency_registration-NGAP1(867)@34589de6d3da: Final verdict of PTC: none TC_emergency_registration-NGAP0(866)@34589de6d3da: Final verdict of PTC: none MTC@34589de6d3da: Setting final verdict of the test case. MTC@34589de6d3da: Local verdict of MTC: error MTC@34589de6d3da: Local verdict of PTC GTP1U_EM(865): error (error -> error) MTC@34589de6d3da: Local verdict of PTC TC_emergency_registration-NGAP0(866): none (error -> error) MTC@34589de6d3da: Local verdict of PTC TC_emergency_registration-NGAP1(867): none (error -> error) MTC@34589de6d3da: Local verdict of PTC TC_emergency_registration0(868): none (error -> error) MTC@34589de6d3da: Test case TC_emergency_registration finished. Verdict: error MTC@34589de6d3da: Starting external command `<
https://jenkins.osmocom.org/jenkins/job/ttcn3-5gc-test-ogs-latest/ws/src/os…
> C5G_Tests.TC_emergency_registration error'. (13:47:06) load average: 3.51, 2.79, 2.35 [1;31m------ C5G_Tests.TC_emergency_registration error ------[0m Waiting for packet dumper to finish... 0 (prev_count=-1, count=440) Waiting for packet dumper to finish... 1 (prev_count=440, count=4676) MTC@34589de6d3da: External command `<
https://jenkins.osmocom.org/jenkins/job/ttcn3-5gc-test-ogs-latest/ws/src/os…
> C5G_Tests.TC_emergency_registration error' was executed successfully (exit status: 0). MTC@34589de6d3da: Starting external command `<
https://jenkins.osmocom.org/jenkins/job/ttcn3-5gc-test-ogs-latest/ws/src/os…
> C5G_Tests.TC_handover_inter_ngran_n2'. ------ C5G_Tests.TC_handover_inter_ngran_n2 ------ (13:47:08) load average: 3.31, 2.76, 2.34 /usr/bin/dumpcap -q -s 1520 -n -i any -w "<
https://jenkins.osmocom.org/jenkins/job/ttcn3-5gc-test-ogs-latest/297/artif…
"> ><
https://jenkins.osmocom.org/jenkins/job/ttcn3-5gc-test-ogs-latest/297/artif…
> 2>/tmp/cmderr & Waiting for packet dumper to start... 0 [1;34m[testenv] Stopping podman container[0m [0;94m[testenv] + ['podman', 'kill', 'testenv-5gc-osmocom-latest-20260905-1343-7b528284-1'][0m testenv-5gc-osmocom-latest-20260905-1343-7b528284-1 [0;94m[testenv] Skipping clean up scripts, podman container has already stopped[0m [1;34m[testenv] Stopping testsuite (725954)[0m Error: container has already been removed Error: container has already been removed Error: container has already been removed Error: container has already been removed Error: container has already been removed [0;94m[testenv] feed_watchdog_loop: podman container has stopped[0m [1;34m[testenv] Logs saved to:
https://jenkins.osmocom.org/jenkins/job/ttcn3-5gc-test-ogs-latest/297/artif…
[0m + RC=1 + [ 1 = 0 ] + uptime + grep --color=always -o load.* [01;31m[Kload average: 3.31, 2.76, 2.34[m[K + exit 1 Build step 'Execute shell' marked build as failure Recording test results [Checks API] No suitable checks publisher found.
1
0
0
0
Build failed in Jenkins: ttcn3-bts-test-asan #812
by jenkins@lists.osmocom.org
05 Sep '26
05 Sep '26
See <
https://jenkins.osmocom.org/jenkins/job/ttcn3-bts-test-asan/812/display/red…
> Changes: ------------------------------------------ [...truncated 12.42 MiB...] <failure type='fail-verdict'>"BTS_Tests.ttcn:732 : Tguard timeout" BTS_Tests.ttcn:9557 BTS_Tests control part BTS_Tests.ttcn:7525 TC_rll_rel_req testcase </failure> </testcase> <testcase classname='BTS_Tests:hopping' name='TC_rll_unit_data_req_DCCH' time='2.373098'/> <testcase classname='BTS_Tests:hopping' name='TC_rll_unit_data_req_ACCH' time='5.330908'/> <testcase classname='BTS_Tests:hopping' name='TC_rll_unit_data_ind_DCCH' time='2.902570'/> <testcase classname='BTS_Tests:hopping' name='TC_rll_unit_data_ind_ACCH' time='10.589984'/> <testcase classname='BTS_Tests:hopping' name='TC_chan_act_a51' time='2.644789'/> <testcase classname='BTS_Tests:hopping' name='TC_chan_act_a52' time='2.732014'/> <testcase classname='BTS_Tests:hopping' name='TC_chan_act_a53' time='2.719138'/> <testcase classname='BTS_Tests:hopping' name='TC_chan_act_a54' time='2.778889'/> <testcase classname='BTS_Tests:hopping' name='TC_encr_cmd_a51' time='5.245847'/> <testcase classname='BTS_Tests:hopping' name='TC_encr_cmd_a52' time='5.225019'/> <testcase classname='BTS_Tests:hopping' name='TC_encr_cmd_a53' time='5.217072'/> <testcase classname='BTS_Tests:hopping' name='TC_encr_cmd_a54' time='5.235731'/> <testcase classname='BTS_Tests:hopping' name='TC_err_rep_wrong_mdisc' time='1.231386'/> <testcase classname='BTS_Tests:hopping' name='TC_err_rep_wrong_msg_type' time='1.293920'/> <testcase classname='BTS_Tests:hopping' name='TC_err_rep_wrong_sequence' time='1.287850'/> <testcase classname='BTS_Tests:hopping' name='TC_lapdm_selftest' time='0.024934'/> <testcase classname='BTS_Tests:hopping' name='TC_tch_sign_l2_fill_frame' time='18.414402'/> <testcase classname='BTS_Tests:hopping' name='TC_tch_sign_l2_fill_frame_dtxd' time='2.135621'> <failure type='fail-verdict'>Received DTX TCH fill frame with bad frame number: 175 (mod 104: 71) (mod 26: 19) BTS_Tests.ttcn:9579 BTS_Tests control part BTS_Tests.ttcn:8110 TC_tch_sign_l2_fill_frame_dtxd testcase </failure> </testcase> <testcase classname='BTS_Tests:hopping' name='TC_chopped_ipa_ping' time='24.721468'/> <testcase classname='BTS_Tests:hopping' name='TC_chopped_ipa_payload' time='42.610791'/> <testcase classname='BTS_Tests:hopping' name='TC_ms_pwr_ctrl_constant' time='16.890380'/> <testcase classname='BTS_Tests:hopping' name='TC_ms_pwr_ctrl_pf_ewma' time='32.004907'/> <testcase classname='BTS_Tests:hopping' name='TC_speech_no_rtp_tchf' time='7.418268'/> <testcase classname='BTS_Tests:hopping' name='TC_speech_no_rtp_tchh' time='5.450701'/> <testcase classname='BTS_Tests:hopping' name='TC_speech_rtp_tchf' time='7.712212'/> <testcase classname='BTS_Tests:hopping' name='TC_speech_rtp_tchh' time='5.472445'/> <testcase classname='BTS_Tests:hopping' name='TC_speech_osmux_tchf' time='3.389859'/> <testcase classname='BTS_Tests:hopping' name='TC_speech_osmux_tchh' time='3.446470'/> <testcase classname='BTS_Tests:hopping' name='TC_data_rtp_tchf144' time='2.085045'/> <testcase classname='BTS_Tests:hopping' name='TC_data_rtp_tchf96' time='2.225284'/> <testcase classname='BTS_Tests:hopping' name='TC_data_rtp_tchf48' time='2.226826'/> <testcase classname='BTS_Tests:hopping' name='TC_data_rtp_tchh48' time='5.303300'> <failure type='fail-verdict'>Timeout waiting for matching Downlink data frame BTS_Tests.ttcn:9597 BTS_Tests control part BTS_Tests.ttcn:8880 TC_data_rtp_tchh48 testcase </failure> </testcase> <testcase classname='BTS_Tests:hopping' name='TC_data_rtp_tchf24' time='1.810828'/> <testcase classname='BTS_Tests:hopping' name='TC_data_rtp_tchh24' time='5.346409'> <failure type='fail-verdict'>Timeout waiting for matching Downlink data frame BTS_Tests.ttcn:9599 BTS_Tests control part BTS_Tests.ttcn:8949 TC_data_rtp_tchh24 testcase </failure> </testcase> <testcase classname='BTS_Tests:hopping' name='TC_data_facch_tchf144' time='2.003592'/> <testcase classname='BTS_Tests:hopping' name='TC_data_facch_tchf96' time='2.025395'/> <testcase classname='BTS_Tests:hopping' name='TC_data_facch_tchf48' time='2.038871'/> <testcase classname='BTS_Tests:hopping' name='TC_data_facch_tchh48' time='2.168423'/> <testcase classname='BTS_Tests:hopping' name='TC_data_facch_tchf24' time='2.114960'/> <testcase classname='BTS_Tests:hopping' name='TC_data_facch_tchh24' time='2.183181'/> <testcase classname='BTS_Tests:hopping' name='TC_early_immediate_assignment' time='3.565384'/> <testcase classname='BTS_Tests:hopping' name='TC_acch_overpower_rxqual_thresh' time='9.085471'> <failure type='fail-verdict'>Timeout waiting for L1CTL DATA.ind BTS_Tests.ttcn:9610 BTS_Tests control part BTS_Tests.ttcn:9244 TC_acch_overpower_rxqual_thresh testcase </failure> </testcase> <testcase classname='BTS_Tests:hopping' name='TC_acch_overpower_rxqual_thresh_dtx' time='9.038736'> <failure type='fail-verdict'>Timeout waiting for L1CTL DATA.ind BTS_Tests.ttcn:9611 BTS_Tests control part BTS_Tests.ttcn:9285 TC_acch_overpower_rxqual_thresh_dtx testcase </failure> </testcase> <testcase classname='BTS_Tests:hopping' name='TC_acch_overpower_always_on_facch' time='9.025439'> <failure type='fail-verdict'>Timeout waiting for L1CTL DATA.ind BTS_Tests.ttcn:9612 BTS_Tests control part BTS_Tests.ttcn:9317 TC_acch_overpower_always_on_facch testcase </failure> </testcase> <testcase classname='BTS_Tests:hopping' name='TC_acch_overpower_always_on_sacch' time='9.048964'> <failure type='fail-verdict'>Timeout waiting for L1CTL DATA.ind BTS_Tests.ttcn:9613 BTS_Tests control part BTS_Tests.ttcn:9349 TC_acch_overpower_always_on_sacch testcase </failure> </testcase> <testcase classname='BTS_Tests:hopping' name='TC_acch_overpower_limit' time='9.047440'> <failure type='fail-verdict'>Timeout waiting for L1CTL DATA.ind BTS_Tests.ttcn:9614 BTS_Tests control part BTS_Tests.ttcn:9380 TC_acch_overpower_limit testcase </failure> </testcase> <testcase classname='BTS_Tests_SMSCB:hopping' name='TC_cbch_load_idle_no_cbch' time='11.165898'/> <testcase classname='BTS_Tests_SMSCB:hopping' name='TC_sms_cb_cmd_sdcch4_1block' time='14.263999'/> <testcase classname='BTS_Tests_SMSCB:hopping' name='TC_sms_cb_cmd_sdcch4_2block' time='14.201127'/> <testcase classname='BTS_Tests_SMSCB:hopping' name='TC_sms_cb_cmd_sdcch4_3block' time='14.218588'/> <testcase classname='BTS_Tests_SMSCB:hopping' name='TC_sms_cb_cmd_sdcch4_4block' time='14.225706'/> <testcase classname='BTS_Tests_SMSCB:hopping' name='TC_sms_cb_cmd_sdcch4_multi' time='20.222077'/> <testcase classname='BTS_Tests_SMSCB:hopping' name='TC_sms_cb_cmd_sdcch4_schedule' time='14.143212'/> <testcase classname='BTS_Tests_SMSCB:hopping' name='TC_sms_cb_cmd_sdcch4_default_only' time='16.211399'/> <testcase classname='BTS_Tests_SMSCB:hopping' name='TC_sms_cb_cmd_sdcch4_default_and_normal' time='17.193154'/> <testcase classname='BTS_Tests_SMSCB:hopping' name='TC_sms_cb_cmd_sdcch4_default_then_null' time='26.174242'/> <testcase classname='BTS_Tests_SMSCB:hopping' name='TC_cbc_sdcch4_load_idle' time='16.058773'/> <testcase classname='BTS_Tests_SMSCB:hopping' name='TC_cbc_sdcch4_load_overload' time='18.220937'/> <testcase classname='BTS_Tests_SMSCB:hopping' name='TC_sms_cb_cmd_sdcch8_1block' time='14.258377'/> <testcase classname='BTS_Tests_SMSCB:hopping' name='TC_sms_cb_cmd_sdcch8_2block' time='14.228796'/> <testcase classname='BTS_Tests_SMSCB:hopping' name='TC_sms_cb_cmd_sdcch8_3block' time='14.211236'/> <testcase classname='BTS_Tests_SMSCB:hopping' name='TC_sms_cb_cmd_sdcch8_4block' time='14.210475'/> <testcase classname='BTS_Tests_SMSCB:hopping' name='TC_sms_cb_cmd_sdcch8_multi' time='20.207725'/> <testcase classname='BTS_Tests_SMSCB:hopping' name='TC_sms_cb_cmd_sdcch8_schedule' time='14.197506'/> <testcase classname='BTS_Tests_SMSCB:hopping' name='TC_sms_cb_cmd_sdcch8_default_only' time='16.235928'/> <testcase classname='BTS_Tests_SMSCB:hopping' name='TC_sms_cb_cmd_sdcch8_default_and_normal' time='17.243045'/> <testcase classname='BTS_Tests_SMSCB:hopping' name='TC_cbc_sdcch8_load_idle' time='16.269774'/> <testcase classname='BTS_Tests_SMSCB:hopping' name='TC_cbc_sdcch8_load_overload' time='18.173098'/> <testcase classname='BTS_Tests_SMSCB:hopping' name='TC_etws_p1ro' time='12.184144'/> <testcase classname='BTS_Tests_SMSCB:hopping' name='TC_etws_p1ro_end' time='16.171305'/> <testcase classname='BTS_Tests_SMSCB:hopping' name='TC_etws_pcu' time='1.160426'/> <testcase classname='BTS_Tests_LAPDm:hopping' name='TC_sabm_ua_dcch_sapi0' time='2.898619'/> <testcase classname='BTS_Tests_LAPDm:hopping' name='TC_sabm_ua_dcch_sapi0_nopayload' time='21.410426'/> <testcase classname='BTS_Tests_LAPDm:hopping' name='TC_sabm_ua_dcch_sapi3' time='21.378200'/> <testcase classname='BTS_Tests_LAPDm:hopping' name='TC_sabm_ua_dcch_sapi4' time='21.367184'/> <testcase classname='BTS_Tests_LAPDm:hopping' name='TC_sabm_contention' time='21.355938'/> <testcase classname='BTS_Tests_LAPDm:hopping' name='TC_sabm_retransmit' time='3.157656'/> <testcase classname='BTS_Tests_LAPDm:hopping' name='TC_sabm_retransmit_bts' time='81.479848'/> <testcase classname='BTS_Tests_LAPDm:hopping' name='TC_sabm_invalid_resp' time='23.381008'/> <testcase classname='BTS_Tests_LAPDm:hopping' name='TC_sabm_dm' time='14.016584'/> <testcase classname='BTS_Tests_LAPDm:hopping' name='TC_establish_ign_first_sabm' time='8.181511'/> <testcase classname='BTS_Tests_LAPDm:hopping' name='TC_iframe_seq_and_ack' time='29.586355'> <failure type='fail-verdict'>Received RSL ERROR IND { msg_disc := { msg_group := RSL_MDISC_RLL (1), transparent := false }, msg_type := RSL_MT_ERROR_IND (3), ies := { { iei := RSL_IE_CHAN_NR (1), body := { chan_nr := { u := { sdcch8 := { tag := '01'B, sub_chan := 4 } }, tn := 6 } } }, { iei := RSL_IE_LINK_IDENT (2), body := { link_id := { c := FACCH_SDCCH (0), na := false, prio := SAPI0_PRIO_NORMAL (0), sapi := 0 } } }, { iei := RSL_IE_RLM_CAUSE (22), body := { rlm_cause := { len := 1, payload := '01'O } } } } } BTS_Tests_LAPDm.ttcn:1484 BTS_Tests_LAPDm control part BTS_Tests_LAPDm.ttcn:579 TC_iframe_seq_and_ack testcase </failure> </testcase> <testcase classname='BTS_Tests_LAPDm:hopping' name='TC_iframe_timer_recovery' time='24.609387'> <failure type='fail-verdict'>Received RSL ERROR IND { msg_disc := { msg_group := RSL_MDISC_RLL (1), transparent := false }, msg_type := RSL_MT_ERROR_IND (3), ies := { { iei := RSL_IE_CHAN_NR (1), body := { chan_nr := { u := { sdcch8 := { tag := '01'B, sub_chan := 4 } }, tn := 6 } } }, { iei := RSL_IE_LINK_IDENT (2), body := { link_id := { c := FACCH_SDCCH (0), na := false, prio := SAPI0_PRIO_NORMAL (0), sapi := 0 } } }, { iei := RSL_IE_RLM_CAUSE (22), body := { rlm_cause := { len := 1, payload := '01'O } } } } } BTS_Tests_LAPDm.ttcn:1485 BTS_Tests_LAPDm control part BTS_Tests_LAPDm.ttcn:685 TC_iframe_timer_recovery testcase </failure> </testcase> <testcase classname='BTS_Tests_LAPDm:hopping' name='TC_ns_seq_error' time='29.620082'> <failure type='fail-verdict'>"BTS_Tests.ttcn:732 : Tguard timeout" BTS_Tests_LAPDm.ttcn:1486 BTS_Tests_LAPDm control part BTS_Tests_LAPDm.ttcn:768 TC_ns_seq_error testcase </failure> </testcase> <testcase classname='BTS_Tests_LAPDm:hopping' name='TC_nr_seq_error' time='2.891266'/> <testcase classname='BTS_Tests_LAPDm:hopping' name='TC_rec_invalid_frame' time='119.187293'> <failure type='fail-verdict'>"BTS_Tests_LAPDm.ttcn:909 : Missing LAPDm_RR RSP" BTS_Tests_LAPDm.ttcn:1488 BTS_Tests_LAPDm control part BTS_Tests_LAPDm.ttcn:961 TC_rec_invalid_frame testcase </failure> </testcase> <testcase classname='BTS_Tests_LAPDm:hopping' name='TC_segm_concat_dcch' time='13.491471'> <failure type='fail-verdict'>"BTS_Tests_LAPDm.ttcn:1023 : received unexpected LAPDm { sacch := false, sapi := 0, lapdm := { ab := { addr := { spare := '0'B, lpd := 0, sapi := 0, c_r := false, ea := true }, ctrl := { s := { n_r := 1, p_f := false, s := '10'B, spare := '01'B } }, len := 0, m := false, el := 1, payload := ''O, padding := '2B2B2B2B2B2B2B2B2B2B2B2B2B2B2B2B2B2B2B2B'O (\"++++++++++++++++++++\") } } }" BTS_Tests_LAPDm.ttcn:1489 BTS_Tests_LAPDm control part BTS_Tests_LAPDm.ttcn:1088 TC_segm_concat_dcch testcase </failure> </testcase> <testcase classname='BTS_Tests_LAPDm:hopping' name='TC_segm_concat_sacch' time='48.543256'> <failure type='fail-verdict'>"BTS_Tests_LAPDm.ttcn:1023 : received unexpected LAPDm { sacch := true, sapi := 0, lapdm := { ab := { addr := { spare := '0'B, lpd := 0, sapi := 0, c_r := false, ea := true }, ctrl := { u := { u := '011'B, p_f := true, u2 := '00'B, spare := '11'B } }, len := 0, m := false, el := 1, payload := ''O, padding := '2B2B2B2B2B2B2B2B2B2B2B2B2B2B2B2B2B2B'O (\"++++++++++++++++++\") } } }" BTS_Tests_LAPDm.ttcn:1490 BTS_Tests_LAPDm control part BTS_Tests_LAPDm.ttcn:1093 TC_segm_concat_sacch testcase </failure> </testcase> <testcase classname='BTS_Tests_LAPDm:hopping' name='TC_t200_n200' time='39.841087'> <failure type='fail-verdict'>Missing RSL RLL ERROR INDICATION BTS_Tests_LAPDm.ttcn:1491 BTS_Tests_LAPDm control part BTS_Tests_LAPDm.ttcn:1182 TC_t200_n200 testcase </failure> </testcase> <testcase classname='BTS_Tests_LAPDm:hopping' name='TC_rr_response_frame_loss' time='6.702552'> <failure type='fail-verdict'>Timeout waiting for RR or REJ BTS_Tests_LAPDm.ttcn:1492 BTS_Tests_LAPDm control part BTS_Tests_LAPDm.ttcn:1239 TC_rr_response_frame_loss testcase </failure> </testcase> <testcase classname='BTS_Tests_LAPDm:hopping' name='TC_incorrect_cr' time='15.828958'/> <testcase classname='BTS_Tests_LAPDm:hopping' name='TC_sabm_incorrect_c' time='23.319016'> <failure type='fail-verdict'>"BTS_Tests.ttcn:732 : Tguard timeout" BTS_Tests_LAPDm.ttcn:1494 BTS_Tests_LAPDm control part BTS_Tests_LAPDm.ttcn:1341 TC_sabm_incorrect_c testcase </failure> </testcase> <testcase classname='BTS_Tests_LAPDm:hopping' name='TC_normal_reestablishment' time='16.129681'> <failure type='fail-verdict'>"BTS_Tests_LAPDm.ttcn:1023 : received unexpected LAPDm { sacch := false, sapi := 0, lapdm := { ab := { addr := { spare := '0'B, lpd := 0, sapi := 0, c_r := false, ea := true }, ctrl := { u := { u := '011'B, p_f := true, u2 := '00'B, spare := '11'B } }, len := 5, m := false, el := 1, payload := '933879BAFD'O, padding := '2B2B2B2B2B2B2B2B2B2B2B2B2B2B2B'O (\"+++++++++++++++\") } } }" BTS_Tests_LAPDm.ttcn:1495 BTS_Tests_LAPDm control part BTS_Tests_LAPDm.ttcn:1403 TC_normal_reestablishment testcase </failure> </testcase> <testcase classname='BTS_Tests_LAPDm:hopping' name='TC_normal_reestablishment_state_unacked' time='30.155476'> <failure type='fail-verdict'>"BTS_Tests.ttcn:732 : Tguard timeout" BTS_Tests_LAPDm.ttcn:1496 BTS_Tests_LAPDm control part BTS_Tests_LAPDm.ttcn:1470 TC_normal_reestablishment_state_unacked testcase </failure> </testcase> <testcase classname='BTS_Tests_VAMOS:hopping' name='TC_vamos_chan_act_vff' time='2.326826'/> <testcase classname='BTS_Tests_VAMOS:hopping' name='TC_vamos_chan_act_vhh' time='2.573868'/> <testcase classname='BTS_Tests_VAMOS:hopping' name='TC_vamos_chan_act_hvhh' time='2.602642'/> <testcase classname='BTS_Tests_VAMOS:hopping' name='TC_vamos_chan_act_dyn_ipa_vff' time='2.534408'/> <testcase classname='BTS_Tests_VAMOS:hopping' name='TC_vamos_chan_act_dyn_osmo_vff' time='2.551156'/> <testcase classname='BTS_Tests_VAMOS:hopping' name='TC_vamos_chan_act_dyn_osmo_vhh' time='2.565129'/> <testcase classname='BTS_Tests_VAMOS:hopping' name='TC_vamos_chan_act_dyn_osmo_hvhh' time='2.596324'/> <testcase classname='BTS_Tests_VAMOS:hopping' name='TC_vamos_chan_mode_modify_vff' time='1.442022'/> <testcase classname='BTS_Tests_VAMOS:hopping' name='TC_vamos_chan_mode_modify_vhh' time='1.424091'/> <testcase classname='BTS_Tests_VAMOS:hopping' name='TC_vamos_chan_mode_modify_hvhh' time='1.396116'/> <testcase classname='BTS_Tests_VAMOS:hopping' name='TC_vamos_chan_mode_modify_dyn_ipa_vff' time='1.403146'/> <testcase classname='BTS_Tests_VAMOS:hopping' name='TC_vamos_chan_mode_modify_dyn_osmo_vff' time='1.409918'/> <testcase classname='BTS_Tests_VAMOS:hopping' name='TC_vamos_chan_mode_modify_dyn_osmo_vhh' time='1.395328'/> <testcase classname='BTS_Tests_VAMOS:hopping' name='TC_vamos_chan_mode_modify_dyn_osmo_hvhh' time='1.397584'/> <testcase classname='BTS_Tests_ASCI:hopping' name='TC_vbs_notification' time='4.699305'/> <testcase classname='BTS_Tests_ASCI:hopping' name='TC_vgcs_uplink_free_and_busy' time='1.863686'/> <testcase classname='BTS_Tests_ASCI:hopping' name='TC_vgcs_talker_fail' time='17.033063'/> <testcase classname='BTS_Tests_ASCI:hopping' name='TC_vgcs_talker_est_rel' time='1.443104'/> <testcase classname='BTS_Tests_ASCI:hopping' name='TC_vgcs_listener_det' time='3.398710'/> </testsuite> <?xml version="1.0"?> <testsuite name='Titan' tests='17' failures='0' errors='0' skipped='0' inconc='0' time='96.00'> <testcase classname='BTS_Tests_OML' name='TC_wrong_mdisc' time='10.539216'/> <testcase classname='BTS_Tests_OML' name='TC_wrong_msgtype' time='0.720563'/> <testcase classname='BTS_Tests_OML' name='TC_short_length' time='0.731551'/> <testcase classname='BTS_Tests_OML' name='TC_long_length' time='0.664386'/> <testcase classname='BTS_Tests_OML' name='TC_wrong_placement' time='0.712925'/> <testcase classname='BTS_Tests_OML' name='TC_wrong_seq' time='0.716765'/> <testcase classname='BTS_Tests_OML' name='TC_wrong_obj_class' time='0.728146'/> <testcase classname='BTS_Tests_OML' name='TC_wrong_bts_nr' time='0.711867'/> <testcase classname='BTS_Tests_OML' name='TC_wrong_trx_nr' time='0.723465'/> <testcase classname='BTS_Tests_OML' name='TC_radio_carrier_opstart_noattr' time='0.712367'/> <testcase classname='BTS_Tests_OML' name='TC_bts_opstart' time='0.719342'/> <testcase classname='BTS_Tests_OML' name='TC_bts_opstart_noattr' time='0.712622'/> <testcase classname='BTS_Tests_OML' name='TC_ts_opstart' time='0.676661'/> <testcase classname='BTS_Tests_OML' name='TC_ts_opstart_noattr' time='0.710295'/> <testcase classname='BTS_Tests_OML' name='TC_initial_state_reports' time='0.698709'/> <testcase classname='BTS_Tests_OML' name='TC_ipa_osmo_pcu_anr_fwd' time='0.713347'/> <testcase classname='BTS_Tests_OML' name='TC_ipa_rsl_connect_nack' time='0.726393'/> </testsuite> + check_respawn_count + set +x [0;31m ================================================================ WARNING: osmo-bts was respawned 4 times (expected: 3)! (OS#6794) ================================================================ [0m+ RC=1 + uptime + grep --color=always -o load.* [01;31m[Kload average: 0.31, 0.45, 0.51[m[K + exit 1 Build step 'Execute shell' marked build as failure Recording test results [Checks API] No suitable checks publisher found.
1
4
0
0
Build failed in Jenkins: ttcn3-bts-test-latest #2899
by jenkins@lists.osmocom.org
05 Sep '26
05 Sep '26
See <
https://jenkins.osmocom.org/jenkins/job/ttcn3-bts-test-latest/2899/display/…
> Changes: ------------------------------------------ [...truncated 12.34 MiB...] <failure type='fail-verdict'>"BTS_Tests.ttcn:732 : Tguard timeout" BTS_Tests.ttcn:9557 BTS_Tests control part BTS_Tests.ttcn:7525 TC_rll_rel_req testcase </failure> </testcase> <testcase classname='BTS_Tests:hopping' name='TC_rll_unit_data_req_DCCH' time='2.350348'/> <testcase classname='BTS_Tests:hopping' name='TC_rll_unit_data_req_ACCH' time='5.312582'/> <testcase classname='BTS_Tests:hopping' name='TC_rll_unit_data_ind_DCCH' time='2.933278'/> <testcase classname='BTS_Tests:hopping' name='TC_rll_unit_data_ind_ACCH' time='10.543431'/> <testcase classname='BTS_Tests:hopping' name='TC_chan_act_a51' time='2.664050'/> <testcase classname='BTS_Tests:hopping' name='TC_chan_act_a52' time='2.737015'/> <testcase classname='BTS_Tests:hopping' name='TC_chan_act_a53' time='2.732869'/> <testcase classname='BTS_Tests:hopping' name='TC_chan_act_a54' time='2.737905'/> <testcase classname='BTS_Tests:hopping' name='TC_encr_cmd_a51' time='5.214061'/> <testcase classname='BTS_Tests:hopping' name='TC_encr_cmd_a52' time='5.214297'/> <testcase classname='BTS_Tests:hopping' name='TC_encr_cmd_a53' time='5.216595'/> <testcase classname='BTS_Tests:hopping' name='TC_encr_cmd_a54' time='5.222033'/> <testcase classname='BTS_Tests:hopping' name='TC_err_rep_wrong_mdisc' time='1.222618'/> <testcase classname='BTS_Tests:hopping' name='TC_err_rep_wrong_msg_type' time='1.271931'/> <testcase classname='BTS_Tests:hopping' name='TC_err_rep_wrong_sequence' time='1.259939'/> <testcase classname='BTS_Tests:hopping' name='TC_lapdm_selftest' time='0.005402'/> <testcase classname='BTS_Tests:hopping' name='TC_tch_sign_l2_fill_frame' time='18.454871'/> <testcase classname='BTS_Tests:hopping' name='TC_tch_sign_l2_fill_frame_dtxd' time='2.116021'> <failure type='fail-verdict'>Received DTX TCH fill frame with bad frame number: 175 (mod 104: 71) (mod 26: 19) BTS_Tests.ttcn:9579 BTS_Tests control part BTS_Tests.ttcn:8110 TC_tch_sign_l2_fill_frame_dtxd testcase </failure> </testcase> <testcase classname='BTS_Tests:hopping' name='TC_chopped_ipa_ping' time='24.731854'/> <testcase classname='BTS_Tests:hopping' name='TC_chopped_ipa_payload' time='42.619299'/> <testcase classname='BTS_Tests:hopping' name='TC_ms_pwr_ctrl_constant' time='16.900886'/> <testcase classname='BTS_Tests:hopping' name='TC_ms_pwr_ctrl_pf_ewma' time='31.994556'/> <testcase classname='BTS_Tests:hopping' name='TC_speech_no_rtp_tchf' time='7.418810'/> <testcase classname='BTS_Tests:hopping' name='TC_speech_no_rtp_tchh' time='5.519996'/> <testcase classname='BTS_Tests:hopping' name='TC_speech_rtp_tchf' time='7.695605'/> <testcase classname='BTS_Tests:hopping' name='TC_speech_rtp_tchh' time='5.479838'/> <testcase classname='BTS_Tests:hopping' name='TC_speech_osmux_tchf' time='3.423534'/> <testcase classname='BTS_Tests:hopping' name='TC_speech_osmux_tchh' time='3.452673'/> <testcase classname='BTS_Tests:hopping' name='TC_data_rtp_tchf144' time='2.165231'/> <testcase classname='BTS_Tests:hopping' name='TC_data_rtp_tchf96' time='2.098496'/> <testcase classname='BTS_Tests:hopping' name='TC_data_rtp_tchf48' time='2.143761'/> <testcase classname='BTS_Tests:hopping' name='TC_data_rtp_tchh48' time='5.307768'> <failure type='fail-verdict'>Timeout waiting for matching Downlink data frame BTS_Tests.ttcn:9597 BTS_Tests control part BTS_Tests.ttcn:8880 TC_data_rtp_tchh48 testcase </failure> </testcase> <testcase classname='BTS_Tests:hopping' name='TC_data_rtp_tchf24' time='1.759004'/> <testcase classname='BTS_Tests:hopping' name='TC_data_rtp_tchh24' time='5.322843'> <failure type='fail-verdict'>Timeout waiting for matching Downlink data frame BTS_Tests.ttcn:9599 BTS_Tests control part BTS_Tests.ttcn:8949 TC_data_rtp_tchh24 testcase </failure> </testcase> <testcase classname='BTS_Tests:hopping' name='TC_data_facch_tchf144' time='2.015812'/> <testcase classname='BTS_Tests:hopping' name='TC_data_facch_tchf96' time='2.016561'/> <testcase classname='BTS_Tests:hopping' name='TC_data_facch_tchf48' time='2.041092'/> <testcase classname='BTS_Tests:hopping' name='TC_data_facch_tchh48' time='2.137796'/> <testcase classname='BTS_Tests:hopping' name='TC_data_facch_tchf24' time='1.996336'/> <testcase classname='BTS_Tests:hopping' name='TC_data_facch_tchh24' time='2.207798'/> <testcase classname='BTS_Tests:hopping' name='TC_early_immediate_assignment' time='3.533310'/> <testcase classname='BTS_Tests:hopping' name='TC_acch_overpower_rxqual_thresh' time='9.055108'> <failure type='fail-verdict'>Timeout waiting for L1CTL DATA.ind BTS_Tests.ttcn:9610 BTS_Tests control part BTS_Tests.ttcn:9244 TC_acch_overpower_rxqual_thresh testcase </failure> </testcase> <testcase classname='BTS_Tests:hopping' name='TC_acch_overpower_rxqual_thresh_dtx' time='9.021965'> <failure type='fail-verdict'>Timeout waiting for L1CTL DATA.ind BTS_Tests.ttcn:9611 BTS_Tests control part BTS_Tests.ttcn:9285 TC_acch_overpower_rxqual_thresh_dtx testcase </failure> </testcase> <testcase classname='BTS_Tests:hopping' name='TC_acch_overpower_always_on_facch' time='9.025921'> <failure type='fail-verdict'>Timeout waiting for L1CTL DATA.ind BTS_Tests.ttcn:9612 BTS_Tests control part BTS_Tests.ttcn:9317 TC_acch_overpower_always_on_facch testcase </failure> </testcase> <testcase classname='BTS_Tests:hopping' name='TC_acch_overpower_always_on_sacch' time='9.019321'> <failure type='fail-verdict'>Timeout waiting for L1CTL DATA.ind BTS_Tests.ttcn:9613 BTS_Tests control part BTS_Tests.ttcn:9349 TC_acch_overpower_always_on_sacch testcase </failure> </testcase> <testcase classname='BTS_Tests:hopping' name='TC_acch_overpower_limit' time='9.009830'> <failure type='fail-verdict'>Timeout waiting for L1CTL DATA.ind BTS_Tests.ttcn:9614 BTS_Tests control part BTS_Tests.ttcn:9380 TC_acch_overpower_limit testcase </failure> </testcase> <testcase classname='BTS_Tests_SMSCB:hopping' name='TC_cbch_load_idle_no_cbch' time='11.166961'/> <testcase classname='BTS_Tests_SMSCB:hopping' name='TC_sms_cb_cmd_sdcch4_1block' time='14.235028'/> <testcase classname='BTS_Tests_SMSCB:hopping' name='TC_sms_cb_cmd_sdcch4_2block' time='14.195155'/> <testcase classname='BTS_Tests_SMSCB:hopping' name='TC_sms_cb_cmd_sdcch4_3block' time='14.199097'/> <testcase classname='BTS_Tests_SMSCB:hopping' name='TC_sms_cb_cmd_sdcch4_4block' time='14.202855'/> <testcase classname='BTS_Tests_SMSCB:hopping' name='TC_sms_cb_cmd_sdcch4_multi' time='20.206520'/> <testcase classname='BTS_Tests_SMSCB:hopping' name='TC_sms_cb_cmd_sdcch4_schedule' time='14.170128'/> <testcase classname='BTS_Tests_SMSCB:hopping' name='TC_sms_cb_cmd_sdcch4_default_only' time='16.222548'/> <testcase classname='BTS_Tests_SMSCB:hopping' name='TC_sms_cb_cmd_sdcch4_default_and_normal' time='17.198893'/> <testcase classname='BTS_Tests_SMSCB:hopping' name='TC_sms_cb_cmd_sdcch4_default_then_null' time='26.165863'/> <testcase classname='BTS_Tests_SMSCB:hopping' name='TC_cbc_sdcch4_load_idle' time='16.064825'/> <testcase classname='BTS_Tests_SMSCB:hopping' name='TC_cbc_sdcch4_load_overload' time='18.160379'/> <testcase classname='BTS_Tests_SMSCB:hopping' name='TC_sms_cb_cmd_sdcch8_1block' time='14.230958'/> <testcase classname='BTS_Tests_SMSCB:hopping' name='TC_sms_cb_cmd_sdcch8_2block' time='14.223744'/> <testcase classname='BTS_Tests_SMSCB:hopping' name='TC_sms_cb_cmd_sdcch8_3block' time='14.221568'/> <testcase classname='BTS_Tests_SMSCB:hopping' name='TC_sms_cb_cmd_sdcch8_4block' time='14.223689'/> <testcase classname='BTS_Tests_SMSCB:hopping' name='TC_sms_cb_cmd_sdcch8_multi' time='20.216867'/> <testcase classname='BTS_Tests_SMSCB:hopping' name='TC_sms_cb_cmd_sdcch8_schedule' time='14.189136'/> <testcase classname='BTS_Tests_SMSCB:hopping' name='TC_sms_cb_cmd_sdcch8_default_only' time='16.209399'/> <testcase classname='BTS_Tests_SMSCB:hopping' name='TC_sms_cb_cmd_sdcch8_default_and_normal' time='17.231693'/> <testcase classname='BTS_Tests_SMSCB:hopping' name='TC_cbc_sdcch8_load_idle' time='16.205172'/> <testcase classname='BTS_Tests_SMSCB:hopping' name='TC_cbc_sdcch8_load_overload' time='18.218403'/> <testcase classname='BTS_Tests_SMSCB:hopping' name='TC_etws_p1ro' time='12.188580'/> <testcase classname='BTS_Tests_SMSCB:hopping' name='TC_etws_p1ro_end' time='16.164099'/> <testcase classname='BTS_Tests_SMSCB:hopping' name='TC_etws_pcu' time='1.129672'/> <testcase classname='BTS_Tests_LAPDm:hopping' name='TC_sabm_ua_dcch_sapi0' time='2.872576'/> <testcase classname='BTS_Tests_LAPDm:hopping' name='TC_sabm_ua_dcch_sapi0_nopayload' time='21.548459'/> <testcase classname='BTS_Tests_LAPDm:hopping' name='TC_sabm_ua_dcch_sapi3' time='21.318412'/> <testcase classname='BTS_Tests_LAPDm:hopping' name='TC_sabm_ua_dcch_sapi4' time='21.362744'/> <testcase classname='BTS_Tests_LAPDm:hopping' name='TC_sabm_contention' time='21.301266'/> <testcase classname='BTS_Tests_LAPDm:hopping' name='TC_sabm_retransmit' time='3.183150'/> <testcase classname='BTS_Tests_LAPDm:hopping' name='TC_sabm_retransmit_bts' time='81.480276'/> <testcase classname='BTS_Tests_LAPDm:hopping' name='TC_sabm_invalid_resp' time='23.370132'/> <testcase classname='BTS_Tests_LAPDm:hopping' name='TC_sabm_dm' time='14.019642'/> <testcase classname='BTS_Tests_LAPDm:hopping' name='TC_establish_ign_first_sabm' time='7.970048'/> <testcase classname='BTS_Tests_LAPDm:hopping' name='TC_iframe_seq_and_ack' time='29.583402'> <failure type='fail-verdict'>Received RSL ERROR IND { msg_disc := { msg_group := RSL_MDISC_RLL (1), transparent := false }, msg_type := RSL_MT_ERROR_IND (3), ies := { { iei := RSL_IE_CHAN_NR (1), body := { chan_nr := { u := { sdcch8 := { tag := '01'B, sub_chan := 4 } }, tn := 6 } } }, { iei := RSL_IE_LINK_IDENT (2), body := { link_id := { c := FACCH_SDCCH (0), na := false, prio := SAPI0_PRIO_NORMAL (0), sapi := 0 } } }, { iei := RSL_IE_RLM_CAUSE (22), body := { rlm_cause := { len := 1, payload := '01'O } } } } } BTS_Tests_LAPDm.ttcn:1484 BTS_Tests_LAPDm control part BTS_Tests_LAPDm.ttcn:579 TC_iframe_seq_and_ack testcase </failure> </testcase> <testcase classname='BTS_Tests_LAPDm:hopping' name='TC_iframe_timer_recovery' time='24.608991'> <failure type='fail-verdict'>Received RSL ERROR IND { msg_disc := { msg_group := RSL_MDISC_RLL (1), transparent := false }, msg_type := RSL_MT_ERROR_IND (3), ies := { { iei := RSL_IE_CHAN_NR (1), body := { chan_nr := { u := { sdcch8 := { tag := '01'B, sub_chan := 4 } }, tn := 6 } } }, { iei := RSL_IE_LINK_IDENT (2), body := { link_id := { c := FACCH_SDCCH (0), na := false, prio := SAPI0_PRIO_NORMAL (0), sapi := 0 } } }, { iei := RSL_IE_RLM_CAUSE (22), body := { rlm_cause := { len := 1, payload := '01'O } } } } } BTS_Tests_LAPDm.ttcn:1485 BTS_Tests_LAPDm control part BTS_Tests_LAPDm.ttcn:685 TC_iframe_timer_recovery testcase </failure> </testcase> <testcase classname='BTS_Tests_LAPDm:hopping' name='TC_ns_seq_error' time='29.835194'> <failure type='fail-verdict'>"BTS_Tests.ttcn:732 : Tguard timeout" BTS_Tests_LAPDm.ttcn:1486 BTS_Tests_LAPDm control part BTS_Tests_LAPDm.ttcn:768 TC_ns_seq_error testcase </failure> </testcase> <testcase classname='BTS_Tests_LAPDm:hopping' name='TC_nr_seq_error' time='2.891384'/> <testcase classname='BTS_Tests_LAPDm:hopping' name='TC_rec_invalid_frame' time='119.148479'> <failure type='fail-verdict'>"BTS_Tests_LAPDm.ttcn:909 : Missing LAPDm_RR RSP" BTS_Tests_LAPDm.ttcn:1488 BTS_Tests_LAPDm control part BTS_Tests_LAPDm.ttcn:961 TC_rec_invalid_frame testcase </failure> </testcase> <testcase classname='BTS_Tests_LAPDm:hopping' name='TC_segm_concat_dcch' time='13.532764'> <failure type='fail-verdict'>"BTS_Tests_LAPDm.ttcn:1023 : received unexpected LAPDm { sacch := false, sapi := 0, lapdm := { ab := { addr := { spare := '0'B, lpd := 0, sapi := 0, c_r := false, ea := true }, ctrl := { s := { n_r := 1, p_f := false, s := '10'B, spare := '01'B } }, len := 0, m := false, el := 1, payload := ''O, padding := '2B2B2B2B2B2B2B2B2B2B2B2B2B2B2B2B2B2B2B2B'O (\"++++++++++++++++++++\") } } }" BTS_Tests_LAPDm.ttcn:1489 BTS_Tests_LAPDm control part BTS_Tests_LAPDm.ttcn:1088 TC_segm_concat_dcch testcase </failure> </testcase> <testcase classname='BTS_Tests_LAPDm:hopping' name='TC_segm_concat_sacch' time='48.521164'> <failure type='fail-verdict'>"BTS_Tests_LAPDm.ttcn:1023 : received unexpected LAPDm { sacch := true, sapi := 0, lapdm := { ab := { addr := { spare := '0'B, lpd := 0, sapi := 0, c_r := false, ea := true }, ctrl := { u := { u := '011'B, p_f := true, u2 := '00'B, spare := '11'B } }, len := 0, m := false, el := 1, payload := ''O, padding := '2B2B2B2B2B2B2B2B2B2B2B2B2B2B2B2B2B2B'O (\"++++++++++++++++++\") } } }" BTS_Tests_LAPDm.ttcn:1490 BTS_Tests_LAPDm control part BTS_Tests_LAPDm.ttcn:1093 TC_segm_concat_sacch testcase </failure> </testcase> <testcase classname='BTS_Tests_LAPDm:hopping' name='TC_t200_n200' time='39.830872'> <failure type='fail-verdict'>Missing RSL RLL ERROR INDICATION BTS_Tests_LAPDm.ttcn:1491 BTS_Tests_LAPDm control part BTS_Tests_LAPDm.ttcn:1182 TC_t200_n200 testcase </failure> </testcase> <testcase classname='BTS_Tests_LAPDm:hopping' name='TC_rr_response_frame_loss' time='6.685968'> <failure type='fail-verdict'>Timeout waiting for RR or REJ BTS_Tests_LAPDm.ttcn:1492 BTS_Tests_LAPDm control part BTS_Tests_LAPDm.ttcn:1239 TC_rr_response_frame_loss testcase </failure> </testcase> <testcase classname='BTS_Tests_LAPDm:hopping' name='TC_incorrect_cr' time='15.739364'/> <testcase classname='BTS_Tests_LAPDm:hopping' name='TC_sabm_incorrect_c' time='23.320257'> <failure type='fail-verdict'>"BTS_Tests.ttcn:732 : Tguard timeout" BTS_Tests_LAPDm.ttcn:1494 BTS_Tests_LAPDm control part BTS_Tests_LAPDm.ttcn:1341 TC_sabm_incorrect_c testcase </failure> </testcase> <testcase classname='BTS_Tests_LAPDm:hopping' name='TC_normal_reestablishment' time='16.145310'> <failure type='fail-verdict'>"BTS_Tests_LAPDm.ttcn:1023 : received unexpected LAPDm { sacch := false, sapi := 0, lapdm := { ab := { addr := { spare := '0'B, lpd := 0, sapi := 0, c_r := false, ea := true }, ctrl := { u := { u := '011'B, p_f := true, u2 := '00'B, spare := '11'B } }, len := 5, m := false, el := 1, payload := '73AD749F72'O, padding := '2B2B2B2B2B2B2B2B2B2B2B2B2B2B2B'O (\"+++++++++++++++\") } } }" BTS_Tests_LAPDm.ttcn:1495 BTS_Tests_LAPDm control part BTS_Tests_LAPDm.ttcn:1403 TC_normal_reestablishment testcase </failure> </testcase> <testcase classname='BTS_Tests_LAPDm:hopping' name='TC_normal_reestablishment_state_unacked' time='12.386010'> <failure type='fail-verdict'>"BTS_Tests_LAPDm.ttcn:1023 : received unexpected LAPDm { sacch := false, sapi := 0, lapdm := { ab := { addr := { spare := '0'B, lpd := 0, sapi := 0, c_r := false, ea := true }, ctrl := { s := { n_r := 1, p_f := false, s := '10'B, spare := '01'B } }, len := 0, m := false, el := 1, payload := ''O, padding := '2B2B2B2B2B2B2B2B2B2B2B2B2B2B2B2B2B2B2B2B'O (\"++++++++++++++++++++\") } } }" BTS_Tests_LAPDm.ttcn:1496 BTS_Tests_LAPDm control part BTS_Tests_LAPDm.ttcn:1470 TC_normal_reestablishment_state_unacked testcase </failure> </testcase> <testcase classname='BTS_Tests_VAMOS:hopping' name='TC_vamos_chan_act_vff' time='2.463909'/> <testcase classname='BTS_Tests_VAMOS:hopping' name='TC_vamos_chan_act_vhh' time='2.587186'/> <testcase classname='BTS_Tests_VAMOS:hopping' name='TC_vamos_chan_act_hvhh' time='2.522888'/> <testcase classname='BTS_Tests_VAMOS:hopping' name='TC_vamos_chan_act_dyn_ipa_vff' time='2.537688'/> <testcase classname='BTS_Tests_VAMOS:hopping' name='TC_vamos_chan_act_dyn_osmo_vff' time='2.549299'/> <testcase classname='BTS_Tests_VAMOS:hopping' name='TC_vamos_chan_act_dyn_osmo_vhh' time='2.596033'/> <testcase classname='BTS_Tests_VAMOS:hopping' name='TC_vamos_chan_act_dyn_osmo_hvhh' time='2.569035'/> <testcase classname='BTS_Tests_VAMOS:hopping' name='TC_vamos_chan_mode_modify_vff' time='1.342184'/> <testcase classname='BTS_Tests_VAMOS:hopping' name='TC_vamos_chan_mode_modify_vhh' time='1.396333'/> <testcase classname='BTS_Tests_VAMOS:hopping' name='TC_vamos_chan_mode_modify_hvhh' time='1.328221'/> <testcase classname='BTS_Tests_VAMOS:hopping' name='TC_vamos_chan_mode_modify_dyn_ipa_vff' time='1.343292'/> <testcase classname='BTS_Tests_VAMOS:hopping' name='TC_vamos_chan_mode_modify_dyn_osmo_vff' time='1.345475'/> <testcase classname='BTS_Tests_VAMOS:hopping' name='TC_vamos_chan_mode_modify_dyn_osmo_vhh' time='1.362589'/> <testcase classname='BTS_Tests_VAMOS:hopping' name='TC_vamos_chan_mode_modify_dyn_osmo_hvhh' time='1.339957'/> <testcase classname='BTS_Tests_ASCI:hopping' name='TC_vbs_notification' time='4.669504'/> <testcase classname='BTS_Tests_ASCI:hopping' name='TC_vgcs_uplink_free_and_busy' time='1.793044'/> <testcase classname='BTS_Tests_ASCI:hopping' name='TC_vgcs_talker_fail' time='16.554646'/> <testcase classname='BTS_Tests_ASCI:hopping' name='TC_vgcs_talker_est_rel' time='1.383257'/> <testcase classname='BTS_Tests_ASCI:hopping' name='TC_vgcs_listener_det' time='3.366684'/> </testsuite> <?xml version="1.0"?> <testsuite name='Titan' tests='17' failures='0' errors='0' skipped='0' inconc='0' time='95.00'> <testcase classname='BTS_Tests_OML' name='TC_wrong_mdisc' time='10.893808'/> <testcase classname='BTS_Tests_OML' name='TC_wrong_msgtype' time='0.696791'/> <testcase classname='BTS_Tests_OML' name='TC_short_length' time='0.701760'/> <testcase classname='BTS_Tests_OML' name='TC_long_length' time='0.684165'/> <testcase classname='BTS_Tests_OML' name='TC_wrong_placement' time='0.680512'/> <testcase classname='BTS_Tests_OML' name='TC_wrong_seq' time='0.692670'/> <testcase classname='BTS_Tests_OML' name='TC_wrong_obj_class' time='0.691187'/> <testcase classname='BTS_Tests_OML' name='TC_wrong_bts_nr' time='0.676402'/> <testcase classname='BTS_Tests_OML' name='TC_wrong_trx_nr' time='0.690015'/> <testcase classname='BTS_Tests_OML' name='TC_radio_carrier_opstart_noattr' time='0.693577'/> <testcase classname='BTS_Tests_OML' name='TC_bts_opstart' time='0.707775'/> <testcase classname='BTS_Tests_OML' name='TC_bts_opstart_noattr' time='0.691416'/> <testcase classname='BTS_Tests_OML' name='TC_ts_opstart' time='0.692375'/> <testcase classname='BTS_Tests_OML' name='TC_ts_opstart_noattr' time='0.675833'/> <testcase classname='BTS_Tests_OML' name='TC_initial_state_reports' time='0.691598'/> <testcase classname='BTS_Tests_OML' name='TC_ipa_osmo_pcu_anr_fwd' time='0.718732'/> <testcase classname='BTS_Tests_OML' name='TC_ipa_rsl_connect_nack' time='0.680379'/> </testsuite> + check_respawn_count + set +x [0;31m ================================================================ WARNING: osmo-bts was respawned 5 times (expected: 3)! (OS#6794) ================================================================ [0m+ RC=1 + uptime + grep --color=always -o load.* [01;31m[Kload average: 0.50, 0.53, 0.55[m[K + exit 1 Build step 'Execute shell' marked build as failure Recording test results [Checks API] No suitable checks publisher found.
1
3
0
0
Build failed in Jenkins: ttcn3-5gc-test-ogs #469
by jenkins@lists.osmocom.org
04 Sep '26
04 Sep '26
See <
https://jenkins.osmocom.org/jenkins/job/ttcn3-5gc-test-ogs/469/display/redi…
> Changes: [Oliver Smith] deps/Makefile: error if repo _commit is missing [Oliver Smith] sgsn: fix running against current stable osmo-sgsn [Pau Espin Pedrol] deps: Remove unused titan.ProtocolModules.JSON_v07_2006 ------------------------------------------ [...truncated 243.38 MiB...] [32m09/04 09:32:38.545[0m: [[33msbi[0m] [1;37mDEBUG[0m: [PATCH] /nnrf-nfm/v1/nf-instances/2c4b24b2-a843-41f1-92c5-2dd8304da01b (../lib/sbi/nghttp2-server.c:1308) [32m09/04 09:32:38.545[0m: [[33msbi[0m] [1;37mDEBUG[0m: RECEIVED: 101 (../lib/sbi/nghttp2-server.c:1312) [32m09/04 09:32:38.545[0m: [[33msbi[0m] [1;37mDEBUG[0m: [{"op":"replace","path":"/nfStatus","value":"REGISTERED"},{"op":"replace","path":"/load","value":25}] (../lib/sbi/nghttp2-server.c:1314) [32m09/04 09:32:38.545[0m: [[33mnrf[0m] [1;37mDEBUG[0m: nrf_state_operational(): OGS_EVENT_NAME_SBI_SERVER (../src/nrf/nrf-sm.c:54) [32m09/04 09:32:38.545[0m: [[33mnrf[0m] [1;37mDEBUG[0m: nrf_nf_state_registered(): OGS_EVENT_NAME_SBI_SERVER (../src/nrf/nf-sm.c:201) [32m09/04 09:32:38.545[0m: [[33msbi[0m] [1;37mDEBUG[0m: STATUS [204] (../lib/sbi/nghttp2-server.c:702) [32m09/04 09:32:38.545[0m: [[33msbi[0m] [1;37mDEBUG[0m: STREAM closed [561] (../lib/sbi/nghttp2-server.c:1431) 0000: 00000301 05000002 3189f5be ........1... [32m09/04 09:32:38.545[0m: [[33msbi[0m] [1;37mDEBUG[0m: [204:PATCH]
http://127.0.0.10:7777/nnrf-nfm/v1/nf-instances/2c4b24b2-a843-41f1-92c5-2dd…
(../lib/sbi/client.c:744) [32m09/04 09:32:38.545[0m: [[33msbi[0m] [1;37mDEBUG[0m: RECEIVED[0] (../lib/sbi/client.c:755) [32m09/04 09:32:38.546[0m: [[33msbi[0m] [1;37mDEBUG[0m: STATUS [204] (../lib/sbi/nghttp2-server.c:702) [32m09/04 09:32:38.546[0m: [[33msbi[0m] [1;37mDEBUG[0m: STREAM closed [4717] (../lib/sbi/nghttp2-server.c:1431) 0000: 00001a01 05000012 6d89c261 96c361be ........m..a..a. 0010: 94034a6e 2d6a0802 71403f71 915c65e5 ..Jn-j..q(a)?q.\e. 0020: 3168df 1h. [32m09/04 09:32:38.546[0m: [[33msbi[0m] [1;37mDEBUG[0m: [204:PATCH]
http://127.0.0.200:7777/nnrf-nfm/v1/nf-instances/2c4b24b2-a843-41f1-92c5-2d…
(../lib/sbi/client.c:744) [32m09/04 09:32:38.546[0m: [[33msbi[0m] [1;37mDEBUG[0m: RECEIVED[0] (../lib/sbi/client.c:755) [32m09/04 09:32:38.546[0m: [[33mausf[0m] [1;37mDEBUG[0m: ausf_state_operational(): OGS_EVENT_NAME_SBI_CLIENT (../src/ausf/ausf-sm.c:56) [32m09/04 09:32:38.546[0m: [[33msbi[0m] [1;37mDEBUG[0m: ogs_sbi_nf_state_registered(): OGS_EVENT_NAME_SBI_CLIENT (../lib/sbi/nf-sm.c:312) [32m09/04 09:32:38.793[0m: [[33mudm[0m] [1;37mDEBUG[0m: udm_state_operational(): OGS_EVENT_NAME_SBI_TIMER (../src/udm/udm-sm.c:61) [32m09/04 09:32:38.793[0m: [[33msbi[0m] [1;37mDEBUG[0m: ogs_sbi_nf_state_registered(): OGS_EVENT_NAME_SBI_TIMER (../lib/sbi/nf-sm.c:312) [32m09/04 09:32:38.793[0m: [[33msbi[0m] [1;37mDEBUG[0m: [PATCH]
http://127.0.0.200:7777/nnrf-nfm/v1/nf-instances/2c726162-a843-41f1-a7bf-45…
(../lib/sbi/client.c:797) [32m09/04 09:32:38.793[0m: [[33msbi[0m] [1;37mDEBUG[0m: SENDING...[101] (../lib/sbi/client.c:546) [32m09/04 09:32:38.793[0m: [[33msbi[0m] [1;37mDEBUG[0m: [{"op":"replace","path":"/nfStatus","value":"REGISTERED"},{"op":"replace","path":"/load","value":25}] (../lib/sbi/client.c:548) [32m09/04 09:32:38.794[0m: [[33msbi[0m] [1;37mDEBUG[0m: STREAM added [13009] (../lib/sbi/nghttp2-server.c:1749) [32m09/04 09:32:38.794[0m: [[33msbi[0m] [1;37mDEBUG[0m: [PATCH] /nnrf-nfm/v1/nf-instances/2c726162-a843-41f1-a7bf-455e3de4da2b (../lib/sbi/nghttp2-server.c:1308) [32m09/04 09:32:38.794[0m: [[33msbi[0m] [1;37mDEBUG[0m: RECEIVED: 101 (../lib/sbi/nghttp2-server.c:1312) [32m09/04 09:32:38.794[0m: [[33msbi[0m] [1;37mDEBUG[0m: [{"op":"replace","path":"/nfStatus","value":"REGISTERED"},{"op":"replace","path":"/load","value":25}] (../lib/sbi/nghttp2-server.c:1314) [32m09/04 09:32:38.794[0m: [[33msbi[0m] [1;37mDEBUG[0m: [PATCH]
http://127.0.0.10:7777/nnrf-nfm/v1/nf-instances/2c726162-a843-41f1-a7bf-455…
(../lib/sbi/client.c:797) [32m09/04 09:32:38.794[0m: [[33msbi[0m] [1;37mDEBUG[0m: SENDING...[101] (../lib/sbi/client.c:546) [32m09/04 09:32:38.794[0m: [[33msbi[0m] [1;37mDEBUG[0m: [{"op":"replace","path":"/nfStatus","value":"REGISTERED"},{"op":"replace","path":"/load","value":25}] (../lib/sbi/client.c:548) [32m09/04 09:32:38.794[0m: [[33msbi[0m] [1;37mDEBUG[0m: STREAM added [563] (../lib/sbi/nghttp2-server.c:1749) [32m09/04 09:32:38.794[0m: [[33msbi[0m] [1;37mDEBUG[0m: [PATCH] /nnrf-nfm/v1/nf-instances/2c726162-a843-41f1-a7bf-455e3de4da2b (../lib/sbi/nghttp2-server.c:1308) [32m09/04 09:32:38.794[0m: [[33msbi[0m] [1;37mDEBUG[0m: RECEIVED: 101 (../lib/sbi/nghttp2-server.c:1312) [32m09/04 09:32:38.794[0m: [[33msbi[0m] [1;37mDEBUG[0m: [{"op":"replace","path":"/nfStatus","value":"REGISTERED"},{"op":"replace","path":"/load","value":25}] (../lib/sbi/nghttp2-server.c:1314) [32m09/04 09:32:38.794[0m: [[33mnrf[0m] [1;37mDEBUG[0m: nrf_state_operational(): OGS_EVENT_NAME_SBI_SERVER (../src/nrf/nrf-sm.c:54) [32m09/04 09:32:38.794[0m: [[33mnrf[0m] [1;37mDEBUG[0m: nrf_nf_state_registered(): OGS_EVENT_NAME_SBI_SERVER (../src/nrf/nf-sm.c:201) [32m09/04 09:32:38.794[0m: [[33msbi[0m] [1;37mDEBUG[0m: STATUS [204] (../lib/sbi/nghttp2-server.c:702) [32m09/04 09:32:38.794[0m: [[33msbi[0m] [1;37mDEBUG[0m: STREAM closed [563] (../lib/sbi/nghttp2-server.c:1431) 0000: 00000301 05000002 3389f5be ........3... [32m09/04 09:32:38.795[0m: [[33msbi[0m] [1;37mDEBUG[0m: [204:PATCH]
http://127.0.0.10:7777/nnrf-nfm/v1/nf-instances/2c726162-a843-41f1-a7bf-455…
(../lib/sbi/client.c:744) [32m09/04 09:32:38.795[0m: [[33msbi[0m] [1;37mDEBUG[0m: RECEIVED[0] (../lib/sbi/client.c:755) [32m09/04 09:32:38.795[0m: [[33msbi[0m] [1;37mDEBUG[0m: STATUS [204] (../lib/sbi/nghttp2-server.c:702) [32m09/04 09:32:38.795[0m: [[33msbi[0m] [1;37mDEBUG[0m: STREAM closed [13009] (../lib/sbi/nghttp2-server.c:1431) 0000: 00001a01 05000032 d189c461 96c361be .......2...a..a. 0010: 94034a6e 2d6a0802 71403f71 915c65e5 ..Jn-j..q(a)?q.\e. 0020: 3168df 1h. [32m09/04 09:32:38.795[0m: [[33msbi[0m] [1;37mDEBUG[0m: [204:PATCH]
http://127.0.0.200:7777/nnrf-nfm/v1/nf-instances/2c726162-a843-41f1-a7bf-45…
(../lib/sbi/client.c:744) [32m09/04 09:32:38.795[0m: [[33msbi[0m] [1;37mDEBUG[0m: RECEIVED[0] (../lib/sbi/client.c:755) [32m09/04 09:32:38.795[0m: [[33mudm[0m] [1;37mDEBUG[0m: udm_state_operational(): OGS_EVENT_NAME_SBI_CLIENT (../src/udm/udm-sm.c:61) [32m09/04 09:32:38.795[0m: [[33msbi[0m] [1;37mDEBUG[0m: ogs_sbi_nf_state_registered(): OGS_EVENT_NAME_SBI_CLIENT (../lib/sbi/nf-sm.c:312) [32m09/04 09:32:39.039[0m: [[33mudr[0m] [1;37mDEBUG[0m: udr_state_operational(): OGS_EVENT_NAME_SBI_TIMER (../src/udr/udr-sm.c:53) [32m09/04 09:32:39.039[0m: [[33msbi[0m] [1;37mDEBUG[0m: ogs_sbi_nf_state_registered(): OGS_EVENT_NAME_SBI_TIMER (../lib/sbi/nf-sm.c:312) [32m09/04 09:32:39.039[0m: [[33msbi[0m] [1;37mDEBUG[0m: [PATCH]
http://127.0.0.200:7777/nnrf-nfm/v1/nf-instances/2c97d406-a843-41f1-b6bf-57…
(../lib/sbi/client.c:797) [32m09/04 09:32:39.039[0m: [[33msbi[0m] [1;37mDEBUG[0m: SENDING...[100] (../lib/sbi/client.c:546) [32m09/04 09:32:39.039[0m: [[33msbi[0m] [1;37mDEBUG[0m: [{"op":"replace","path":"/nfStatus","value":"REGISTERED"},{"op":"replace","path":"/load","value":0}] (../lib/sbi/client.c:548) [32m09/04 09:32:39.040[0m: [[33msbi[0m] [1;37mDEBUG[0m: STREAM added [57] (../lib/sbi/nghttp2-server.c:1749) [32m09/04 09:32:39.040[0m: [[33msbi[0m] [1;37mDEBUG[0m: [PATCH] /nnrf-nfm/v1/nf-instances/2c97d406-a843-41f1-b6bf-57e53ec988f2 (../lib/sbi/nghttp2-server.c:1308) [32m09/04 09:32:39.040[0m: [[33msbi[0m] [1;37mDEBUG[0m: RECEIVED: 100 (../lib/sbi/nghttp2-server.c:1312) [32m09/04 09:32:39.040[0m: [[33msbi[0m] [1;37mDEBUG[0m: [{"op":"replace","path":"/nfStatus","value":"REGISTERED"},{"op":"replace","path":"/load","value":0}] (../lib/sbi/nghttp2-server.c:1314) [32m09/04 09:32:39.040[0m: [[33msbi[0m] [1;37mDEBUG[0m: [PATCH]
http://127.0.0.10:7777/nnrf-nfm/v1/nf-instances/2c97d406-a843-41f1-b6bf-57e…
(../lib/sbi/client.c:797) [32m09/04 09:32:39.040[0m: [[33msbi[0m] [1;37mDEBUG[0m: SENDING...[100] (../lib/sbi/client.c:546) [32m09/04 09:32:39.040[0m: [[33msbi[0m] [1;37mDEBUG[0m: [{"op":"replace","path":"/nfStatus","value":"REGISTERED"},{"op":"replace","path":"/load","value":0}] (../lib/sbi/client.c:548) [32m09/04 09:32:39.040[0m: [[33msbi[0m] [1;37mDEBUG[0m: STREAM added [565] (../lib/sbi/nghttp2-server.c:1749) [32m09/04 09:32:39.040[0m: [[33msbi[0m] [1;37mDEBUG[0m: [PATCH] /nnrf-nfm/v1/nf-instances/2c97d406-a843-41f1-b6bf-57e53ec988f2 (../lib/sbi/nghttp2-server.c:1308) [32m09/04 09:32:39.040[0m: [[33msbi[0m] [1;37mDEBUG[0m: RECEIVED: 100 (../lib/sbi/nghttp2-server.c:1312) [32m09/04 09:32:39.040[0m: [[33msbi[0m] [1;37mDEBUG[0m: [{"op":"replace","path":"/nfStatus","value":"REGISTERED"},{"op":"replace","path":"/load","value":0}] (../lib/sbi/nghttp2-server.c:1314) [32m09/04 09:32:39.040[0m: [[33mnrf[0m] [1;37mDEBUG[0m: nrf_state_operational(): OGS_EVENT_NAME_SBI_SERVER (../src/nrf/nrf-sm.c:54) [32m09/04 09:32:39.040[0m: [[33mnrf[0m] [1;37mDEBUG[0m: nrf_nf_state_registered(): OGS_EVENT_NAME_SBI_SERVER (../src/nrf/nf-sm.c:201) [32m09/04 09:32:39.040[0m: [[33msbi[0m] [1;37mDEBUG[0m: STATUS [204] (../lib/sbi/nghttp2-server.c:702) [32m09/04 09:32:39.040[0m: [[33msbi[0m] [1;37mDEBUG[0m: STREAM closed [565] (../lib/sbi/nghttp2-server.c:1431) 0000: 00001a01 05000002 3589f561 96c361be ........5..a..a. 0010: 94034a6e 2d6a0802 71403f71 915c65f5 ..Jn-j..q(a)?q.\e. 0020: 3168df 1h. [32m09/04 09:32:39.041[0m: [[33msbi[0m] [1;37mDEBUG[0m: [204:PATCH]
http://127.0.0.10:7777/nnrf-nfm/v1/nf-instances/2c97d406-a843-41f1-b6bf-57e…
(../lib/sbi/client.c:744) [32m09/04 09:32:39.041[0m: [[33msbi[0m] [1;37mDEBUG[0m: RECEIVED[0] (../lib/sbi/client.c:755) [32m09/04 09:32:39.041[0m: [[33msbi[0m] [1;37mDEBUG[0m: STATUS [204] (../lib/sbi/nghttp2-server.c:702) [32m09/04 09:32:39.041[0m: [[33msbi[0m] [1;37mDEBUG[0m: STREAM closed [57] (../lib/sbi/nghttp2-server.c:1431) 0000: 00001a01 05000000 3989d161 96c361be ........9..a..a. 0010: 94034a6e 2d6a0802 71403f71 915c65f5 ..Jn-j..q(a)?q.\e. 0020: 3168df 1h. [32m09/04 09:32:39.041[0m: [[33msbi[0m] [1;37mDEBUG[0m: [204:PATCH]
http://127.0.0.200:7777/nnrf-nfm/v1/nf-instances/2c97d406-a843-41f1-b6bf-57…
(../lib/sbi/client.c:744) [32m09/04 09:32:39.041[0m: [[33msbi[0m] [1;37mDEBUG[0m: RECEIVED[0] (../lib/sbi/client.c:755) [32m09/04 09:32:39.041[0m: [[33mudr[0m] [1;37mDEBUG[0m: udr_state_operational(): OGS_EVENT_NAME_SBI_CLIENT (../src/udr/udr-sm.c:53) [32m09/04 09:32:39.041[0m: [[33msbi[0m] [1;37mDEBUG[0m: ogs_sbi_nf_state_registered(): OGS_EVENT_NAME_SBI_CLIENT (../lib/sbi/nf-sm.c:312) [32m09/04 09:32:39.181[0m: [[33mpcf[0m] [1;37mDEBUG[0m: pcf_state_operational(): OGS_EVENT_NAME_SBI_TIMER (../src/pcf/pcf-sm.c:64) [32m09/04 09:32:39.181[0m: [[33msbi[0m] [1;37mDEBUG[0m: ogs_sbi_nf_state_registered(): OGS_EVENT_NAME_SBI_TIMER (../lib/sbi/nf-sm.c:312) [32m09/04 09:32:39.181[0m: [[33msbi[0m] [1;37mDEBUG[0m: [PATCH]
http://127.0.0.200:7777/nnrf-nfm/v1/nf-instances/2cac17a4-a843-41f1-ba5b-95…
(../lib/sbi/client.c:797) [32m09/04 09:32:39.181[0m: [[33msbi[0m] [1;37mDEBUG[0m: SENDING...[101] (../lib/sbi/client.c:546) [32m09/04 09:32:39.181[0m: [[33msbi[0m] [1;37mDEBUG[0m: [{"op":"replace","path":"/nfStatus","value":"REGISTERED"},{"op":"replace","path":"/load","value":25}] (../lib/sbi/client.c:548) [32m09/04 09:32:39.181[0m: [[33msbi[0m] [1;37mDEBUG[0m: STREAM added [5757] (../lib/sbi/nghttp2-server.c:1749) [32m09/04 09:32:39.181[0m: [[33msbi[0m] [1;37mDEBUG[0m: [PATCH] /nnrf-nfm/v1/nf-instances/2cac17a4-a843-41f1-ba5b-95494485b9a1 (../lib/sbi/nghttp2-server.c:1308) [32m09/04 09:32:39.181[0m: [[33msbi[0m] [1;37mDEBUG[0m: RECEIVED: 101 (../lib/sbi/nghttp2-server.c:1312) [32m09/04 09:32:39.181[0m: [[33msbi[0m] [1;37mDEBUG[0m: [{"op":"replace","path":"/nfStatus","value":"REGISTERED"},{"op":"replace","path":"/load","value":25}] (../lib/sbi/nghttp2-server.c:1314) [32m09/04 09:32:39.182[0m: [[33msbi[0m] [1;37mDEBUG[0m: [PATCH]
http://127.0.0.10:7777/nnrf-nfm/v1/nf-instances/2cac17a4-a843-41f1-ba5b-954…
(../lib/sbi/client.c:797) [32m09/04 09:32:39.182[0m: [[33msbi[0m] [1;37mDEBUG[0m: SENDING...[101] (../lib/sbi/client.c:546) [32m09/04 09:32:39.182[0m: [[33msbi[0m] [1;37mDEBUG[0m: [{"op":"replace","path":"/nfStatus","value":"REGISTERED"},{"op":"replace","path":"/load","value":25}] (../lib/sbi/client.c:548) [32m09/04 09:32:39.182[0m: [[33msbi[0m] [1;37mDEBUG[0m: STREAM added [567] (../lib/sbi/nghttp2-server.c:1749) [32m09/04 09:32:39.182[0m: [[33msbi[0m] [1;37mDEBUG[0m: [PATCH] /nnrf-nfm/v1/nf-instances/2cac17a4-a843-41f1-ba5b-95494485b9a1 (../lib/sbi/nghttp2-server.c:1308) [32m09/04 09:32:39.182[0m: [[33msbi[0m] [1;37mDEBUG[0m: RECEIVED: 101 (../lib/sbi/nghttp2-server.c:1312) [32m09/04 09:32:39.182[0m: [[33msbi[0m] [1;37mDEBUG[0m: [{"op":"replace","path":"/nfStatus","value":"REGISTERED"},{"op":"replace","path":"/load","value":25}] (../lib/sbi/nghttp2-server.c:1314) [32m09/04 09:32:39.182[0m: [[33mnrf[0m] [1;37mDEBUG[0m: nrf_state_operational(): OGS_EVENT_NAME_SBI_SERVER (../src/nrf/nrf-sm.c:54) [32m09/04 09:32:39.182[0m: [[33mnrf[0m] [1;37mDEBUG[0m: nrf_nf_state_registered(): OGS_EVENT_NAME_SBI_SERVER (../src/nrf/nf-sm.c:201) [32m09/04 09:32:39.182[0m: [[33msbi[0m] [1;37mDEBUG[0m: STATUS [204] (../lib/sbi/nghttp2-server.c:702) [32m09/04 09:32:39.182[0m: [[33msbi[0m] [1;37mDEBUG[0m: STREAM closed [567] (../lib/sbi/nghttp2-server.c:1431) 0000: 00000301 05000002 3789f6be ........7... [32m09/04 09:32:39.182[0m: [[33msbi[0m] [1;37mDEBUG[0m: [204:PATCH]
http://127.0.0.10:7777/nnrf-nfm/v1/nf-instances/2cac17a4-a843-41f1-ba5b-954…
(../lib/sbi/client.c:744) [32m09/04 09:32:39.182[0m: [[33msbi[0m] [1;37mDEBUG[0m: RECEIVED[0] (../lib/sbi/client.c:755) [32m09/04 09:32:39.182[0m: [[33msbi[0m] [1;37mDEBUG[0m: STATUS [204] (../lib/sbi/nghttp2-server.c:702) [32m09/04 09:32:39.183[0m: [[33msbi[0m] [1;37mDEBUG[0m: STREAM closed [5757] (../lib/sbi/nghttp2-server.c:1431) 0000: 00001a01 05000016 7d89f861 96c361be ........}..a..a. 0010: 94034a6e 2d6a0802 71403f71 915c65f5 ..Jn-j..q(a)?q.\e. 0020: 3168df 1h. [32m09/04 09:32:39.183[0m: [[33msbi[0m] [1;37mDEBUG[0m: [204:PATCH]
http://127.0.0.200:7777/nnrf-nfm/v1/nf-instances/2cac17a4-a843-41f1-ba5b-95…
(../lib/sbi/client.c:744) [32m09/04 09:32:39.183[0m: [[33msbi[0m] [1;37mDEBUG[0m: RECEIVED[0] (../lib/sbi/client.c:755) [32m09/04 09:32:39.183[0m: [[33mpcf[0m] [1;37mDEBUG[0m: pcf_state_operational(): OGS_EVENT_NAME_SBI_CLIENT (../src/pcf/pcf-sm.c:64) [32m09/04 09:32:39.183[0m: [[33msbi[0m] [1;37mDEBUG[0m: ogs_sbi_nf_state_registered(): OGS_EVENT_NAME_SBI_CLIENT (../lib/sbi/nf-sm.c:312) MTC@e30ab461b77c: External command `<
https://jenkins.osmocom.org/jenkins/job/ttcn3-5gc-test-ogs/ws/src/osmo-ttcn…
> C5G_Tests.TC_ue_service_request_cm_connected' was executed successfully (exit status: 0). MTC@e30ab461b77c: Test case TC_ue_service_request_cm_connected started. GTP1U_EM(841)@e30ab461b77c: Warning: sizes of 'struct sctp_event_subscribe': compile-time 14, kernel: 14 GTP1U_EM(841)@e30ab461b77c: setverdict(fail): none -> fail reason: "Could not connect UECUPS socket, check your configuration", new component reason: "Could not connect UECUPS socket, check your configuration" GTP1U_EM(841)@e30ab461b77c: Dynamic test case error: testcase.stop GTP1U_EM(841)@e30ab461b77c: setverdict(error): fail -> error GTP1U_EM(841)@e30ab461b77c: Final verdict of PTC: error TC_ue_service_request_cm_connected-NGAP0(842)@e30ab461b77c: Warning: sizes of 'struct sctp_event_subscribe': compile-time 14, kernel: 14 [32m09/04 09:32:39.245[0m: [[33mamf[0m] [1;32mINFO[0m: gNB-N2 accepted[127.0.0.202]:50000 in ng-path module (../src/amf/ngap-sctp.c:113) [32m09/04 09:32:39.245[0m: [[33mamf[0m] [1;37mDEBUG[0m: amf_state_operational(): AMF_EVENT_NGAP_LO_ACCEPT (../src/amf/amf-sm.c:84) [32m09/04 09:32:39.245[0m: [[33mamf[0m] [1;32mINFO[0m: gNB-N2 accepted[127.0.0.202] in master_sm module (../src/amf/amf-sm.c:822) [32m09/04 09:32:39.252[0m: [[33mamf[0m] [1;37mDEBUG[0m: ngap_state_initial(): ENTRY (../src/amf/ngap-sm.c:28) [32m09/04 09:32:39.252[0m: [[33mamf[0m] [1;37mDEBUG[0m: ngap_state_operational(): ENTRY (../src/amf/ngap-sm.c:55) [32m09/04 09:32:39.252[0m: [[33mamf[0m] [1;32mINFO[0m: [Added] Number of gNBs is now 1 (../src/amf/context.c:1277) [32m09/04 09:32:39.252[0m: [[33mamf[0m] [1;37mDEBUG[0m: SCTP_ASSOC_CHANGE:[T:32769, F:0x0, S:0, I/O:64/30] (../src/amf/ngap-sctp.c:152) [32m09/04 09:32:39.252[0m: [[33mamf[0m] [1;37mDEBUG[0m: SCTP_COMM_UP (../src/amf/ngap-sctp.c:161) [32m09/04 09:32:39.252[0m: [[33mamf[0m] [1;37mDEBUG[0m: amf_state_operational(): AMF_EVENT_NGAP_LO_SCTP_COMM_UP (../src/amf/amf-sm.c:84) [32m09/04 09:32:39.252[0m: [[33mamf[0m] [1;32mINFO[0m: gNB-N2[127.0.0.202] max_num_of_ostreams : 30 (../src/amf/amf-sm.c:869) TC_ue_service_request_cm_connected-NGAP1(843)@e30ab461b77c: Warning: sizes of 'struct sctp_event_subscribe': compile-time 14, kernel: 14 [32m09/04 09:32:39.254[0m: [[33mamf[0m] [1;32mINFO[0m: gNB-N2 accepted[127.0.0.202]:50001 in ng-path module (../src/amf/ngap-sctp.c:113) [32m09/04 09:32:39.254[0m: [[33mamf[0m] [1;37mDEBUG[0m: amf_state_operational(): AMF_EVENT_NGAP_LO_ACCEPT (../src/amf/amf-sm.c:84) [32m09/04 09:32:39.254[0m: [[33mamf[0m] [1;32mINFO[0m: gNB-N2 accepted[127.0.0.202] in master_sm module (../src/amf/amf-sm.c:822) [32m09/04 09:32:39.259[0m: [[33mamf[0m] [1;37mDEBUG[0m: ngap_state_initial(): ENTRY (../src/amf/ngap-sm.c:28) [32m09/04 09:32:39.259[0m: [[33mamf[0m] [1;37mDEBUG[0m: ngap_state_operational(): ENTRY (../src/amf/ngap-sm.c:55) [32m09/04 09:32:39.259[0m: [[33mamf[0m] [1;32mINFO[0m: [Added] Number of gNBs is now 2 (../src/amf/context.c:1277) [32m09/04 09:32:39.259[0m: [[33mamf[0m] [1;37mDEBUG[0m: SCTP_ASSOC_CHANGE:[T:32769, F:0x0, S:0, I/O:64/30] (../src/amf/ngap-sctp.c:152) [32m09/04 09:32:39.259[0m: [[33mamf[0m] [1;37mDEBUG[0m: SCTP_COMM_UP (../src/amf/ngap-sctp.c:161) [32m09/04 09:32:39.259[0m: [[33mamf[0m] [1;37mDEBUG[0m: amf_state_operational(): AMF_EVENT_NGAP_LO_SCTP_COMM_UP (../src/amf/amf-sm.c:84) [32m09/04 09:32:39.259[0m: [[33mamf[0m] [1;32mINFO[0m: gNB-N2[127.0.0.202] max_num_of_ostreams : 30 (../src/amf/amf-sm.c:869) [32m09/04 09:32:39.259[0m: [[33mamf[0m] [1;37mDEBUG[0m: amf_state_operational(): AMF_EVENT_NGAP_MESSAGE (../src/amf/amf-sm.c:84) [32m09/04 09:32:39.259[0m: [[33mamf[0m] [1;37mDEBUG[0m: ngap_state_operational(): AMF_EVENT_NGAP_MESSAGE (../src/amf/ngap-sm.c:55) [32m09/04 09:32:39.259[0m: [[33mamf[0m] [1;37mDEBUG[0m: NGSetupRequest (../src/amf/ngap-handler.c:288) [32m09/04 09:32:39.259[0m: [[33mamf[0m] [1;37mDEBUG[0m: IP[127.0.0.202] GNB_ID[0x0] GNB_ID_LENGTH[22] (../src/amf/ngap-handler.c:386) [32m09/04 09:32:39.259[0m: [[33mamf[0m] [1;37mDEBUG[0m: PLMN_ID[MCC:999 MNC:70] (../src/amf/ngap-handler.c:391) [32m09/04 09:32:39.259[0m: [[33mamf[0m] [1;37mDEBUG[0m: PagingDRX[0] (../src/amf/ngap-handler.c:395) [32m09/04 09:32:39.259[0m: [[33mamf[0m] [1;37mDEBUG[0m: TAC[1] (../src/amf/ngap-handler.c:439) [32m09/04 09:32:39.259[0m: [[33mamf[0m] [1;37mDEBUG[0m: PLMN_ID[MCC:999 MNC:70] (../src/amf/ngap-handler.c:501) [32m09/04 09:32:39.259[0m: [[33mamf[0m] [1;37mDEBUG[0m: S_NSSAI[SST:1 SD:0xffffff] (../src/amf/ngap-handler.c:562) [32m09/04 09:32:39.259[0m: [[33mamf[0m] [1;37mDEBUG[0m: TAC[1] (../src/amf/ngap-handler.c:72) [32m09/04 09:32:39.259[0m: [[33mamf[0m] [1;37mDEBUG[0m: PLMN_ID[MCC:999 MNC:70] (../src/amf/ngap-handler.c:73) [32m09/04 09:32:39.259[0m: [[33mamf[0m] [1;37mDEBUG[0m: SERVED_TAI_INDEX[0] (../src/amf/ngap-handler.c:78) [32m09/04 09:32:39.259[0m: [[33mamf[0m] [1;37mDEBUG[0m: PLMN_ID[MCC:999 MNC:70] (../src/amf/ngap-handler.c:100) [32m09/04 09:32:39.259[0m: [[33mamf[0m] [1;37mDEBUG[0m: S_NSSAI[SST:1 SD:0xffffff] (../src/amf/ngap-handler.c:105) [32m09/04 09:32:39.259[0m: [[33mamf[0m] [1;37mDEBUG[0m: NG-Setup response (../src/amf/ngap-path.c:356) [32m09/04 09:32:39.259[0m: [[33mamf[0m] [1;37mDEBUG[0m: NGSetupResponse (../src/amf/ngap-build.c:91) [32m09/04 09:32:39.259[0m: [[33mamf[0m] [1;37mDEBUG[0m: IP[127.0.0.202] RAN_ID[0] (../src/amf/ngap-path.c:64) MTC@e30ab461b77c: setverdict(pass): none -> pass MTC@e30ab461b77c: Dynamic test case error: Error message was received from MC: The connect operation refers to test component with component reference 841, which has already terminated. MTC@e30ab461b77c: setverdict(error): pass -> error TC_ue_service_request_cm_connected0(844)@e30ab461b77c: Final verdict of PTC: none [32m09/04 09:32:39.266[0m: [[33mamf[0m] [1;37mDEBUG[0m: SCTP_SHUTDOWN_EVENT:[T:32773, F:0x0, L:12] (../src/amf/ngap-sctp.c:193) [32m09/04 09:32:39.266[0m: [[33mamf[0m] [1;37mDEBUG[0m: amf_state_operational(): AMF_EVENT_NGAP_LO_CONNREFUSED (../src/amf/amf-sm.c:84) [32m09/04 09:32:39.266[0m: [[33mamf[0m] [1;32mINFO[0m: gNB-N2[127.0.0.202] connection refused!!! (../src/amf/amf-sm.c:882) [32m09/04 09:32:39.266[0m: [[33mamf[0m] [1;37mDEBUG[0m: ngap_state_operational(): EXIT (../src/amf/ngap-sm.c:55) [32m09/04 09:32:39.266[0m: [[33mamf[0m] [1;37mDEBUG[0m: ngap_state_final(): EXIT (../src/amf/ngap-sm.c:37) [32m09/04 09:32:39.266[0m: [[33mamf[0m] [1;32mINFO[0m: [Removed] Number of gNBs is now 1 (../src/amf/context.c:1305) [32m09/04 09:32:39.266[0m: [[33mamf[0m] [1;37mDEBUG[0m: SCTP_SHUTDOWN_EVENT:[T:32773, F:0x0, L:12] (../src/amf/ngap-sctp.c:193) [32m09/04 09:32:39.266[0m: [[33mamf[0m] [1;37mDEBUG[0m: amf_state_operational(): AMF_EVENT_NGAP_LO_CONNREFUSED (../src/amf/amf-sm.c:84) [32m09/04 09:32:39.266[0m: [[33mamf[0m] [1;32mINFO[0m: gNB-N2[127.0.0.202] connection refused!!! (../src/amf/amf-sm.c:882) [32m09/04 09:32:39.266[0m: [[33mamf[0m] [1;37mDEBUG[0m: ngap_state_operational(): EXIT (../src/amf/ngap-sm.c:55) [32m09/04 09:32:39.266[0m: [[33mamf[0m] [1;37mDEBUG[0m: ngap_state_final(): EXIT (../src/amf/ngap-sm.c:37) [32m09/04 09:32:39.266[0m: [[33mamf[0m] [1;32mINFO[0m: [Removed] Number of gNBs is now 0 (../src/amf/context.c:1305) TC_ue_service_request_cm_connected-NGAP1(843)@e30ab461b77c: Final verdict of PTC: none TC_ue_service_request_cm_connected-NGAP0(842)@e30ab461b77c: Final verdict of PTC: none MTC@e30ab461b77c: Setting final verdict of the test case. MTC@e30ab461b77c: Local verdict of MTC: error MTC@e30ab461b77c: Local verdict of PTC GTP1U_EM(841): error (error -> error) MTC@e30ab461b77c: Local verdict of PTC TC_ue_service_request_cm_connected-NGAP0(842): none (error -> error) MTC@e30ab461b77c: Local verdict of PTC TC_ue_service_request_cm_connected-NGAP1(843): none (error -> error) MTC@e30ab461b77c: Local verdict of PTC TC_ue_service_request_cm_connected0(844): none (error -> error) MTC@e30ab461b77c: Test case TC_ue_service_request_cm_connected finished. Verdict: error MTC@e30ab461b77c: Starting external command `<
https://jenkins.osmocom.org/jenkins/job/ttcn3-5gc-test-ogs/ws/src/osmo-ttcn…
> C5G_Tests.TC_ue_service_request_cm_connected error'. (09:32:39) load average: 1.86, 2.01, 1.43 [1;31m------ C5G_Tests.TC_ue_service_request_cm_connected error ------[0m Waiting for packet dumper to finish... 0 (prev_count=-1, count=1284) [32m09/04 09:32:39.453[0m: [[33mamf[0m] [1;37mDEBUG[0m: amf_state_operational(): OGS_EVENT_NAME_SBI_TIMER (../src/amf/amf-sm.c:84) [32m09/04 09:32:39.453[0m: [[33msbi[0m] [1;37mDEBUG[0m: ogs_sbi_nf_state_registered(): OGS_EVENT_NAME_SBI_TIMER (../lib/sbi/nf-sm.c:312) [32m09/04 09:32:39.454[0m: [[33msbi[0m] [1;37mDEBUG[0m: [PATCH]
http://127.0.0.200:7777/nnrf-nfm/v1/nf-instances/2cdb9240-a843-41f1-9f0d-01…
(../lib/sbi/client.c:797) [32m09/04 09:32:39.454[0m: [[33msbi[0m] [1;37mDEBUG[0m: SENDING...[100] (../lib/sbi/client.c:546) [32m09/04 09:32:39.454[0m: [[33msbi[0m] [1;37mDEBUG[0m: [{"op":"replace","path":"/nfStatus","value":"REGISTERED"},{"op":"replace","path":"/load","value":0}] (../lib/sbi/client.c:548) [32m09/04 09:32:39.454[0m: [[33msbi[0m] [1;37mDEBUG[0m: STREAM added [22351] (../lib/sbi/nghttp2-server.c:1749) [32m09/04 09:32:39.454[0m: [[33msbi[0m] [1;37mDEBUG[0m: [PATCH] /nnrf-nfm/v1/nf-instances/2cdb9240-a843-41f1-9f0d-01a9933afe85 (../lib/sbi/nghttp2-server.c:1308) [32m09/04 09:32:39.454[0m: [[33msbi[0m] [1;37mDEBUG[0m: RECEIVED: 100 (../lib/sbi/nghttp2-server.c:1312) [32m09/04 09:32:39.454[0m: [[33msbi[0m] [1;37mDEBUG[0m: [{"op":"replace","path":"/nfStatus","value":"REGISTERED"},{"op":"replace","path":"/load","value":0}] (../lib/sbi/nghttp2-server.c:1314) [32m09/04 09:32:39.454[0m: [[33msbi[0m] [1;37mDEBUG[0m: [PATCH]
http://127.0.0.10:7777/nnrf-nfm/v1/nf-instances/2cdb9240-a843-41f1-9f0d-01a…
(../lib/sbi/client.c:797) [32m09/04 09:32:39.454[0m: [[33msbi[0m] [1;37mDEBUG[0m: SENDING...[100] (../lib/sbi/client.c:546) [32m09/04 09:32:39.454[0m: [[33msbi[0m] [1;37mDEBUG[0m: [{"op":"replace","path":"/nfStatus","value":"REGISTERED"},{"op":"replace","path":"/load","value":0}] (../lib/sbi/client.c:548) [32m09/04 09:32:39.454[0m: [[33msbi[0m] [1;37mDEBUG[0m: STREAM added [569] (../lib/sbi/nghttp2-server.c:1749) [32m09/04 09:32:39.455[0m: [[33msbi[0m] [1;37mDEBUG[0m: [PATCH] /nnrf-nfm/v1/nf-instances/2cdb9240-a843-41f1-9f0d-01a9933afe85 (../lib/sbi/nghttp2-server.c:1308) [32m09/04 09:32:39.455[0m: [[33msbi[0m] [1;37mDEBUG[0m: RECEIVED: 100 (../lib/sbi/nghttp2-server.c:1312) [32m09/04 09:32:39.455[0m: [[33msbi[0m] [1;37mDEBUG[0m: [{"op":"replace","path":"/nfStatus","value":"REGISTERED"},{"op":"replace","path":"/load","value":0}] (../lib/sbi/nghttp2-server.c:1314) [32m09/04 09:32:39.455[0m: [[33mnrf[0m] [1;37mDEBUG[0m: nrf_state_operational(): OGS_EVENT_NAME_SBI_SERVER (../src/nrf/nrf-sm.c:54) [32m09/04 09:32:39.455[0m: [[33mnrf[0m] [1;37mDEBUG[0m: nrf_nf_state_registered(): OGS_EVENT_NAME_SBI_SERVER (../src/nrf/nf-sm.c:201) [32m09/04 09:32:39.455[0m: [[33msbi[0m] [1;37mDEBUG[0m: STATUS [204] (../lib/sbi/nghttp2-server.c:702) [32m09/04 09:32:39.455[0m: [[33msbi[0m] [1;37mDEBUG[0m: STREAM closed [569] (../lib/sbi/nghttp2-server.c:1431) 0000: 00000301 05000002 3989f6be ........9... [32m09/04 09:32:39.455[0m: [[33msbi[0m] [1;37mDEBUG[0m: [204:PATCH]
http://127.0.0.10:7777/nnrf-nfm/v1/nf-instances/2cdb9240-a843-41f1-9f0d-01a…
(../lib/sbi/client.c:744) [32m09/04 09:32:39.455[0m: [[33msbi[0m] [1;37mDEBUG[0m: RECEIVED[0] (../lib/sbi/client.c:755) [32m09/04 09:32:39.455[0m: [[33msbi[0m] [1;37mDEBUG[0m: STATUS [204] (../lib/sbi/nghttp2-server.c:702) [32m09/04 09:32:39.455[0m: [[33msbi[0m] [1;37mDEBUG[0m: STREAM closed [22351] (../lib/sbi/nghttp2-server.c:1431) 0000: 00001a01 05000057 4f89c461 96c361be .......WO..a..a. 0010: 94034a6e 2d6a0802 71403f71 915c65f5 ..Jn-j..q(a)?q.\e. 0020: 3168df 1h. [32m09/04 09:32:39.455[0m: [[33msbi[0m] [1;37mDEBUG[0m: [204:PATCH]
http://127.0.0.200:7777/nnrf-nfm/v1/nf-instances/2cdb9240-a843-41f1-9f0d-01…
(../lib/sbi/client.c:744) [32m09/04 09:32:39.455[0m: [[33msbi[0m] [1;37mDEBUG[0m: RECEIVED[0] (../lib/sbi/client.c:755) [32m09/04 09:32:39.455[0m: [[33mamf[0m] [1;37mDEBUG[0m: amf_state_operational(): OGS_EVENT_NAME_SBI_CLIENT (../src/amf/amf-sm.c:84) [32m09/04 09:32:39.456[0m: [[33msbi[0m] [1;37mDEBUG[0m: ogs_sbi_nf_state_registered(): OGS_EVENT_NAME_SBI_CLIENT (../lib/sbi/nf-sm.c:312) Waiting for packet dumper to finish... 1 (prev_count=1284, count=10080) MTC@e30ab461b77c: External command `<
https://jenkins.osmocom.org/jenkins/job/ttcn3-5gc-test-ogs/ws/src/osmo-ttcn…
> C5G_Tests.TC_ue_service_request_cm_connected error' was executed successfully (exit status: 0). MTC@e30ab461b77c: Starting external command `<
https://jenkins.osmocom.org/jenkins/job/ttcn3-5gc-test-ogs/ws/src/osmo-ttcn…
> C5G_Tests.TC_net_triggered_service_req'. ------ C5G_Tests.TC_net_triggered_service_req ------ (09:32:41) load average: 1.86, 2.01, 1.43 /usr/bin/dumpcap -q -s 1520 -n -i any -w "<
https://jenkins.osmocom.org/jenkins/job/ttcn3-5gc-test-ogs/469/artifact/log…
"> ><
https://jenkins.osmocom.org/jenkins/job/ttcn3-5gc-test-ogs/469/artifact/log…
> 2>/tmp/cmderr & Waiting for packet dumper to start... 0 [1;34m[testenv] Stopping podman container[0m [0;94m[testenv] + ['podman', 'kill', 'testenv-5gc-osmocom-nightly-20260904-0929-ecec0382-1'][0m testenv-5gc-osmocom-nightly-20260904-0929-ecec0382-1 [0;94m[testenv] Skipping clean up scripts, podman container has already stopped[0m [1;34m[testenv] Stopping testsuite (2671508)[0m Error: container has already been removed [0;94m[testenv] feed_watchdog_loop: podman container has stopped[0m [1;34m[testenv] Logs saved to:
https://jenkins.osmocom.org/jenkins/job/ttcn3-5gc-test-ogs/469/artifact/log…
[0m + RC=1 + [ 1 = 0 ] + uptime + grep --color=always -o load.* [01;31m[Kload average: 1.79, 1.99, 1.43[m[K + exit 1 Build step 'Execute shell' marked build as failure Recording test results [Checks API] No suitable checks publisher found.
1
0
0
0
Build failed in Jenkins: ttcn3-bts-test-io_uring #842
by jenkins@lists.osmocom.org
04 Sep '26
04 Sep '26
See <
https://jenkins.osmocom.org/jenkins/job/ttcn3-bts-test-io_uring/842/display…
> Changes: ------------------------------------------ [...truncated 12.51 MiB...] <testcase classname='BTS_Tests:hopping' name='TC_rll_unit_data_req_DCCH' time='2.352162'/> <testcase classname='BTS_Tests:hopping' name='TC_rll_unit_data_req_ACCH' time='5.323591'/> <testcase classname='BTS_Tests:hopping' name='TC_rll_unit_data_ind_DCCH' time='2.934030'/> <testcase classname='BTS_Tests:hopping' name='TC_rll_unit_data_ind_ACCH' time='10.551472'/> <testcase classname='BTS_Tests:hopping' name='TC_chan_act_a51' time='2.629719'/> <testcase classname='BTS_Tests:hopping' name='TC_chan_act_a52' time='2.711688'/> <testcase classname='BTS_Tests:hopping' name='TC_chan_act_a53' time='2.704810'/> <testcase classname='BTS_Tests:hopping' name='TC_chan_act_a54' time='2.713245'/> <testcase classname='BTS_Tests:hopping' name='TC_encr_cmd_a51' time='5.229384'/> <testcase classname='BTS_Tests:hopping' name='TC_encr_cmd_a52' time='5.198403'/> <testcase classname='BTS_Tests:hopping' name='TC_encr_cmd_a53' time='5.220090'/> <testcase classname='BTS_Tests:hopping' name='TC_encr_cmd_a54' time='5.191755'/> <testcase classname='BTS_Tests:hopping' name='TC_err_rep_wrong_mdisc' time='1.231767'/> <testcase classname='BTS_Tests:hopping' name='TC_err_rep_wrong_msg_type' time='1.277127'/> <testcase classname='BTS_Tests:hopping' name='TC_err_rep_wrong_sequence' time='1.248554'/> <testcase classname='BTS_Tests:hopping' name='TC_lapdm_selftest' time='0.006552'/> <testcase classname='BTS_Tests:hopping' name='TC_tch_sign_l2_fill_frame' time='18.437830'/> <testcase classname='BTS_Tests:hopping' name='TC_tch_sign_l2_fill_frame_dtxd' time='2.111796'> <failure type='fail-verdict'>Received DTX TCH fill frame with bad frame number: 175 (mod 104: 71) (mod 26: 19) BTS_Tests.ttcn:9579 BTS_Tests control part BTS_Tests.ttcn:8110 TC_tch_sign_l2_fill_frame_dtxd testcase </failure> </testcase> <testcase classname='BTS_Tests:hopping' name='TC_chopped_ipa_ping' time='24.691903'/> <testcase classname='BTS_Tests:hopping' name='TC_chopped_ipa_payload' time='42.606635'/> <testcase classname='BTS_Tests:hopping' name='TC_ms_pwr_ctrl_constant' time='16.881380'/> <testcase classname='BTS_Tests:hopping' name='TC_ms_pwr_ctrl_pf_ewma' time='31.518543'/> <testcase classname='BTS_Tests:hopping' name='TC_speech_no_rtp_tchf' time='7.441254'/> <testcase classname='BTS_Tests:hopping' name='TC_speech_no_rtp_tchh' time='5.486200'/> <testcase classname='BTS_Tests:hopping' name='TC_speech_rtp_tchf' time='7.564330'/> <testcase classname='BTS_Tests:hopping' name='TC_speech_rtp_tchh' time='5.488457'/> <testcase classname='BTS_Tests:hopping' name='TC_speech_osmux_tchf' time='3.357788'/> <testcase classname='BTS_Tests:hopping' name='TC_speech_osmux_tchh' time='3.479367'/> <testcase classname='BTS_Tests:hopping' name='TC_data_rtp_tchf144' time='2.143675'/> <testcase classname='BTS_Tests:hopping' name='TC_data_rtp_tchf96' time='2.158744'/> <testcase classname='BTS_Tests:hopping' name='TC_data_rtp_tchf48' time='2.156043'/> <testcase classname='BTS_Tests:hopping' name='TC_data_rtp_tchh48' time='5.313418'> <failure type='fail-verdict'>Timeout waiting for matching Downlink data frame BTS_Tests.ttcn:9597 BTS_Tests control part BTS_Tests.ttcn:8880 TC_data_rtp_tchh48 testcase </failure> </testcase> <testcase classname='BTS_Tests:hopping' name='TC_data_rtp_tchf24' time='1.803527'/> <testcase classname='BTS_Tests:hopping' name='TC_data_rtp_tchh24' time='5.318136'> <failure type='fail-verdict'>Timeout waiting for matching Downlink data frame BTS_Tests.ttcn:9599 BTS_Tests control part BTS_Tests.ttcn:8949 TC_data_rtp_tchh24 testcase </failure> </testcase> <testcase classname='BTS_Tests:hopping' name='TC_data_facch_tchf144' time='1.998204'/> <testcase classname='BTS_Tests:hopping' name='TC_data_facch_tchf96' time='2.079991'/> <testcase classname='BTS_Tests:hopping' name='TC_data_facch_tchf48' time='2.032359'/> <testcase classname='BTS_Tests:hopping' name='TC_data_facch_tchh48' time='2.189105'/> <testcase classname='BTS_Tests:hopping' name='TC_data_facch_tchf24' time='2.004521'/> <testcase classname='BTS_Tests:hopping' name='TC_data_facch_tchh24' time='2.163063'/> <testcase classname='BTS_Tests:hopping' name='TC_early_immediate_assignment' time='3.539632'/> <testcase classname='BTS_Tests:hopping' name='TC_acch_overpower_rxqual_thresh' time='9.087180'> <failure type='fail-verdict'>Timeout waiting for L1CTL DATA.ind BTS_Tests.ttcn:9610 BTS_Tests control part BTS_Tests.ttcn:9244 TC_acch_overpower_rxqual_thresh testcase </failure> </testcase> <testcase classname='BTS_Tests:hopping' name='TC_acch_overpower_rxqual_thresh_dtx' time='9.035129'> <failure type='fail-verdict'>Timeout waiting for L1CTL DATA.ind BTS_Tests.ttcn:9611 BTS_Tests control part BTS_Tests.ttcn:9285 TC_acch_overpower_rxqual_thresh_dtx testcase </failure> </testcase> <testcase classname='BTS_Tests:hopping' name='TC_acch_overpower_always_on_facch' time='9.020660'> <failure type='fail-verdict'>Timeout waiting for L1CTL DATA.ind BTS_Tests.ttcn:9612 BTS_Tests control part BTS_Tests.ttcn:9317 TC_acch_overpower_always_on_facch testcase </failure> </testcase> <testcase classname='BTS_Tests:hopping' name='TC_acch_overpower_always_on_sacch' time='9.017240'> <failure type='fail-verdict'>Timeout waiting for L1CTL DATA.ind BTS_Tests.ttcn:9613 BTS_Tests control part BTS_Tests.ttcn:9349 TC_acch_overpower_always_on_sacch testcase </failure> </testcase> <testcase classname='BTS_Tests:hopping' name='TC_acch_overpower_limit' time='9.004315'> <failure type='fail-verdict'>Timeout waiting for L1CTL DATA.ind BTS_Tests.ttcn:9614 BTS_Tests control part BTS_Tests.ttcn:9380 TC_acch_overpower_limit testcase </failure> </testcase> <testcase classname='BTS_Tests_SMSCB:hopping' name='TC_cbch_load_idle_no_cbch' time='11.138838'/> <testcase classname='BTS_Tests_SMSCB:hopping' name='TC_sms_cb_cmd_sdcch4_1block' time='14.244959'/> <testcase classname='BTS_Tests_SMSCB:hopping' name='TC_sms_cb_cmd_sdcch4_2block' time='14.190248'/> <testcase classname='BTS_Tests_SMSCB:hopping' name='TC_sms_cb_cmd_sdcch4_3block' time='14.200864'/> <testcase classname='BTS_Tests_SMSCB:hopping' name='TC_sms_cb_cmd_sdcch4_4block' time='14.190282'/> <testcase classname='BTS_Tests_SMSCB:hopping' name='TC_sms_cb_cmd_sdcch4_multi' time='20.207344'/> <testcase classname='BTS_Tests_SMSCB:hopping' name='TC_sms_cb_cmd_sdcch4_schedule' time='14.136335'/> <testcase classname='BTS_Tests_SMSCB:hopping' name='TC_sms_cb_cmd_sdcch4_default_only' time='16.198972'/> <testcase classname='BTS_Tests_SMSCB:hopping' name='TC_sms_cb_cmd_sdcch4_default_and_normal' time='17.169634'/> <testcase classname='BTS_Tests_SMSCB:hopping' name='TC_sms_cb_cmd_sdcch4_default_then_null' time='26.158310'/> <testcase classname='BTS_Tests_SMSCB:hopping' name='TC_cbc_sdcch4_load_idle' time='16.054818'/> <testcase classname='BTS_Tests_SMSCB:hopping' name='TC_cbc_sdcch4_load_overload' time='18.191411'/> <testcase classname='BTS_Tests_SMSCB:hopping' name='TC_sms_cb_cmd_sdcch8_1block' time='14.229966'/> <testcase classname='BTS_Tests_SMSCB:hopping' name='TC_sms_cb_cmd_sdcch8_2block' time='14.211196'/> <testcase classname='BTS_Tests_SMSCB:hopping' name='TC_sms_cb_cmd_sdcch8_3block' time='14.216843'/> <testcase classname='BTS_Tests_SMSCB:hopping' name='TC_sms_cb_cmd_sdcch8_4block' time='14.184326'/> <testcase classname='BTS_Tests_SMSCB:hopping' name='TC_sms_cb_cmd_sdcch8_multi' time='20.214878'/> <testcase classname='BTS_Tests_SMSCB:hopping' name='TC_sms_cb_cmd_sdcch8_schedule' time='14.167216'/> <testcase classname='BTS_Tests_SMSCB:hopping' name='TC_sms_cb_cmd_sdcch8_default_only' time='16.146007'/> <testcase classname='BTS_Tests_SMSCB:hopping' name='TC_sms_cb_cmd_sdcch8_default_and_normal' time='17.162824'/> <testcase classname='BTS_Tests_SMSCB:hopping' name='TC_cbc_sdcch8_load_idle' time='16.148869'/> <testcase classname='BTS_Tests_SMSCB:hopping' name='TC_cbc_sdcch8_load_overload' time='18.184280'/> <testcase classname='BTS_Tests_SMSCB:hopping' name='TC_etws_p1ro' time='12.160964'/> <testcase classname='BTS_Tests_SMSCB:hopping' name='TC_etws_p1ro_end' time='16.199412'/> <testcase classname='BTS_Tests_SMSCB:hopping' name='TC_etws_pcu' time='1.119640'/> <testcase classname='BTS_Tests_LAPDm:hopping' name='TC_sabm_ua_dcch_sapi0' time='2.912880'/> <testcase classname='BTS_Tests_LAPDm:hopping' name='TC_sabm_ua_dcch_sapi0_nopayload' time='9.743033'> <failure type='fail-verdict'>"BTS_Tests.ttcn:792 : Timeout expecting RF CHAN REL" BTS_Tests_LAPDm.ttcn:1475 BTS_Tests_LAPDm control part BTS_Tests_LAPDm.ttcn:157 TC_sabm_ua_dcch_sapi0_nopayload testcase </failure> </testcase> <testcase classname='BTS_Tests_LAPDm:hopping' name='TC_sabm_ua_dcch_sapi3' time='21.548906'/> <testcase classname='BTS_Tests_LAPDm:hopping' name='TC_sabm_ua_dcch_sapi4' time='21.326336'/> <testcase classname='BTS_Tests_LAPDm:hopping' name='TC_sabm_contention' time='21.256453'/> <testcase classname='BTS_Tests_LAPDm:hopping' name='TC_sabm_retransmit' time='3.160734'/> <testcase classname='BTS_Tests_LAPDm:hopping' name='TC_sabm_retransmit_bts' time='81.458687'/> <testcase classname='BTS_Tests_LAPDm:hopping' name='TC_sabm_invalid_resp' time='23.368160'/> <testcase classname='BTS_Tests_LAPDm:hopping' name='TC_sabm_dm' time='14.020458'/> <testcase classname='BTS_Tests_LAPDm:hopping' name='TC_establish_ign_first_sabm' time='8.157510'/> <testcase classname='BTS_Tests_LAPDm:hopping' name='TC_iframe_seq_and_ack' time='29.618707'> <failure type='fail-verdict'>Received RSL ERROR IND { msg_disc := { msg_group := RSL_MDISC_RLL (1), transparent := false }, msg_type := RSL_MT_ERROR_IND (3), ies := { { iei := RSL_IE_CHAN_NR (1), body := { chan_nr := { u := { sdcch8 := { tag := '01'B, sub_chan := 4 } }, tn := 6 } } }, { iei := RSL_IE_LINK_IDENT (2), body := { link_id := { c := FACCH_SDCCH (0), na := false, prio := SAPI0_PRIO_NORMAL (0), sapi := 0 } } }, { iei := RSL_IE_RLM_CAUSE (22), body := { rlm_cause := { len := 1, payload := '01'O } } } } } BTS_Tests_LAPDm.ttcn:1484 BTS_Tests_LAPDm control part BTS_Tests_LAPDm.ttcn:579 TC_iframe_seq_and_ack testcase </failure> </testcase> <testcase classname='BTS_Tests_LAPDm:hopping' name='TC_iframe_timer_recovery' time='24.626010'> <failure type='fail-verdict'>Received RSL ERROR IND { msg_disc := { msg_group := RSL_MDISC_RLL (1), transparent := false }, msg_type := RSL_MT_ERROR_IND (3), ies := { { iei := RSL_IE_CHAN_NR (1), body := { chan_nr := { u := { sdcch8 := { tag := '01'B, sub_chan := 4 } }, tn := 6 } } }, { iei := RSL_IE_LINK_IDENT (2), body := { link_id := { c := FACCH_SDCCH (0), na := false, prio := SAPI0_PRIO_NORMAL (0), sapi := 0 } } }, { iei := RSL_IE_RLM_CAUSE (22), body := { rlm_cause := { len := 1, payload := '01'O } } } } } BTS_Tests_LAPDm.ttcn:1485 BTS_Tests_LAPDm control part BTS_Tests_LAPDm.ttcn:685 TC_iframe_timer_recovery testcase </failure> </testcase> <testcase classname='BTS_Tests_LAPDm:hopping' name='TC_ns_seq_error' time='29.638110'> <failure type='fail-verdict'>"BTS_Tests.ttcn:732 : Tguard timeout" BTS_Tests_LAPDm.ttcn:1486 BTS_Tests_LAPDm control part BTS_Tests_LAPDm.ttcn:768 TC_ns_seq_error testcase </failure> </testcase> <testcase classname='BTS_Tests_LAPDm:hopping' name='TC_nr_seq_error' time='2.911839'/> <testcase classname='BTS_Tests_LAPDm:hopping' name='TC_rec_invalid_frame' time='119.182699'> <failure type='fail-verdict'>"BTS_Tests_LAPDm.ttcn:909 : Missing LAPDm_RR RSP" BTS_Tests_LAPDm.ttcn:1488 BTS_Tests_LAPDm control part BTS_Tests_LAPDm.ttcn:961 TC_rec_invalid_frame testcase </failure> </testcase> <testcase classname='BTS_Tests_LAPDm:hopping' name='TC_segm_concat_dcch' time='13.569010'> <failure type='fail-verdict'>"BTS_Tests_LAPDm.ttcn:1023 : received unexpected LAPDm { sacch := false, sapi := 0, lapdm := { ab := { addr := { spare := '0'B, lpd := 0, sapi := 0, c_r := false, ea := true }, ctrl := { s := { n_r := 1, p_f := false, s := '10'B, spare := '01'B } }, len := 0, m := false, el := 1, payload := ''O, padding := '2B2B2B2B2B2B2B2B2B2B2B2B2B2B2B2B2B2B2B2B'O (\"++++++++++++++++++++\") } } }" BTS_Tests_LAPDm.ttcn:1489 BTS_Tests_LAPDm control part BTS_Tests_LAPDm.ttcn:1088 TC_segm_concat_dcch testcase </failure> </testcase> <testcase classname='BTS_Tests_LAPDm:hopping' name='TC_segm_concat_sacch' time='48.538719'> <failure type='fail-verdict'>"BTS_Tests_LAPDm.ttcn:1023 : received unexpected LAPDm { sacch := true, sapi := 0, lapdm := { ab := { addr := { spare := '0'B, lpd := 0, sapi := 0, c_r := false, ea := true }, ctrl := { u := { u := '011'B, p_f := true, u2 := '00'B, spare := '11'B } }, len := 0, m := false, el := 1, payload := ''O, padding := '2B2B2B2B2B2B2B2B2B2B2B2B2B2B2B2B2B2B'O (\"++++++++++++++++++\") } } }" BTS_Tests_LAPDm.ttcn:1490 BTS_Tests_LAPDm control part BTS_Tests_LAPDm.ttcn:1093 TC_segm_concat_sacch testcase </failure> </testcase> <testcase classname='BTS_Tests_LAPDm:hopping' name='TC_t200_n200' time='39.851576'> <failure type='fail-verdict'>Missing RSL RLL ERROR INDICATION BTS_Tests_LAPDm.ttcn:1491 BTS_Tests_LAPDm control part BTS_Tests_LAPDm.ttcn:1182 TC_t200_n200 testcase </failure> </testcase> <testcase classname='BTS_Tests_LAPDm:hopping' name='TC_rr_response_frame_loss' time='6.696472'> <failure type='fail-verdict'>Timeout waiting for RR or REJ BTS_Tests_LAPDm.ttcn:1492 BTS_Tests_LAPDm control part BTS_Tests_LAPDm.ttcn:1239 TC_rr_response_frame_loss testcase </failure> </testcase> <testcase classname='BTS_Tests_LAPDm:hopping' name='TC_incorrect_cr' time='15.798639'/> <testcase classname='BTS_Tests_LAPDm:hopping' name='TC_sabm_incorrect_c' time='23.314936'> <failure type='fail-verdict'>"BTS_Tests.ttcn:732 : Tguard timeout" BTS_Tests_LAPDm.ttcn:1494 BTS_Tests_LAPDm control part BTS_Tests_LAPDm.ttcn:1341 TC_sabm_incorrect_c testcase </failure> </testcase> <testcase classname='BTS_Tests_LAPDm:hopping' name='TC_normal_reestablishment' time='16.122836'> <failure type='fail-verdict'>"BTS_Tests_LAPDm.ttcn:1023 : received unexpected LAPDm { sacch := false, sapi := 0, lapdm := { ab := { addr := { spare := '0'B, lpd := 0, sapi := 0, c_r := false, ea := true }, ctrl := { u := { u := '011'B, p_f := true, u2 := '00'B, spare := '11'B } }, len := 5, m := false, el := 1, payload := 'C3A513771C'O, padding := '2B2B2B2B2B2B2B2B2B2B2B2B2B2B2B'O (\"+++++++++++++++\") } } }" BTS_Tests_LAPDm.ttcn:1495 BTS_Tests_LAPDm control part BTS_Tests_LAPDm.ttcn:1403 TC_normal_reestablishment testcase </failure> </testcase> <testcase classname='BTS_Tests_LAPDm:hopping' name='TC_normal_reestablishment_state_unacked' time='12.363489'> <failure type='fail-verdict'>"BTS_Tests_LAPDm.ttcn:1023 : received unexpected LAPDm { sacch := false, sapi := 0, lapdm := { ab := { addr := { spare := '0'B, lpd := 0, sapi := 0, c_r := false, ea := true }, ctrl := { s := { n_r := 1, p_f := false, s := '10'B, spare := '01'B } }, len := 0, m := false, el := 1, payload := ''O, padding := '2B2B2B2B2B2B2B2B2B2B2B2B2B2B2B2B2B2B2B2B'O (\"++++++++++++++++++++\") } } }" BTS_Tests_LAPDm.ttcn:1496 BTS_Tests_LAPDm control part BTS_Tests_LAPDm.ttcn:1470 TC_normal_reestablishment_state_unacked testcase </failure> </testcase> <testcase classname='BTS_Tests_VAMOS:hopping' name='TC_vamos_chan_act_vff' time='2.507948'/> <testcase classname='BTS_Tests_VAMOS:hopping' name='TC_vamos_chan_act_vhh' time='2.570512'/> <testcase classname='BTS_Tests_VAMOS:hopping' name='TC_vamos_chan_act_hvhh' time='2.596853'/> <testcase classname='BTS_Tests_VAMOS:hopping' name='TC_vamos_chan_act_dyn_ipa_vff' time='2.556073'/> <testcase classname='BTS_Tests_VAMOS:hopping' name='TC_vamos_chan_act_dyn_osmo_vff' time='2.552723'/> <testcase classname='BTS_Tests_VAMOS:hopping' name='TC_vamos_chan_act_dyn_osmo_vhh' time='2.605013'/> <testcase classname='BTS_Tests_VAMOS:hopping' name='TC_vamos_chan_act_dyn_osmo_hvhh' time='2.558373'/> <testcase classname='BTS_Tests_VAMOS:hopping' name='TC_vamos_chan_mode_modify_vff' time='1.353136'/> <testcase classname='BTS_Tests_VAMOS:hopping' name='TC_vamos_chan_mode_modify_vhh' time='1.343980'/> <testcase classname='BTS_Tests_VAMOS:hopping' name='TC_vamos_chan_mode_modify_hvhh' time='1.370663'/> <testcase classname='BTS_Tests_VAMOS:hopping' name='TC_vamos_chan_mode_modify_dyn_ipa_vff' time='1.312874'/> <testcase classname='BTS_Tests_VAMOS:hopping' name='TC_vamos_chan_mode_modify_dyn_osmo_vff' time='1.359758'/> <testcase classname='BTS_Tests_VAMOS:hopping' name='TC_vamos_chan_mode_modify_dyn_osmo_vhh' time='1.373840'/> <testcase classname='BTS_Tests_VAMOS:hopping' name='TC_vamos_chan_mode_modify_dyn_osmo_hvhh' time='1.406952'/> <testcase classname='BTS_Tests_ASCI:hopping' name='TC_vbs_notification' time='4.665799'/> <testcase classname='BTS_Tests_ASCI:hopping' name='TC_vgcs_uplink_free_and_busy' time='1.828415'/> <testcase classname='BTS_Tests_ASCI:hopping' name='TC_vgcs_talker_fail' time='16.564002'/> <testcase classname='BTS_Tests_ASCI:hopping' name='TC_vgcs_talker_est_rel' time='1.430531'/> <testcase classname='BTS_Tests_ASCI:hopping' name='TC_vgcs_listener_det' time='3.378516'/> </testsuite> <?xml version="1.0"?> <testsuite name='Titan' tests='17' failures='0' errors='0' skipped='0' inconc='0' time='96.00'> <testcase classname='BTS_Tests_OML' name='TC_wrong_mdisc' time='10.801116'/> <testcase classname='BTS_Tests_OML' name='TC_wrong_msgtype' time='0.713144'/> <testcase classname='BTS_Tests_OML' name='TC_short_length' time='0.734492'/> <testcase classname='BTS_Tests_OML' name='TC_long_length' time='0.735724'/> <testcase classname='BTS_Tests_OML' name='TC_wrong_placement' time='0.685059'/> <testcase classname='BTS_Tests_OML' name='TC_wrong_seq' time='0.715781'/> <testcase classname='BTS_Tests_OML' name='TC_wrong_obj_class' time='0.678666'/> <testcase classname='BTS_Tests_OML' name='TC_wrong_bts_nr' time='0.694581'/> <testcase classname='BTS_Tests_OML' name='TC_wrong_trx_nr' time='0.726992'/> <testcase classname='BTS_Tests_OML' name='TC_radio_carrier_opstart_noattr' time='0.688302'/> <testcase classname='BTS_Tests_OML' name='TC_bts_opstart' time='0.713138'/> <testcase classname='BTS_Tests_OML' name='TC_bts_opstart_noattr' time='0.721712'/> <testcase classname='BTS_Tests_OML' name='TC_ts_opstart' time='0.702979'/> <testcase classname='BTS_Tests_OML' name='TC_ts_opstart_noattr' time='0.680584'/> <testcase classname='BTS_Tests_OML' name='TC_initial_state_reports' time='0.671856'/> <testcase classname='BTS_Tests_OML' name='TC_ipa_osmo_pcu_anr_fwd' time='0.704370'/> <testcase classname='BTS_Tests_OML' name='TC_ipa_rsl_connect_nack' time='0.678657'/> </testsuite> + check_respawn_count + set +x [0;31m ================================================================ WARNING: osmo-bts was respawned 4 times (expected: 3)! (OS#6794) ================================================================ [0m+ RC=1 + uptime + grep --color=always -o load.* [01;31m[Kload average: 1.73, 2.60, 2.51[m[K + exit 1 Build step 'Execute shell' marked build as failure Recording test results [Checks API] No suitable checks publisher found.
1
3
0
0
Build failed in Jenkins: master-osmo_dia2gsup » a1=default,a2=default,a3=default,a4=default,osmocom-master #1095
by jenkins@lists.osmocom.org
04 Sep '26
04 Sep '26
See <
https://jenkins.osmocom.org/jenkins/job/master-osmo_dia2gsup/a1=default,a2=…
> Changes: ------------------------------------------ Started by upstream project "master-osmo_dia2gsup" build number 1095 originally caused by: Started by timer Running as SYSTEM Building remotely on build4-deb12build-ansible (ttcn3 obs osmo-gsm-tester-build qemu io_uring linux-shallow-clone osmocom-gerrit coverity osmocom-master) in workspace <
https://jenkins.osmocom.org/jenkins/job/master-osmo_dia2gsup/a1=default,a2=…
> [ssh-agent] Looking for ssh-agent implementation... $ ssh-agent SSH_AUTH_SOCK=/tmp/ssh-9PGjiMihryN9/agent.1122537 SSH_AGENT_PID=1122541 [ssh-agent] Started. Running ssh-add (command line suppressed) [ssh-agent] Using credentials docs (OS#5798) The recommended git tool is: NONE No credentials specified Cloning the remote Git repository Cloning repository
https://gerrit.osmocom.org/erlang/osmo_dia2gsup
> git init <
https://jenkins.osmocom.org/jenkins/job/master-osmo_dia2gsup/a1=default,a2=…
> # timeout=10 Fetching upstream changes from
https://gerrit.osmocom.org/erlang/osmo_dia2gsup
> git --version # timeout=10 > git --version # 'git version 2.39.5' > git fetch --tags --force --progress --
https://gerrit.osmocom.org/erlang/osmo_dia2gsup
+refs/heads/*:refs/remotes/origin/* # timeout=10 > git config remote.origin.url
https://gerrit.osmocom.org/erlang/osmo_dia2gsup
# timeout=10 > git config --add remote.origin.fetch +refs/heads/*:refs/remotes/origin/* # timeout=10 Avoid second fetch Checking out Revision 63c6606d70a29fe56680185348764ce76c4aa2bf (origin/master) > git config core.sparsecheckout # timeout=10 > git checkout -f 63c6606d70a29fe56680185348764ce76c4aa2bf # timeout=10 Commit message: "Set Item-Number in UTRAN and GERAN vectors." > git rev-list --no-walk 63c6606d70a29fe56680185348764ce76c4aa2bf # timeout=10 [osmocom-master] $ /bin/sh -xe /tmp/jenkins5211934736230357652.sh + readlink -f /tmp/ssh-9PGjiMihryN9/agent.1122537 + docker run --rm=true --cap-add SYS_PTRACE --security-opt seccomp=/home/osmocom-build/osmo-ci/_docker_playground/seccomp_profile.json --ulimit fsize=1000000000 -e ASCIIDOC_WARNINGS_CHECK=1 -e CFLAGS=-g -e HOME=/build -e IS_MASTER_BUILD=1 -e JOB_NAME=master-osmo_dia2gsup/a1=default,a2=default,a3=default,a4=default,label=osmocom-master -e MAKE=make -e OSMOPY_DEBUG_TCP_SOCKETS=1 -e OSMO_GSM_MANUALS_DIR=/opt/osmo-gsm-manuals -e PARALLEL_MAKE=-j 12 -e PUBLISH=1 -e SSH_AUTH_SOCK=/ssh-agent -e WITH_MANUALS=1 -w /build -i -u build -v /tmp/ssh-9PGjiMihryN9/agent.1122537:/ssh-agent -v /home/osmocom-build/osmo-ci:/osmo-ci:ro -v <
https://jenkins.osmocom.org/jenkins/job/master-osmo_dia2gsup/a1=default,a2=…
>:/build -v /home/osmocom-build/.ssh:/home/build/.ssh:ro osmocom-build/debian-bookworm-erlang /usr/bin/timeout 30m /build/contrib/jenkins.sh + rebar3 compile ===> Fetching rebar3_diameter_compiler (from {git,"
https://github.com/carlosedp/rebar3_diameter_compiler.git
", {tag,"0.8.0"}}) ===> Errors loading plugin {rebar3_diameter_compiler, {git, "
https://github.com/carlosedp/rebar3_diameter_compiler.git
", {tag,"0.8.0"}}}. Run rebar3 with DEBUG=1 set to see errors. ===> Fetching rebar3_diameter_compiler (from {git,"
https://github.com/carlosedp/rebar3_diameter_compiler.git
", {tag,"0.8.0"}}) ===> Errors loading plugin {rebar3_diameter_compiler, {git, "
https://github.com/carlosedp/rebar3_diameter_compiler.git
", {tag,"0.8.0"}}}. Run rebar3 with DEBUG=1 set to see errors. ===> Verifying dependencies... ===> Fetching lager (from {git,"
https://github.com/erlang-lager/lager
", {ref,"459a3b2cdd9eadd29e5a7ce5c43932f5ccd6eb88"}}) ===> Failed to fetch and copy dep: {git,"
https://github.com/erlang-lager/lager
", {ref, "459a3b2cdd9eadd29e5a7ce5c43932f5ccd6eb88"}} Build step 'Execute shell' marked build as failure $ ssh-agent -k unset SSH_AUTH_SOCK; unset SSH_AGENT_PID; echo Agent pid 1122541 killed; [ssh-agent] Stopped. Archiving artifacts
1
1
0
0
Build failed in Jenkins: master-pyosmocom » pysim,a1=default,a3=default,a4=default,simtester #774
by jenkins@lists.osmocom.org
04 Sep '26
04 Sep '26
See <
https://jenkins.osmocom.org/jenkins/job/master-pyosmocom/JOB_TYPE=pysim,a1=…
> Changes: ------------------------------------------ Started by upstream project "master-pyosmocom" build number 774 originally caused by: Started by timer Running as SYSTEM Building remotely on simtester in workspace <
https://jenkins.osmocom.org/jenkins/job/master-pyosmocom/JOB_TYPE=pysim,a1=…
> [ssh-agent] Looking for ssh-agent implementation... $ ssh-agent SSH_AUTH_SOCK=/tmp/ssh-xKzKtOOQDbpk/agent.3365885 SSH_AGENT_PID=3365889 [ssh-agent] Started. Running ssh-add (command line suppressed) [ssh-agent] Using credentials docs (OS#5798) The recommended git tool is: NONE No credentials specified Cloning the remote Git repository Cloning repository
https://gerrit.osmocom.org/python/pyosmocom
> git init <
https://jenkins.osmocom.org/jenkins/job/master-pyosmocom/JOB_TYPE=pysim,a1=…
> # timeout=10 Fetching upstream changes from
https://gerrit.osmocom.org/python/pyosmocom
> git --version # timeout=10 > git --version # 'git version 2.39.5' > git fetch --tags --force --progress --
https://gerrit.osmocom.org/python/pyosmocom
+refs/heads/*:refs/remotes/origin/* # timeout=10 > git config remote.origin.url
https://gerrit.osmocom.org/python/pyosmocom
# timeout=10 > git config --add remote.origin.fetch +refs/heads/*:refs/remotes/origin/* # timeout=10 Avoid second fetch Checking out Revision e1701b243335277b5214619e3edbbcb7099ccecf (origin/master) > git config core.sparsecheckout # timeout=10 > git checkout -f e1701b243335277b5214619e3edbbcb7099ccecf # timeout=10 Commit message: "gsmtap: Update repo link from cgit to gitea/forgejo" > git rev-list --no-walk e1701b243335277b5214619e3edbbcb7099ccecf # timeout=10 [simtester] $ /bin/sh -xe /tmp/jenkins12587627755798724482.sh + /usr/bin/timeout 30m ./contrib/jenkins.sh + export PYTHONUNBUFFERED=1 + osmo-clean-workspace.sh + chmod -R +w . + git checkout -f HEAD + git clean -dxf + [ -d ] + [ -d layer1-headers ] + virtualenv -p python3 venv --system-site-packages created virtual environment CPython3.11.2.final.0-64 in 1007ms creator CPython3Posix(dest=<
https://jenkins.osmocom.org/jenkins/job/master-pyosmocom/JOB_TYPE=pysim,a1=…
,> clear=False, no_vcs_ignore=False, global=True) seeder FromAppData(download=False, pip=bundle, setuptools=bundle, wheel=bundle, via=copy, app_data_dir=/home/jenkins/.local/share/virtualenv) added seed packages: pip==23.0.1, setuptools==66.1.1, wheel==0.38.4 activators BashActivator,CShellActivator,FishActivator,NushellActivator,PowerShellActivator,PythonActivator + . venv/bin/activate + [ = ./contrib/jenkins.sh ] + deactivate nondestructive + unset -f pydoc + [ -z ] + [ -z ] + hash -r + [ -z ] + unset VIRTUAL_ENV + [ ! nondestructive = nondestructive ] + VIRTUAL_ENV=<
https://jenkins.osmocom.org/jenkins/job/master-pyosmocom/JOB_TYPE=pysim,a1=…
> + [ = cygwin ] + [ = msys ] + export VIRTUAL_ENV + _OLD_VIRTUAL_PATH=/usr/local/bin:/usr/bin:/bin:/usr/games:/home/jenkins/bin + PATH=<
https://jenkins.osmocom.org/jenkins/job/master-pyosmocom/JOB_TYPE=pysim,a1=…
>:/usr/local/bin:/usr/bin:/bin:/usr/games:/home/jenkins/bin + export PATH + [ -z ] + [ -z ] + _OLD_VIRTUAL_PS1=$ + [ x != x ] + basename <
https://jenkins.osmocom.org/jenkins/job/master-pyosmocom/JOB_TYPE=pysim,a1=…
> + PS1=(venv) $ + export PS1 + alias pydoc + true + hash -r + pip install . --force-reinstall Processing <
https://jenkins.osmocom.org/jenkins/job/master-pyosmocom/JOB_TYPE=pysim,a1=…
> Installing build dependencies: started Installing build dependencies: finished with status 'done' Getting requirements to build wheel: started Getting requirements to build wheel: finished with status 'done' Preparing metadata (pyproject.toml): started Preparing metadata (pyproject.toml): finished with status 'done' Collecting gsm0338 Using cached gsm0338-1.1.0-py3-none-any.whl (5.8 kB) Collecting construct>=2.9.51 Using cached construct-2.10.70-py3-none-any.whl (63 kB) Building wheels for collected packages: pyosmocom Building wheel for pyosmocom (pyproject.toml): started Building wheel for pyosmocom (pyproject.toml): finished with status 'done' Created wheel for pyosmocom: filename=pyosmocom-0.0.12-py3-none-any.whl size=32859 sha256=a65c4600912ba016b18f0b3b82a9f6a2658a6bb399bc186b97063fd28aace891 Stored in directory: /tmp/pip-ephem-wheel-cache-hnkreh83/wheels/2b/78/54/84ef5e6ef7a735f27ca03ef3a96141c193c6b67fbf76f56730 Successfully built pyosmocom Installing collected packages: gsm0338, construct, pyosmocom Successfully installed construct-2.10.70 gsm0338-1.1.0 pyosmocom-0.0.12 + deactivate + unset -f pydoc + [ -z _ ] + PATH=/usr/local/bin:/usr/bin:/bin:/usr/games:/home/jenkins/bin + export PATH + unset _OLD_VIRTUAL_PATH + [ -z ] + hash -r + [ -z _ ] + PS1=$ + export PS1 + unset _OLD_VIRTUAL_PS1 + unset VIRTUAL_ENV + [ ! = nondestructive ] + unset -f deactivate + rm -rf pysim + git clone
https://gerrit.osmocom.org/pysim
--depth=1 --branch=master Cloning into 'pysim'... + cd pysim + sed -i /^pyosmocom>=.*/d requirements.txt + grep -q pyosmocom requirements.txt + ln -s ../venv . + SKIP_CLEAN_WORKSPACE=1 JOB_TYPE=test contrib/jenkins.sh + export PYTHONUNBUFFERED=1 + [ ! -d ./tests/ ] + [ -z 1 ] + setup_venv + virtualenv -p python3 venv --system-site-packages created virtual environment CPython3.11.2.final.0-64 in 1506ms creator CPython3Posix(dest=<
https://jenkins.osmocom.org/jenkins/job/master-pyosmocom/JOB_TYPE=pysim,a1=…
,> clear=False, no_vcs_ignore=False, global=True) seeder FromAppData(download=False, pip=bundle, setuptools=bundle, wheel=bundle, via=copy, app_data_dir=/home/jenkins/.local/share/virtualenv) added seed packages: construct==2.10.70, gsm0338==1.1.0, pip==23.0.1, pyosmocom==0.0.12, setuptools==66.1.1, wheel==0.38.4 activators BashActivator,CShellActivator,FishActivator,NushellActivator,PowerShellActivator,PythonActivator + . venv/bin/activate + [ = contrib/jenkins.sh ] + deactivate nondestructive + unset -f pydoc + [ -z ] + [ -z ] + hash -r + [ -z ] + unset VIRTUAL_ENV + [ ! nondestructive = nondestructive ] + VIRTUAL_ENV=<
https://jenkins.osmocom.org/jenkins/job/master-pyosmocom/JOB_TYPE=pysim,a1=…
> + [ = cygwin ] + [ = msys ] + export VIRTUAL_ENV + _OLD_VIRTUAL_PATH=/usr/local/bin:/usr/bin:/bin:/usr/games:/home/jenkins/bin + PATH=<
https://jenkins.osmocom.org/jenkins/job/master-pyosmocom/JOB_TYPE=pysim,a1=…
>:/usr/local/bin:/usr/bin:/bin:/usr/games:/home/jenkins/bin + export PATH + [ -z ] + [ -z ] + _OLD_VIRTUAL_PS1=$ + [ x != x ] + basename <
https://jenkins.osmocom.org/jenkins/job/master-pyosmocom/JOB_TYPE=pysim,a1=…
> + PS1=(venv) $ + export PS1 + alias pydoc + true + hash -r + pip install -r requirements.txt Collecting
git+https://github.com/osmocom/asn1tools
(from -r requirements.txt (line 13)) Cloning
https://github.com/osmocom/asn1tools
to /tmp/pip-req-build-7rhbk1la Running command git clone --filter=blob:none --quiet
https://github.com/osmocom/asn1tools
/tmp/pip-req-build-7rhbk1la fatal: could not read Username for '
https://github.com
': No such device or address fatal: expected flush after ref listing error: subprocess-exited-with-error × git clone --filter=blob:none --quiet
https://github.com/osmocom/asn1tools
/tmp/pip-req-build-7rhbk1la did not run successfully. │ exit code: 128 ╰─> See above for output. note: This error originates from a subprocess, and is likely not a problem with pip. error: subprocess-exited-with-error × git clone --filter=blob:none --quiet
https://github.com/osmocom/asn1tools
/tmp/pip-req-build-7rhbk1la did not run successfully. │ exit code: 128 ╰─> See above for output. note: This error originates from a subprocess, and is likely not a problem with pip. Build step 'Execute shell' marked build as failure $ ssh-agent -k unset SSH_AUTH_SOCK; unset SSH_AGENT_PID; echo Agent pid 3365889 killed; [ssh-agent] Stopped. Archiving artifacts
1
1
0
0
← Newer
1
2
3
4
5
6
7
8
...
670
Older →
Jump to page:
1
2
3
4
5
6
7
8
9
10
11
12
13
14
15
16
17
18
19
20
21
22
23
24
25
26
27
28
29
30
31
32
33
34
35
36
37
38
39
40
41
42
43
44
45
46
47
48
49
50
51
52
53
54
55
56
57
58
59
60
61
62
63
64
65
66
67
68
69
70
71
72
73
74
75
76
77
78
79
80
81
82
83
84
85
86
87
88
89
90
91
92
93
94
95
96
97
98
99
100
101
102
103
104
105
106
107
108
109
110
111
112
113
114
115
116
117
118
119
120
121
122
123
124
125
126
127
128
129
130
131
132
133
134
135
136
137
138
139
140
141
142
143
144
145
146
147
148
149
150
151
152
153
154
155
156
157
158
159
160
161
162
163
164
165
166
167
168
169
170
171
172
173
174
175
176
177
178
179
180
181
182
183
184
185
186
187
188
189
190
191
192
193
194
195
196
197
198
199
200
201
202
203
204
205
206
207
208
209
210
211
212
213
214
215
216
217
218
219
220
221
222
223
224
225
226
227
228
229
230
231
232
233
234
235
236
237
238
239
240
241
242
243
244
245
246
247
248
249
250
251
252
253
254
255
256
257
258
259
260
261
262
263
264
265
266
267
268
269
270
271
272
273
274
275
276
277
278
279
280
281
282
283
284
285
286
287
288
289
290
291
292
293
294
295
296
297
298
299
300
301
302
303
304
305
306
307
308
309
310
311
312
313
314
315
316
317
318
319
320
321
322
323
324
325
326
327
328
329
330
331
332
333
334
335
336
337
338
339
340
341
342
343
344
345
346
347
348
349
350
351
352
353
354
355
356
357
358
359
360
361
362
363
364
365
366
367
368
369
370
371
372
373
374
375
376
377
378
379
380
381
382
383
384
385
386
387
388
389
390
391
392
393
394
395
396
397
398
399
400
401
402
403
404
405
406
407
408
409
410
411
412
413
414
415
416
417
418
419
420
421
422
423
424
425
426
427
428
429
430
431
432
433
434
435
436
437
438
439
440
441
442
443
444
445
446
447
448
449
450
451
452
453
454
455
456
457
458
459
460
461
462
463
464
465
466
467
468
469
470
471
472
473
474
475
476
477
478
479
480
481
482
483
484
485
486
487
488
489
490
491
492
493
494
495
496
497
498
499
500
501
502
503
504
505
506
507
508
509
510
511
512
513
514
515
516
517
518
519
520
521
522
523
524
525
526
527
528
529
530
531
532
533
534
535
536
537
538
539
540
541
542
543
544
545
546
547
548
549
550
551
552
553
554
555
556
557
558
559
560
561
562
563
564
565
566
567
568
569
570
571
572
573
574
575
576
577
578
579
580
581
582
583
584
585
586
587
588
589
590
591
592
593
594
595
596
597
598
599
600
601
602
603
604
605
606
607
608
609
610
611
612
613
614
615
616
617
618
619
620
621
622
623
624
625
626
627
628
629
630
631
632
633
634
635
636
637
638
639
640
641
642
643
644
645
646
647
648
649
650
651
652
653
654
655
656
657
658
659
660
661
662
663
664
665
666
667
668
669
670
Results per page:
10
25
50
100
200