lists.osmocom.org
Sign In
Sign Up
Sign In
Sign Up
Manage this list
×
Keyboard Shortcuts
Thread View
j
: Next unread message
k
: Previous unread message
j a
: Jump to all threads
j l
: Jump to MailingList overview
2026
October
September
August
July
June
May
April
March
February
January
2025
December
November
October
September
August
July
June
May
April
March
February
January
2024
December
November
October
September
August
July
June
May
April
March
February
January
2023
December
November
October
September
August
July
June
May
April
March
February
January
2022
December
November
October
September
August
July
June
May
April
March
February
January
2021
December
November
October
September
August
July
June
May
April
March
February
January
2020
December
November
October
September
August
July
June
May
April
March
February
January
2019
December
November
October
September
August
July
June
May
April
March
List overview
Download
jenkins-notifications
October 2026
----- 2026 -----
October 2026
September 2026
August 2026
July 2026
June 2026
May 2026
April 2026
March 2026
February 2026
January 2026
----- 2025 -----
December 2025
November 2025
October 2025
September 2025
August 2025
July 2025
June 2025
May 2025
April 2025
March 2025
February 2025
January 2025
----- 2024 -----
December 2024
November 2024
October 2024
September 2024
August 2024
July 2024
June 2024
May 2024
April 2024
March 2024
February 2024
January 2024
----- 2023 -----
December 2023
November 2023
October 2023
September 2023
August 2023
July 2023
June 2023
May 2023
April 2023
March 2023
February 2023
January 2023
----- 2022 -----
December 2022
November 2022
October 2022
September 2022
August 2022
July 2022
June 2022
May 2022
April 2022
March 2022
February 2022
January 2022
----- 2021 -----
December 2021
November 2021
October 2021
September 2021
August 2021
July 2021
June 2021
May 2021
April 2021
March 2021
February 2021
January 2021
----- 2020 -----
December 2020
November 2020
October 2020
September 2020
August 2020
July 2020
June 2020
May 2020
April 2020
March 2020
February 2020
January 2020
----- 2019 -----
December 2019
November 2019
October 2019
September 2019
August 2019
July 2019
June 2019
May 2019
April 2019
March 2019
jenkins-notifications@lists.osmocom.org
1 participants
37 discussions
Start a n
N
ew thread
Build failed in Jenkins: Osmocom_OBS_sync #1174
by jenkins@lists.osmocom.org
09 Oct '26
09 Oct '26
See <
https://jenkins.osmocom.org/jenkins/job/Osmocom_OBS_sync/1174/display/redir…
> Changes: [Vadim Yanitskiy] scripts/osmocom-api-doxygen.sh: fix upliading libosmo-trx docs [Vadim Yanitskiy] scripts/osmocom-api-doxygen.sh: upload doxygen output only ------------------------------------------ Started by timer Running as SYSTEM Building remotely on build4-deb12build-ansible (ttcn3 obs osmo-gsm-tester-build qemu io_uring linux-shallow-clone osmocom-gerrit coverity osmocom-master) in workspace <
https://jenkins.osmocom.org/jenkins/job/Osmocom_OBS_sync/ws/
> The recommended git tool is: NONE No credentials specified Wiping out workspace first. Cloning the remote Git repository Cloning repository
https://gerrit.osmocom.org/osmo-ci
> git init <
https://jenkins.osmocom.org/jenkins/job/Osmocom_OBS_sync/ws/
> # timeout=10 Fetching upstream changes from
https://gerrit.osmocom.org/osmo-ci
> git --version # timeout=10 > git --version # 'git version 2.39.5' > git fetch --tags --force --progress --
https://gerrit.osmocom.org/osmo-ci
+refs/heads/*:refs/remotes/origin/* # timeout=10 > git config remote.origin.url
https://gerrit.osmocom.org/osmo-ci
# timeout=10 > git config --add remote.origin.fetch +refs/heads/*:refs/remotes/origin/* # timeout=10 Avoid second fetch > git rev-parse origin/master^{commit} # timeout=10 Checking out Revision 62b22c7bbb79c768b30863856bf29f3722838e00 (origin/master) > git config core.sparsecheckout # timeout=10 > git checkout -f 62b22c7bbb79c768b30863856bf29f3722838e00 # timeout=10 Commit message: "scripts/osmocom-api-doxygen.sh: upload doxygen output only" > git rev-list --no-walk 33ba77c5b52617966b497b127c3ea373fe4cead1 # timeout=10 [Osmocom_OBS_sync] $ /bin/sh -xe /tmp/jenkins11181923471213082120.sh + export PYTHONUNBUFFERED=1 + export DISTROS= AlmaLinux:8 Debian:10 Debian:11 Debian:12 Debian:13 Debian:Next Raspbian:10 Raspbian:11 Raspbian:12 Raspbian:13 Ubuntu:22.04 Ubuntu:24.04 Ubuntu:25.04 Ubuntu:25.10 Ubuntu:26.04 + ./scripts/obs/sync_obs_projects.py --docker AlmaLinux:8 Debian:10 Debian:11 Debian:12 Debian:13 Debian:Next Raspbian:10 Raspbian:11 Raspbian:12 Raspbian:13 Ubuntu:22.04 Ubuntu:24.04 Ubuntu:25.04 Ubuntu:25.10 Ubuntu:26.04 docker: building image debian-13-osmocom-obs-build-srcpkg + run_in_docker_and_exit(): ['docker', 'build', '--build-arg', 'DISTRO=debian:13', '--build-arg', 'DISTRO_FROM=debian:trixie', '--build-arg', 'UID=1000', '-t', 'debian-13-osmocom-obs-build-srcpkg', '-f', '<
https://jenkins.osmocom.org/jenkins/job/Osmocom_OBS_sync/ws/scripts/obs/dat…
',> '<
https://jenkins.osmocom.org/jenkins/job/Osmocom_OBS_sync/ws/scripts/obs/data
']> #0 building with "default" instance using docker driver #1 [internal] load build definition from build_srcpkg.Dockerfile #1 transferring dockerfile: 1.48kB done #1 DONE 0.1s #2 [internal] load metadata for docker.io/library/debian:trixie #2 DONE 0.0s #3 [internal] load .dockerignore #3 transferring context: 2B done #3 DONE 0.1s #4 [1/4] FROM docker.io/library/debian:trixie #4 DONE 0.0s #5 [2/4] RUN APT-GET update && apt-get upgrade -y && apt-get install -y --no-install-recommends ca-certificates colordiff debhelper default-libmysqlclient-dev dh-cmake dh-python dh-runit dh-virtualenv dpkg-dev erlang-nox fakeroot git git-review gnupg2 libxml2-utils lsb-release meson osc pkgconf python3-packaging python3-pip python3-setuptools quilt sed sphinx-common wget && apt-get clean #5 CACHED #6 [3/4] RUN WGET
https://github.com/erlang/rebar3/releases/download/3.24.0/rebar3
-O /usr/bin/rebar3 && echo "d2d31cfb98904b8e4917300a75f870de12cb5167cd6214d1043e973a56668a54 /usr/bin/rebar3" | sha256sum -c && chmod +x /usr/bin/rebar3 && rebar3 --version #6 CACHED #7 [4/4] RUN USERADD --uid=1000 -m user #7 CACHED #8 exporting to image #8 exporting layers done #8 writing image sha256:e29bab0f17b4145d0cf6399eb81db96c9a470754a9c7214e9c1c2a3357034680 0.0s done #8 naming to docker.io/library/debian-13-osmocom-obs-build-srcpkg 0.0s done #8 DONE 0.1s [33m1 warning found (use docker --debug to expand): [0m - InvalidDefaultArgInFrom: Default value for ARG ${DISTRO_FROM} results in empty or invalid base image name (line 3) docker: running: sync_obs_projects.py inside docker OBS: getting list of projects (
https://obs.osmocom.org
) AlmaLinux:8: getting prjconf AlmaLinux:8: getting meta openSUSE.org-mirror:AlmaLinux:8: getting prjconf openSUSE.org-mirror:AlmaLinux:8: is up-to-date Debian:10: getting prjconf Debian:10: getting meta ERROR: command failed unexpectedly *** command *** ['osc', '-A', '
https://api.opensuse.org
', 'meta', 'prj', 'Debian:10'] *** returncode *** 1 *** output *** Server returned an error: HTTP Error 503: Service Unavailable Request:
https://api.opensuse.org/source/Debian:10/_meta
Headers: date: Thu, 08 Oct 2026 18:32:07 GMT server: Apache strict-transport-security: max-age=31536000 cache-control: no-cache content-type: text/xml transfer-encoding: chunked *** python trace *** Traceback (most recent call last): File "/obs/sync_obs_projects.py", line 382, in <module> main() ~~~~^^ File "/obs/sync_obs_projects.py", line 359, in main lib.osc.get_meta(temp_source_meta) ~~~~~~~~~~~~~~~~^^^^^^^^^^^^^^^^^^ File "/obs/lib/osc.py", line 196, in get_meta meta = lib.osc.run_osc(["meta", "prj", proj]).output ~~~~~~~~~~~~~~~^^^^^^^^^^^^^^^^^^^^^^^ File "/obs/lib/osc.py", line 58, in run_osc return lib.run_cmd(cmd, *args, **kwargs) ~~~~~~~~~~~^^^^^^^^^^^^^^^^^^^^^^ File "/obs/lib/__init__.py", line 202, in run_cmd exit_error_cmd(p, "command failed unexpectedly") ~~~~~~~~~~~~~~^^^^^^^^^^^^^^^^^^^^^^^^^^^^^^^^^^ File "/obs/lib/__init__.py", line 163, in exit_error_cmd raise RuntimeError("shell command related error, find details right above" " this python trace") RuntimeError: shell command related error, find details right above this python trace Build step 'Execute shell' marked build as failure
1
1
0
0
Build failed in Jenkins: ttcn3-ns-test-sgsn-sns #1861
by jenkins@lists.osmocom.org
08 Oct '26
08 Oct '26
See <
https://jenkins.osmocom.org/jenkins/job/ttcn3-ns-test-sgsn-sns/1861/display…
> Changes: [Oliver Smith] testenv: podman: always mount osmo-dev dir [Oliver Smith] testenv: run osmo-dev logic for --binary-repo too [Oliver Smith] testenv: cmd: init_env: split up by envtype [Oliver Smith] testenv: build package=no components with osmo-dev [Oliver Smith] bts: use osmo-dev to build osmo-trx-proxy, trxcon ------------------------------------------ Started by timer Running as SYSTEM Building remotely on build4-deb12build-ansible (ttcn3 obs osmo-gsm-tester-build qemu io_uring linux-shallow-clone osmocom-gerrit coverity osmocom-master) in workspace <
https://jenkins.osmocom.org/jenkins/job/ttcn3-ns-test-sgsn-sns/ws/
> The recommended git tool is: NONE No credentials specified Cloning the remote Git repository Cloning repository
https://gerrit.osmocom.org/osmo-ttcn3-hacks
> git init <
https://jenkins.osmocom.org/jenkins/job/ttcn3-ns-test-sgsn-sns/ws/src/osmo-…
> # timeout=10 Fetching upstream changes from
https://gerrit.osmocom.org/osmo-ttcn3-hacks
> git --version # timeout=10 > git --version # 'git version 2.39.5' > git fetch --tags --force --progress --
https://gerrit.osmocom.org/osmo-ttcn3-hacks
+refs/heads/*:refs/remotes/origin/* # timeout=10 > git config remote.origin.url
https://gerrit.osmocom.org/osmo-ttcn3-hacks
# timeout=10 > git config --add remote.origin.fetch +refs/heads/*:refs/remotes/origin/* # timeout=10 Avoid second fetch > git rev-parse origin/master^{commit} # timeout=10 Checking out Revision e48c4f51701bcd10519875d007b10b7c1f7eac5a (origin/master) > git config core.sparsecheckout # timeout=10 > git checkout -f e48c4f51701bcd10519875d007b10b7c1f7eac5a # timeout=10 Commit message: "bts: use osmo-dev to build osmo-trx-proxy, trxcon" > git rev-list --no-walk 26d06400905af7489a5115a303ff7fb512aefac9 # timeout=10 Copied 1 artifact from "build-kernel-none" build number 1 [ttcn3-ns-test-sgsn-sns] $ /bin/sh -xe /tmp/jenkins10352519789197622438.sh + DISTRO=debian:trixie + echo debian:trixie + tr : - +
IMAGE=registry.osmocom.org/osmocom-build/debian-trixie-osmo-ttcn3-testenv
+ KERNEL=none + echo False + tr [:upper:] [:lower:] + INIT_OSMO_DEV=false + podman pull
registry.osmocom.org/osmocom-build/debian-trixie-osmo-ttcn3-testenv
Trying to pull
registry.osmocom.org/osmocom-build/debian-trixie-osmo-ttcn3-testenv:latest
... Getting image source signatures Copying blob sha256:7fa13ad30526db36a65dae4fb3e12004c819bc9e992d312bb16d15fad7bfff07 Copying blob sha256:9bbee2b358614f45b0789da707cba82c7c94ccc80d1945afaa22e4f2aa813cb0 Copying blob sha256:bd9ddc54bea929a22b334e73e026d4136e5b73f5cc29942896c72e4ece69b13d Copying blob sha256:c4332ef953ab372a071c9279caa8e70fb96ced408f666a2d885035521afd8dda Copying blob sha256:e3e75bd290920ff882ee81af050e3b07004d3191548cd240a05347b506c6373c Copying blob sha256:745970bb62b6f7d7540c985525f372aa3a26b0117e6dff07bbd663e4210ec9e5 Copying blob sha256:1e86b21d995ec039f4fb8eba96ce9338aac6eed24451a6eff347843b90c0d5b7 Copying blob sha256:42b088c91ab829f015b1ebafb84902dfecf1691d99a6047e351fba5fdadf279e Copying blob sha256:8efb1e4560fcdff7ba0f50126316e6a63d2c74d91c1ca2510cf8460d611ae048 Copying blob sha256:5be4b5ac7424118296fe79b0c9d6cf23f721dda03f1aaf90988aca419e7f227d Copying config sha256:de96c729fb8e5f9d8860f41d84dc70f85db7283453139e0ade0442bdd59f1083 Writing manifest to image destination Storing signatures de96c729fb8e5f9d8860f41d84dc70f85db7283453139e0ade0442bdd59f1083 + [ -e cache/podman/var-*-apt-*/*/partial ] + rm -rf logs cache src/osmo-ttcn3-hacks/.linux + [ none = none ] + rm linux + set +x + uptime + grep --color=always -o load.* [01;31m[Kload average: 1.58, 2.57, 2.63[m[K + false + RC=0 + src/osmo-ttcn3-hacks/testenv.py run ns --podman --cache <
https://jenkins.osmocom.org/jenkins/job/ttcn3-ns-test-sgsn-sns/ws/cache
> --ccache /home/osmocom-build/ccache/testenv --log-dir <
https://jenkins.osmocom.org/jenkins/job/ttcn3-ns-test-sgsn-sns/ws/logs
> -b osmocom:nightly -c sgsn_sns [1;91m[testenv] Missing osmo-dev for building test components from source.[0m [1;91m[testenv] Run 'testenv.py init osmo-dev' first.[0m [1;91m[testenv] [0m [1;91m[testenv] osmo-dev and other Osmocom repositories (if they don't already exist) will be cloned to:[0m [1;91m[testenv] <
https://jenkins.osmocom.org/jenkins/job/ttcn3-ns-test-sgsn-sns/ws/src[0m
> [1;91m[testenv] [0m [1;91m[testenv] Set the environment variable TESTENV_SRC_DIR to use a different path.[0m + RC=1 + [ 1 = 0 ] + uptime + grep --color=always -o load.* [01;31m[Kload average: 1.58, 2.57, 2.63[m[K + exit 1 Build step 'Execute shell' marked build as failure Recording test results ERROR: Step ‘Publish JUnit test result report’ failed: No test report files were found. Configuration error?
1
1
0
0
Build failed in Jenkins: ttcn3-ns-test-sns #2027
by jenkins@lists.osmocom.org
08 Oct '26
08 Oct '26
See <
https://jenkins.osmocom.org/jenkins/job/ttcn3-ns-test-sns/2027/display/redi…
> Changes: [Oliver Smith] testenv: podman: always mount osmo-dev dir [Oliver Smith] testenv: run osmo-dev logic for --binary-repo too [Oliver Smith] testenv: cmd: init_env: split up by envtype [Oliver Smith] testenv: build package=no components with osmo-dev [Oliver Smith] bts: use osmo-dev to build osmo-trx-proxy, trxcon ------------------------------------------ Started by timer Running as SYSTEM Building remotely on build4-deb12build-ansible (ttcn3 obs osmo-gsm-tester-build qemu io_uring linux-shallow-clone osmocom-gerrit coverity osmocom-master) in workspace <
https://jenkins.osmocom.org/jenkins/job/ttcn3-ns-test-sns/ws/
> The recommended git tool is: NONE No credentials specified Cloning the remote Git repository Cloning repository
https://gerrit.osmocom.org/osmo-ttcn3-hacks
> git init <
https://jenkins.osmocom.org/jenkins/job/ttcn3-ns-test-sns/ws/src/osmo-ttcn3…
> # timeout=10 Fetching upstream changes from
https://gerrit.osmocom.org/osmo-ttcn3-hacks
> git --version # timeout=10 > git --version # 'git version 2.39.5' > git fetch --tags --force --progress --
https://gerrit.osmocom.org/osmo-ttcn3-hacks
+refs/heads/*:refs/remotes/origin/* # timeout=10 > git config remote.origin.url
https://gerrit.osmocom.org/osmo-ttcn3-hacks
# timeout=10 > git config --add remote.origin.fetch +refs/heads/*:refs/remotes/origin/* # timeout=10 Avoid second fetch > git rev-parse origin/master^{commit} # timeout=10 Checking out Revision e48c4f51701bcd10519875d007b10b7c1f7eac5a (origin/master) > git config core.sparsecheckout # timeout=10 > git checkout -f e48c4f51701bcd10519875d007b10b7c1f7eac5a # timeout=10 Commit message: "bts: use osmo-dev to build osmo-trx-proxy, trxcon" > git rev-list --no-walk 26d06400905af7489a5115a303ff7fb512aefac9 # timeout=10 Copied 1 artifact from "build-kernel-none" build number 1 [ttcn3-ns-test-sns] $ /bin/sh -xe /tmp/jenkins4419285708124772764.sh + DISTRO=debian:trixie + echo debian:trixie + tr : - +
IMAGE=registry.osmocom.org/osmocom-build/debian-trixie-osmo-ttcn3-testenv
+ KERNEL=none + echo False + tr [:upper:] [:lower:] + INIT_OSMO_DEV=false + podman pull
registry.osmocom.org/osmocom-build/debian-trixie-osmo-ttcn3-testenv
Trying to pull
registry.osmocom.org/osmocom-build/debian-trixie-osmo-ttcn3-testenv:latest
... Getting image source signatures Copying blob sha256:745970bb62b6f7d7540c985525f372aa3a26b0117e6dff07bbd663e4210ec9e5 Copying blob sha256:7fa13ad30526db36a65dae4fb3e12004c819bc9e992d312bb16d15fad7bfff07 Copying blob sha256:bd9ddc54bea929a22b334e73e026d4136e5b73f5cc29942896c72e4ece69b13d Copying blob sha256:e3e75bd290920ff882ee81af050e3b07004d3191548cd240a05347b506c6373c Copying blob sha256:9bbee2b358614f45b0789da707cba82c7c94ccc80d1945afaa22e4f2aa813cb0 Copying blob sha256:c4332ef953ab372a071c9279caa8e70fb96ced408f666a2d885035521afd8dda Copying blob sha256:1e86b21d995ec039f4fb8eba96ce9338aac6eed24451a6eff347843b90c0d5b7 Copying blob sha256:42b088c91ab829f015b1ebafb84902dfecf1691d99a6047e351fba5fdadf279e Copying blob sha256:8efb1e4560fcdff7ba0f50126316e6a63d2c74d91c1ca2510cf8460d611ae048 Copying blob sha256:5be4b5ac7424118296fe79b0c9d6cf23f721dda03f1aaf90988aca419e7f227d Copying config sha256:de96c729fb8e5f9d8860f41d84dc70f85db7283453139e0ade0442bdd59f1083 Writing manifest to image destination Storing signatures de96c729fb8e5f9d8860f41d84dc70f85db7283453139e0ade0442bdd59f1083 + [ -e cache/podman/var-*-apt-*/*/partial ] + rm -rf logs cache src/osmo-ttcn3-hacks/.linux + [ none = none ] + rm linux + set +x + uptime + grep --color=always -o load.* [01;31m[Kload average: 0.08, 2.23, 3.54[m[K + false + RC=0 + src/osmo-ttcn3-hacks/testenv.py run ns --podman --cache <
https://jenkins.osmocom.org/jenkins/job/ttcn3-ns-test-sns/ws/cache
> --ccache /home/osmocom-build/ccache/testenv --log-dir <
https://jenkins.osmocom.org/jenkins/job/ttcn3-ns-test-sns/ws/logs
> -b osmocom:nightly -c sns [1;91m[testenv] Missing osmo-dev for building test components from source.[0m [1;91m[testenv] Run 'testenv.py init osmo-dev' first.[0m [1;91m[testenv] [0m [1;91m[testenv] osmo-dev and other Osmocom repositories (if they don't already exist) will be cloned to:[0m [1;91m[testenv] <
https://jenkins.osmocom.org/jenkins/job/ttcn3-ns-test-sns/ws/src[0m
> [1;91m[testenv] [0m [1;91m[testenv] Set the environment variable TESTENV_SRC_DIR to use a different path.[0m + RC=1 + [ 1 = 0 ] + uptime + grep --color=always -o load.* [01;31m[Kload average: 0.08, 2.23, 3.54[m[K + exit 1 Build step 'Execute shell' marked build as failure Recording test results ERROR: Step ‘Publish JUnit test result report’ failed: No test report files were found. Configuration error?
1
1
0
0
Build failed in Jenkins: ttcn3-ns-test #2027
by jenkins@lists.osmocom.org
08 Oct '26
08 Oct '26
See <
https://jenkins.osmocom.org/jenkins/job/ttcn3-ns-test/2027/display/redirect…
> Changes: [Oliver Smith] testenv: podman: always mount osmo-dev dir [Oliver Smith] testenv: run osmo-dev logic for --binary-repo too [Oliver Smith] testenv: cmd: init_env: split up by envtype [Oliver Smith] testenv: build package=no components with osmo-dev [Oliver Smith] bts: use osmo-dev to build osmo-trx-proxy, trxcon ------------------------------------------ Started by timer Running as SYSTEM Building remotely on build4-deb12build-ansible (ttcn3 obs osmo-gsm-tester-build qemu io_uring linux-shallow-clone osmocom-gerrit coverity osmocom-master) in workspace <
https://jenkins.osmocom.org/jenkins/job/ttcn3-ns-test/ws/
> The recommended git tool is: NONE No credentials specified Cloning the remote Git repository Cloning repository
https://gerrit.osmocom.org/osmo-ttcn3-hacks
> git init <
https://jenkins.osmocom.org/jenkins/job/ttcn3-ns-test/ws/src/osmo-ttcn3-hac…
> # timeout=10 Fetching upstream changes from
https://gerrit.osmocom.org/osmo-ttcn3-hacks
> git --version # timeout=10 > git --version # 'git version 2.39.5' > git fetch --tags --force --progress --
https://gerrit.osmocom.org/osmo-ttcn3-hacks
+refs/heads/*:refs/remotes/origin/* # timeout=10 > git config remote.origin.url
https://gerrit.osmocom.org/osmo-ttcn3-hacks
# timeout=10 > git config --add remote.origin.fetch +refs/heads/*:refs/remotes/origin/* # timeout=10 Avoid second fetch > git rev-parse origin/master^{commit} # timeout=10 Checking out Revision e48c4f51701bcd10519875d007b10b7c1f7eac5a (origin/master) > git config core.sparsecheckout # timeout=10 > git checkout -f e48c4f51701bcd10519875d007b10b7c1f7eac5a # timeout=10 Commit message: "bts: use osmo-dev to build osmo-trx-proxy, trxcon" > git rev-list --no-walk 26d06400905af7489a5115a303ff7fb512aefac9 # timeout=10 Copied 1 artifact from "build-kernel-none" build number 1 [ttcn3-ns-test] $ /bin/sh -xe /tmp/jenkins15252592624233726544.sh + DISTRO=debian:trixie + echo debian:trixie + tr : - +
IMAGE=registry.osmocom.org/osmocom-build/debian-trixie-osmo-ttcn3-testenv
+ KERNEL=none + echo False + tr [:upper:] [:lower:] + INIT_OSMO_DEV=false + podman pull
registry.osmocom.org/osmocom-build/debian-trixie-osmo-ttcn3-testenv
Trying to pull
registry.osmocom.org/osmocom-build/debian-trixie-osmo-ttcn3-testenv:latest
... Getting image source signatures Copying blob sha256:7fa13ad30526db36a65dae4fb3e12004c819bc9e992d312bb16d15fad7bfff07 Copying blob sha256:9bbee2b358614f45b0789da707cba82c7c94ccc80d1945afaa22e4f2aa813cb0 Copying blob sha256:c4332ef953ab372a071c9279caa8e70fb96ced408f666a2d885035521afd8dda Copying blob sha256:bd9ddc54bea929a22b334e73e026d4136e5b73f5cc29942896c72e4ece69b13d Copying blob sha256:745970bb62b6f7d7540c985525f372aa3a26b0117e6dff07bbd663e4210ec9e5 Copying blob sha256:e3e75bd290920ff882ee81af050e3b07004d3191548cd240a05347b506c6373c Copying blob sha256:1e86b21d995ec039f4fb8eba96ce9338aac6eed24451a6eff347843b90c0d5b7 Copying blob sha256:42b088c91ab829f015b1ebafb84902dfecf1691d99a6047e351fba5fdadf279e Copying blob sha256:8efb1e4560fcdff7ba0f50126316e6a63d2c74d91c1ca2510cf8460d611ae048 Copying blob sha256:5be4b5ac7424118296fe79b0c9d6cf23f721dda03f1aaf90988aca419e7f227d Copying config sha256:de96c729fb8e5f9d8860f41d84dc70f85db7283453139e0ade0442bdd59f1083 Writing manifest to image destination Storing signatures de96c729fb8e5f9d8860f41d84dc70f85db7283453139e0ade0442bdd59f1083 + [ -e cache/podman/var-*-apt-*/*/partial ] + rm -rf logs cache src/osmo-ttcn3-hacks/.linux + [ none = none ] + rm linux + set +x + uptime + grep --color=always -o load.* [01;31m[Kload average: 6.07, 6.80, 4.89[m[K + false + RC=0 + src/osmo-ttcn3-hacks/testenv.py run ns --podman --cache <
https://jenkins.osmocom.org/jenkins/job/ttcn3-ns-test/ws/cache
> --ccache /home/osmocom-build/ccache/testenv --log-dir <
https://jenkins.osmocom.org/jenkins/job/ttcn3-ns-test/ws/logs
> -b osmocom:nightly -c udp [1;91m[testenv] Missing osmo-dev for building test components from source.[0m [1;91m[testenv] Run 'testenv.py init osmo-dev' first.[0m [1;91m[testenv] [0m [1;91m[testenv] osmo-dev and other Osmocom repositories (if they don't already exist) will be cloned to:[0m [1;91m[testenv] <
https://jenkins.osmocom.org/jenkins/job/ttcn3-ns-test/ws/src[0m
> [1;91m[testenv] [0m [1;91m[testenv] Set the environment variable TESTENV_SRC_DIR to use a different path.[0m + RC=1 + [ 1 = 0 ] + uptime + grep --color=always -o load.* [01;31m[Kload average: 6.07, 6.80, 4.89[m[K + exit 1 Build step 'Execute shell' marked build as failure Recording test results ERROR: Step ‘Publish JUnit test result report’ failed: No test report files were found. Configuration error?
1
1
0
0
Build failed in Jenkins: ttcn3-sccp-test #2472
by jenkins@lists.osmocom.org
08 Oct '26
08 Oct '26
See <
https://jenkins.osmocom.org/jenkins/job/ttcn3-sccp-test/2472/display/redire…
> Changes: [Oliver Smith] testenv: podman: always mount osmo-dev dir [Oliver Smith] testenv: run osmo-dev logic for --binary-repo too [Oliver Smith] testenv: cmd: init_env: split up by envtype [Oliver Smith] testenv: build package=no components with osmo-dev [Oliver Smith] bts: use osmo-dev to build osmo-trx-proxy, trxcon ------------------------------------------ Started by timer Running as SYSTEM Building remotely on build5-deb12build-ansible (ttcn3 obs osmo-gsm-tester-build qemu io_uring linux-shallow-clone osmocom-gerrit coverity osmocom-master) in workspace <
https://jenkins.osmocom.org/jenkins/job/ttcn3-sccp-test/ws/
> The recommended git tool is: NONE No credentials specified Cloning the remote Git repository Cloning repository
https://gerrit.osmocom.org/osmo-ttcn3-hacks
> git init <
https://jenkins.osmocom.org/jenkins/job/ttcn3-sccp-test/ws/src/osmo-ttcn3-h…
> # timeout=10 Fetching upstream changes from
https://gerrit.osmocom.org/osmo-ttcn3-hacks
> git --version # timeout=10 > git --version # 'git version 2.39.5' > git fetch --tags --force --progress --
https://gerrit.osmocom.org/osmo-ttcn3-hacks
+refs/heads/*:refs/remotes/origin/* # timeout=10 > git config remote.origin.url
https://gerrit.osmocom.org/osmo-ttcn3-hacks
# timeout=10 > git config --add remote.origin.fetch +refs/heads/*:refs/remotes/origin/* # timeout=10 Avoid second fetch > git rev-parse origin/master^{commit} # timeout=10 Checking out Revision e48c4f51701bcd10519875d007b10b7c1f7eac5a (origin/master) > git config core.sparsecheckout # timeout=10 > git checkout -f e48c4f51701bcd10519875d007b10b7c1f7eac5a # timeout=10 Commit message: "bts: use osmo-dev to build osmo-trx-proxy, trxcon" > git rev-list --no-walk 26d06400905af7489a5115a303ff7fb512aefac9 # timeout=10 Copied 1 artifact from "build-kernel-none" build number 1 [ttcn3-sccp-test] $ /bin/sh -xe /tmp/jenkins10788590890631852814.sh + DISTRO=debian:trixie + echo debian:trixie + tr : - +
IMAGE=registry.osmocom.org/osmocom-build/debian-trixie-osmo-ttcn3-testenv
+ KERNEL=none + echo False + tr [:upper:] [:lower:] + INIT_OSMO_DEV=false + podman pull
registry.osmocom.org/osmocom-build/debian-trixie-osmo-ttcn3-testenv
Trying to pull
registry.osmocom.org/osmocom-build/debian-trixie-osmo-ttcn3-testenv:latest
... Getting image source signatures Copying blob sha256:7fa13ad30526db36a65dae4fb3e12004c819bc9e992d312bb16d15fad7bfff07 Copying blob sha256:9bbee2b358614f45b0789da707cba82c7c94ccc80d1945afaa22e4f2aa813cb0 Copying blob sha256:bd9ddc54bea929a22b334e73e026d4136e5b73f5cc29942896c72e4ece69b13d Copying blob sha256:c4332ef953ab372a071c9279caa8e70fb96ced408f666a2d885035521afd8dda Copying blob sha256:745970bb62b6f7d7540c985525f372aa3a26b0117e6dff07bbd663e4210ec9e5 Copying blob sha256:e3e75bd290920ff882ee81af050e3b07004d3191548cd240a05347b506c6373c Copying blob sha256:1e86b21d995ec039f4fb8eba96ce9338aac6eed24451a6eff347843b90c0d5b7 Copying blob sha256:42b088c91ab829f015b1ebafb84902dfecf1691d99a6047e351fba5fdadf279e Copying blob sha256:8efb1e4560fcdff7ba0f50126316e6a63d2c74d91c1ca2510cf8460d611ae048 Copying blob sha256:5be4b5ac7424118296fe79b0c9d6cf23f721dda03f1aaf90988aca419e7f227d Copying config sha256:de96c729fb8e5f9d8860f41d84dc70f85db7283453139e0ade0442bdd59f1083 Writing manifest to image destination Storing signatures de96c729fb8e5f9d8860f41d84dc70f85db7283453139e0ade0442bdd59f1083 + [ -e cache/podman/var-*-apt-*/*/partial ] + rm -rf logs cache src/osmo-ttcn3-hacks/.linux + [ none = none ] + rm linux + set +x + uptime + grep --color=always -o load.* [01;31m[Kload average: 1.20, 4.16, 3.03[m[K + false + RC=0 + src/osmo-ttcn3-hacks/testenv.py run sccp --podman --cache <
https://jenkins.osmocom.org/jenkins/job/ttcn3-sccp-test/ws/cache
> --ccache /home/osmocom-build/ccache/testenv --log-dir <
https://jenkins.osmocom.org/jenkins/job/ttcn3-sccp-test/ws/logs
> -b osmocom:nightly [1;91m[testenv] Missing osmo-dev for building test components from source.[0m [1;91m[testenv] Run 'testenv.py init osmo-dev' first.[0m [1;91m[testenv] [0m [1;91m[testenv] osmo-dev and other Osmocom repositories (if they don't already exist) will be cloned to:[0m [1;91m[testenv] <
https://jenkins.osmocom.org/jenkins/job/ttcn3-sccp-test/ws/src[0m
> [1;91m[testenv] [0m [1;91m[testenv] Set the environment variable TESTENV_SRC_DIR to use a different path.[0m + RC=1 + [ 1 = 0 ] + uptime + grep --color=always -o load.* [01;31m[Kload average: 1.20, 4.16, 3.03[m[K + exit 1 Build step 'Execute shell' marked build as failure Recording test results ERROR: Step ‘Publish JUnit test result report’ failed: No test report files were found. Configuration error?
1
1
0
0
Build failed in Jenkins: ttcn3-5gc-test-ogs #503
by jenkins@lists.osmocom.org
08 Oct '26
08 Oct '26
See <
https://jenkins.osmocom.org/jenkins/job/ttcn3-5gc-test-ogs/503/display/redi…
> Changes: [Oliver Smith] testenv: fix running configs with omitted package= [Oliver Smith] testenv: podman_install: update can't install msg [Pau Espin Pedrol] NGAP_Templates.ttcn: HandoverRequired: Allow passing optional Direct ------------------------------------------ [...truncated 160.57 MiB...] [32m10/08 09:32:10.201[0m: [[33msbi[0m] [1;37mDEBUG[0m: STATUS [204] (../lib/sbi/nghttp2-server.c:706) [32m10/08 09:32:10.201[0m: [[33msbi[0m] [1;37mDEBUG[0m: STREAM closed [14119] (../lib/sbi/nghttp2-server.c:1435) 0000: 00001a01 05000037 2789d161 96df3dbf .......7'..a..=. 0010: 4a01e535 112a0802 71403f71 915c0814 J..5.*..q(a)?q.\.. 0020: c5a37f ... [32m10/08 09:32:10.201[0m: [[33msbi[0m] [1;37mDEBUG[0m: [204:PATCH]
http://127.0.0.200:7777/nnrf-nfm/v1/nf-instances/d550c7f2-c2fa-41f1-a2b6-2f…
(../lib/sbi/client.c:744) [32m10/08 09:32:10.201[0m: [[33msbi[0m] [1;37mDEBUG[0m: RECEIVED[0] (../lib/sbi/client.c:755) [32m10/08 09:32:10.201[0m: [[33mamf[0m] [1;37mDEBUG[0m: amf_state_operational(): OGS_EVENT_NAME_SBI_CLIENT (../src/amf/amf-sm.c:84) [32m10/08 09:32:10.201[0m: [[33msbi[0m] [1;37mDEBUG[0m: ogs_sbi_nf_state_registered(): OGS_EVENT_NAME_SBI_CLIENT (../lib/sbi/nf-sm.c:312) MTC@4f960321ef48: External command `<
https://jenkins.osmocom.org/jenkins/job/ttcn3-5gc-test-ogs/ws/src/osmo-ttcn…
> C5G_Tests.TC_connection_inactive' was executed successfully (exit status: 0). MTC@4f960321ef48: Test case TC_connection_inactive started. GTP1U_EM(594)@4f960321ef48: Warning: sizes of 'struct sctp_event_subscribe': compile-time 14, kernel: 14 GTP1U_EM(594)@4f960321ef48: setverdict(fail): none -> fail reason: "Could not connect UECUPS socket, check your configuration", new component reason: "Could not connect UECUPS socket, check your configuration" GTP1U_EM(594)@4f960321ef48: Dynamic test case error: testcase.stop GTP1U_EM(594)@4f960321ef48: setverdict(error): fail -> error GTP1U_EM(594)@4f960321ef48: Final verdict of PTC: error [32m10/08 09:32:10.831[0m: [[33mamf[0m] [1;32mINFO[0m: gNB-N2 accepted[127.0.0.202]:50000 in ng-path module (../src/amf/ngap-sctp.c:113) [32m10/08 09:32:10.831[0m: [[33mamf[0m] [1;37mDEBUG[0m: amf_state_operational(): AMF_EVENT_NGAP_LO_ACCEPT (../src/amf/amf-sm.c:84) [32m10/08 09:32:10.831[0m: [[33mamf[0m] [1;32mINFO[0m: gNB-N2 accepted[127.0.0.202] in master_sm module (../src/amf/amf-sm.c:823) TC_connection_inactive-NGAP0(595)@4f960321ef48: Warning: sizes of 'struct sctp_event_subscribe': compile-time 14, kernel: 14 [32m10/08 09:32:10.835[0m: [[33mamf[0m] [1;37mDEBUG[0m: ngap_state_initial(): ENTRY (../src/amf/ngap-sm.c:28) [32m10/08 09:32:10.835[0m: [[33mamf[0m] [1;37mDEBUG[0m: ngap_state_operational(): ENTRY (../src/amf/ngap-sm.c:55) [32m10/08 09:32:10.835[0m: [[33mamf[0m] [1;32mINFO[0m: [Added] Number of gNBs is now 1 (../src/amf/context.c:1332) [32m10/08 09:32:10.835[0m: [[33mamf[0m] [1;37mDEBUG[0m: SCTP_ASSOC_CHANGE:[T:32769, F:0x0, S:0, I/O:64/30] (../src/amf/ngap-sctp.c:152) [32m10/08 09:32:10.835[0m: [[33mamf[0m] [1;37mDEBUG[0m: SCTP_COMM_UP (../src/amf/ngap-sctp.c:161) [32m10/08 09:32:10.835[0m: [[33mamf[0m] [1;37mDEBUG[0m: amf_state_operational(): AMF_EVENT_NGAP_LO_SCTP_COMM_UP (../src/amf/amf-sm.c:84) [32m10/08 09:32:10.835[0m: [[33mamf[0m] [1;32mINFO[0m: gNB-N2[127.0.0.202] max_num_of_ostreams : 30 (../src/amf/amf-sm.c:870) TC_connection_inactive-NGAP1(596)@4f960321ef48: Warning: sizes of 'struct sctp_event_subscribe': compile-time 14, kernel: 14 [32m10/08 09:32:10.840[0m: [[33mamf[0m] [1;32mINFO[0m: gNB-N2 accepted[127.0.0.202]:50001 in ng-path module (../src/amf/ngap-sctp.c:113) [32m10/08 09:32:10.840[0m: [[33mamf[0m] [1;37mDEBUG[0m: amf_state_operational(): AMF_EVENT_NGAP_LO_ACCEPT (../src/amf/amf-sm.c:84) [32m10/08 09:32:10.840[0m: [[33mamf[0m] [1;32mINFO[0m: gNB-N2 accepted[127.0.0.202] in master_sm module (../src/amf/amf-sm.c:823) [32m10/08 09:32:10.843[0m: [[33mamf[0m] [1;37mDEBUG[0m: ngap_state_initial(): ENTRY (../src/amf/ngap-sm.c:28) [32m10/08 09:32:10.843[0m: [[33mamf[0m] [1;37mDEBUG[0m: ngap_state_operational(): ENTRY (../src/amf/ngap-sm.c:55) [32m10/08 09:32:10.843[0m: [[33mamf[0m] [1;32mINFO[0m: [Added] Number of gNBs is now 2 (../src/amf/context.c:1332) [32m10/08 09:32:10.843[0m: [[33mamf[0m] [1;37mDEBUG[0m: SCTP_ASSOC_CHANGE:[T:32769, F:0x0, S:0, I/O:64/30] (../src/amf/ngap-sctp.c:152) [32m10/08 09:32:10.843[0m: [[33mamf[0m] [1;37mDEBUG[0m: SCTP_COMM_UP (../src/amf/ngap-sctp.c:161) [32m10/08 09:32:10.843[0m: [[33mamf[0m] [1;37mDEBUG[0m: amf_state_operational(): AMF_EVENT_NGAP_LO_SCTP_COMM_UP (../src/amf/amf-sm.c:84) [32m10/08 09:32:10.843[0m: [[33mamf[0m] [1;32mINFO[0m: gNB-N2[127.0.0.202] max_num_of_ostreams : 30 (../src/amf/amf-sm.c:870) [32m10/08 09:32:10.845[0m: [[33mamf[0m] [1;37mDEBUG[0m: amf_state_operational(): AMF_EVENT_NGAP_MESSAGE (../src/amf/amf-sm.c:84) [32m10/08 09:32:10.845[0m: [[33mamf[0m] [1;37mDEBUG[0m: ngap_state_operational(): AMF_EVENT_NGAP_MESSAGE (../src/amf/ngap-sm.c:55) [32m10/08 09:32:10.845[0m: [[33mamf[0m] [1;37mDEBUG[0m: NGSetupRequest (../src/amf/ngap-handler.c:288) [32m10/08 09:32:10.845[0m: [[33mamf[0m] [1;37mDEBUG[0m: IP[127.0.0.202] GNB_ID[0x0] GNB_ID_LENGTH[22] (../src/amf/ngap-handler.c:386) [32m10/08 09:32:10.845[0m: [[33mamf[0m] [1;37mDEBUG[0m: PLMN_ID[MCC:999 MNC:70] (../src/amf/ngap-handler.c:391) [32m10/08 09:32:10.845[0m: [[33mamf[0m] [1;37mDEBUG[0m: PagingDRX[0] (../src/amf/ngap-handler.c:395) [32m10/08 09:32:10.845[0m: [[33mamf[0m] [1;37mDEBUG[0m: TAC[1] (../src/amf/ngap-handler.c:439) [32m10/08 09:32:10.845[0m: [[33mamf[0m] [1;37mDEBUG[0m: PLMN_ID[MCC:999 MNC:70] (../src/amf/ngap-handler.c:501) [32m10/08 09:32:10.845[0m: [[33mamf[0m] [1;37mDEBUG[0m: S_NSSAI[SST:1 SD:0xffffff] (../src/amf/ngap-handler.c:562) [32m10/08 09:32:10.845[0m: [[33mamf[0m] [1;37mDEBUG[0m: TAC[1] (../src/amf/ngap-handler.c:72) [32m10/08 09:32:10.845[0m: [[33mamf[0m] [1;37mDEBUG[0m: PLMN_ID[MCC:999 MNC:70] (../src/amf/ngap-handler.c:73) [32m10/08 09:32:10.845[0m: [[33mamf[0m] [1;37mDEBUG[0m: SERVED_TAI_INDEX[0] (../src/amf/ngap-handler.c:78) [32m10/08 09:32:10.845[0m: [[33mamf[0m] [1;37mDEBUG[0m: PLMN_ID[MCC:999 MNC:70] (../src/amf/ngap-handler.c:100) [32m10/08 09:32:10.845[0m: [[33mamf[0m] [1;37mDEBUG[0m: S_NSSAI[SST:1 SD:0xffffff] (../src/amf/ngap-handler.c:105) [32m10/08 09:32:10.845[0m: [[33mamf[0m] [1;37mDEBUG[0m: NG-Setup response (../src/amf/ngap-path.c:356) [32m10/08 09:32:10.845[0m: [[33mamf[0m] [1;37mDEBUG[0m: NGSetupResponse (../src/amf/ngap-build.c:91) [32m10/08 09:32:10.845[0m: [[33mamf[0m] [1;37mDEBUG[0m: IP[127.0.0.202] RAN_ID[0] (../src/amf/ngap-path.c:64) MTC@4f960321ef48: setverdict(pass): none -> pass MTC@4f960321ef48: Dynamic test case error: Error message was received from MC: The connect operation refers to test component with component reference 594, which has already terminated. MTC@4f960321ef48: setverdict(error): pass -> error TC_connection_inactive0(597)@4f960321ef48: Final verdict of PTC: none [32m10/08 09:32:10.853[0m: [[33mamf[0m] [1;37mDEBUG[0m: SCTP_SHUTDOWN_EVENT:[T:32773, F:0x0, L:12] (../src/amf/ngap-sctp.c:193) [32m10/08 09:32:10.853[0m: [[33mamf[0m] [1;37mDEBUG[0m: SCTP_SHUTDOWN_EVENT:[T:32773, F:0x0, L:12] (../src/amf/ngap-sctp.c:193) [32m10/08 09:32:10.853[0m: [[33mamf[0m] [1;37mDEBUG[0m: amf_state_operational(): AMF_EVENT_NGAP_LO_CONNREFUSED (../src/amf/amf-sm.c:84) [32m10/08 09:32:10.853[0m: [[33mamf[0m] [1;32mINFO[0m: gNB-N2[127.0.0.202] connection refused!!! (../src/amf/amf-sm.c:883) [32m10/08 09:32:10.853[0m: [[33mamf[0m] [1;37mDEBUG[0m: ngap_state_operational(): EXIT (../src/amf/ngap-sm.c:55) [32m10/08 09:32:10.853[0m: [[33mamf[0m] [1;37mDEBUG[0m: ngap_state_final(): EXIT (../src/amf/ngap-sm.c:37) [32m10/08 09:32:10.853[0m: [[33mamf[0m] [1;32mINFO[0m: [Removed] Number of gNBs is now 1 (../src/amf/context.c:1368) [32m10/08 09:32:10.853[0m: [[33mamf[0m] [1;37mDEBUG[0m: amf_state_operational(): AMF_EVENT_NGAP_LO_CONNREFUSED (../src/amf/amf-sm.c:84) [32m10/08 09:32:10.853[0m: [[33mamf[0m] [1;32mINFO[0m: gNB-N2[127.0.0.202] connection refused!!! (../src/amf/amf-sm.c:883) [32m10/08 09:32:10.853[0m: [[33mamf[0m] [1;37mDEBUG[0m: ngap_state_operational(): EXIT (../src/amf/ngap-sm.c:55) [32m10/08 09:32:10.853[0m: [[33mamf[0m] [1;37mDEBUG[0m: ngap_state_final(): EXIT (../src/amf/ngap-sm.c:37) [32m10/08 09:32:10.853[0m: [[33mamf[0m] [1;32mINFO[0m: [Removed] Number of gNBs is now 0 (../src/amf/context.c:1368) TC_connection_inactive-NGAP1(596)@4f960321ef48: Final verdict of PTC: none TC_connection_inactive-NGAP0(595)@4f960321ef48: Final verdict of PTC: none MTC@4f960321ef48: Setting final verdict of the test case. MTC@4f960321ef48: Local verdict of MTC: error MTC@4f960321ef48: Local verdict of PTC GTP1U_EM(594): error (error -> error) MTC@4f960321ef48: Local verdict of PTC TC_connection_inactive-NGAP0(595): none (error -> error) MTC@4f960321ef48: Local verdict of PTC TC_connection_inactive-NGAP1(596): none (error -> error) MTC@4f960321ef48: Local verdict of PTC TC_connection_inactive0(597): none (error -> error) MTC@4f960321ef48: Test case TC_connection_inactive finished. Verdict: error MTC@4f960321ef48: Starting external command `<
https://jenkins.osmocom.org/jenkins/job/ttcn3-5gc-test-ogs/ws/src/osmo-ttcn…
> C5G_Tests.TC_connection_inactive error'. (09:32:10) load average: 14.19, 5.94, 5.68 [1;31m------ C5G_Tests.TC_connection_inactive error ------[0m Waiting for packet dumper to finish... 0 (prev_count=-1, count=3432) Waiting for packet dumper to finish... 1 (prev_count=3432, count=7856) MTC@4f960321ef48: External command `<
https://jenkins.osmocom.org/jenkins/job/ttcn3-5gc-test-ogs/ws/src/osmo-ttcn…
> C5G_Tests.TC_connection_inactive error' was executed successfully (exit status: 0). MTC@4f960321ef48: Starting external command `<
https://jenkins.osmocom.org/jenkins/job/ttcn3-5gc-test-ogs/ws/src/osmo-ttcn…
> C5G_Tests.TC_connection_suspend'. ------ C5G_Tests.TC_connection_suspend ------ (09:32:12) load average: 14.19, 5.94, 5.68 /usr/bin/dumpcap -q -s 1520 -n -i any -w "<
https://jenkins.osmocom.org/jenkins/job/ttcn3-5gc-test-ogs/503/artifact/log…
"> ><
https://jenkins.osmocom.org/jenkins/job/ttcn3-5gc-test-ogs/503/artifact/log…
> 2>/tmp/cmderr & Waiting for packet dumper to start... 0 [32m10/08 09:32:13.610[0m: [[33msmf[0m] [1;37mDEBUG[0m: smf_state_operational(): SMF_EVT_N4_TIMER (../src/smf/smf-sm.c:94) [32m10/08 09:32:13.610[0m: [[33msmf[0m] [1;37mDEBUG[0m: smf_pfcp_state_associated(): SMF_EVT_N4_TIMER (../src/smf/pfcp-sm.c:182) [32m10/08 09:32:13.610[0m: [[33mpfcp[0m] [1;37mDEBUG[0m: [1572] LOCAL Create peer [127.0.0.7]:8805 (../lib/pfcp/xact.c:131) [32m10/08 09:32:13.610[0m: [[33mpfcp[0m] [1;37mDEBUG[0m: Heartbeat Request (../lib/pfcp/build.c:28) [32m10/08 09:32:13.610[0m: [[33mpfcp[0m] [1;37mDEBUG[0m: [1572] LOCAL UPD TX-1 peer [127.0.0.7]:8805 (../lib/pfcp/xact.c:231) [32m10/08 09:32:13.610[0m: [[33mpfcp[0m] [1;37mDEBUG[0m: [1572] LOCAL Commit peer [127.0.0.7]:8805 (../lib/pfcp/xact.c:500) [32m10/08 09:32:13.611[0m: [[33mupf[0m] [1;37mDEBUG[0m: ogs_pfcp_extract_node_id() type [1] pfcp_status [1] node_id [NULL] from [127.0.0.4]:8805 (../src/upf/pfcp-path.c:101) [32m10/08 09:32:13.611[0m: [[33mupf[0m] [1;37mDEBUG[0m: Found PFCP-Node: addr_list [127.0.0.4]:8805 (../src/upf/pfcp-path.c:155) [32m10/08 09:32:13.611[0m: [[33mupf[0m] [1;37mDEBUG[0m: Merged PFCP-Node: addr_list [127.0.0.4]:8805 (../src/upf/pfcp-path.c:161) [32m10/08 09:32:13.611[0m: [[33mupf[0m] [1;37mDEBUG[0m: upf_state_operational(): UPF_EVT_N4_MESSAGE (../src/upf/upf-sm.c:51) [32m10/08 09:32:13.611[0m: [[33mpfcp[0m] [1;37mDEBUG[0m: [1572] Cannot find new type 1 from PFCP peer [127.0.0.4]:8805 (../lib/pfcp/xact.c:767) [32m10/08 09:32:13.611[0m: [[33mpfcp[0m] [1;37mDEBUG[0m: [1572] REMOTE Create peer [127.0.0.4]:8805 (../lib/pfcp/xact.c:196) [32m10/08 09:32:13.611[0m: [[33mpfcp[0m] [1;37mDEBUG[0m: [1572] REMOTE Receive peer [127.0.0.4]:8805 (../lib/pfcp/xact.c:778) [32m10/08 09:32:13.611[0m: [[33mpfcp[0m] [1;37mDEBUG[0m: [1572] REMOTE UPD RX-1 peer [127.0.0.4]:8805 (../lib/pfcp/xact.c:329) [32m10/08 09:32:13.611[0m: [[33mupf[0m] [1;37mDEBUG[0m: upf_pfcp_state_associated(): UPF_EVT_N4_MESSAGE (../src/upf/pfcp-sm.c:161) [32m10/08 09:32:13.611[0m: [[33mpfcp[0m] [1;37mDEBUG[0m: Heartbeat Response (../lib/pfcp/build.c:56) [32m10/08 09:32:13.611[0m: [[33mpfcp[0m] [1;37mDEBUG[0m: [1572] REMOTE UPD TX-2 peer [127.0.0.4]:8805 (../lib/pfcp/xact.c:231) [32m10/08 09:32:13.611[0m: [[33mpfcp[0m] [1;37mDEBUG[0m: [1572] REMOTE Commit peer [127.0.0.4]:8805 (../lib/pfcp/xact.c:500) [32m10/08 09:32:13.611[0m: [[33mpfcp[0m] [1;37mDEBUG[0m: [1572] REMOTE Delete peer [127.0.0.4]:8805 (../lib/pfcp/xact.c:836) [32m10/08 09:32:13.611[0m: [[33mupf[0m] [1;37mDEBUG[0m: upf_state_operational(): UPF_EVT_N4_TIMER (../src/upf/upf-sm.c:51) [32m10/08 09:32:13.611[0m: [[33mupf[0m] [1;37mDEBUG[0m: upf_pfcp_state_associated(): UPF_EVT_N4_TIMER (../src/upf/pfcp-sm.c:161) [32m10/08 09:32:13.611[0m: [[33mpfcp[0m] [1;37mDEBUG[0m: [55] LOCAL Create peer [127.0.0.4]:8805 (../lib/pfcp/xact.c:131) [32m10/08 09:32:13.611[0m: [[33mpfcp[0m] [1;37mDEBUG[0m: Heartbeat Request (../lib/pfcp/build.c:28) [32m10/08 09:32:13.611[0m: [[33mpfcp[0m] [1;37mDEBUG[0m: [55] LOCAL UPD TX-1 peer [127.0.0.4]:8805 (../lib/pfcp/xact.c:231) [32m10/08 09:32:13.611[0m: [[33mpfcp[0m] [1;37mDEBUG[0m: [55] LOCAL Commit peer [127.0.0.4]:8805 (../lib/pfcp/xact.c:500) [32m10/08 09:32:13.611[0m: [[33msmf[0m] [1;37mDEBUG[0m: ogs_pfcp_extract_node_id() type [2] pfcp_status [1] node_id [NULL] from [127.0.0.7]:8805 (../src/smf/pfcp-path.c:138) [32m10/08 09:32:13.611[0m: [[33msmf[0m] [1;37mDEBUG[0m: Found PFCP-Node: addr_list [127.0.0.7]:8805 (../src/smf/pfcp-path.c:192) [32m10/08 09:32:13.611[0m: [[33msmf[0m] [1;37mDEBUG[0m: Merged PFCP-Node: addr_list [127.0.0.7]:8805 (../src/smf/pfcp-path.c:198) [32m10/08 09:32:13.611[0m: [[33msmf[0m] [1;37mDEBUG[0m: smf_state_operational(): SMF_EVT_N4_MESSAGE (../src/smf/smf-sm.c:94) [32m10/08 09:32:13.611[0m: [[33mpfcp[0m] [1;37mDEBUG[0m: [1572] LOCAL Find peer [127.0.0.7]:8805 (../lib/pfcp/xact.c:758) [32m10/08 09:32:13.611[0m: [[33mpfcp[0m] [1;37mDEBUG[0m: [1572] LOCAL Receive peer [127.0.0.7]:8805 (../lib/pfcp/xact.c:778) [32m10/08 09:32:13.611[0m: [[33mpfcp[0m] [1;37mDEBUG[0m: [1572] LOCAL UPD RX-2 peer [127.0.0.7]:8805 (../lib/pfcp/xact.c:329) [32m10/08 09:32:13.611[0m: [[33msmf[0m] [1;37mDEBUG[0m: smf_pfcp_state_associated(): SMF_EVT_N4_MESSAGE (../src/smf/pfcp-sm.c:182) [32m10/08 09:32:13.611[0m: [[33mpfcp[0m] [1;37mDEBUG[0m: [1572] LOCAL Commit peer [127.0.0.7]:8805 (../lib/pfcp/xact.c:500) [32m10/08 09:32:13.611[0m: [[33mpfcp[0m] [1;37mDEBUG[0m: [1572] LOCAL Delete peer [127.0.0.7]:8805 (../lib/pfcp/xact.c:836) [32m10/08 09:32:13.611[0m: [[33msmf[0m] [1;37mDEBUG[0m: ogs_pfcp_extract_node_id() type [1] pfcp_status [1] node_id [NULL] from [127.0.0.7]:8805 (../src/smf/pfcp-path.c:138) [32m10/08 09:32:13.611[0m: [[33msmf[0m] [1;37mDEBUG[0m: Found PFCP-Node: addr_list [127.0.0.7]:8805 (../src/smf/pfcp-path.c:192) [32m10/08 09:32:13.611[0m: [[33msmf[0m] [1;37mDEBUG[0m: Merged PFCP-Node: addr_list [127.0.0.7]:8805 (../src/smf/pfcp-path.c:198) [32m10/08 09:32:13.611[0m: [[33msmf[0m] [1;37mDEBUG[0m: smf_state_operational(): SMF_EVT_N4_MESSAGE (../src/smf/smf-sm.c:94) [32m10/08 09:32:13.611[0m: [[33mpfcp[0m] [1;37mDEBUG[0m: [55] Cannot find new type 1 from PFCP peer [127.0.0.7]:8805 (../lib/pfcp/xact.c:767) [32m10/08 09:32:13.611[0m: [[33mpfcp[0m] [1;37mDEBUG[0m: [55] REMOTE Create peer [127.0.0.7]:8805 (../lib/pfcp/xact.c:196) [32m10/08 09:32:13.611[0m: [[33mpfcp[0m] [1;37mDEBUG[0m: [55] REMOTE Receive peer [127.0.0.7]:8805 (../lib/pfcp/xact.c:778) [32m10/08 09:32:13.611[0m: [[33mpfcp[0m] [1;37mDEBUG[0m: [55] REMOTE UPD RX-1 peer [127.0.0.7]:8805 (../lib/pfcp/xact.c:329) [32m10/08 09:32:13.611[0m: [[33msmf[0m] [1;37mDEBUG[0m: smf_pfcp_state_associated(): SMF_EVT_N4_MESSAGE (../src/smf/pfcp-sm.c:182) [32m10/08 09:32:13.611[0m: [[33mpfcp[0m] [1;37mDEBUG[0m: Heartbeat Response (../lib/pfcp/build.c:56) [32m10/08 09:32:13.611[0m: [[33mpfcp[0m] [1;37mDEBUG[0m: [55] REMOTE UPD TX-2 peer [127.0.0.7]:8805 (../lib/pfcp/xact.c:231) [32m10/08 09:32:13.611[0m: [[33mpfcp[0m] [1;37mDEBUG[0m: [55] REMOTE Commit peer [127.0.0.7]:8805 (../lib/pfcp/xact.c:500) [32m10/08 09:32:13.611[0m: [[33mupf[0m] [1;37mDEBUG[0m: ogs_pfcp_extract_node_id() type [2] pfcp_status [1] node_id [NULL] from [127.0.0.4]:8805 (../src/upf/pfcp-path.c:101) [32m10/08 09:32:13.611[0m: [[33mupf[0m] [1;37mDEBUG[0m: Found PFCP-Node: addr_list [127.0.0.4]:8805 (../src/upf/pfcp-path.c:155) [32m10/08 09:32:13.611[0m: [[33mupf[0m] [1;37mDEBUG[0m: Merged PFCP-Node: addr_list [127.0.0.4]:8805 (../src/upf/pfcp-path.c:161) [32m10/08 09:32:13.611[0m: [[33mupf[0m] [1;37mDEBUG[0m: upf_state_operational(): UPF_EVT_N4_MESSAGE (../src/upf/upf-sm.c:51) [32m10/08 09:32:13.611[0m: [[33mpfcp[0m] [1;37mDEBUG[0m: [55] LOCAL Find peer [127.0.0.4]:8805 (../lib/pfcp/xact.c:758) [32m10/08 09:32:13.611[0m: [[33mpfcp[0m] [1;37mDEBUG[0m: [55] LOCAL Receive peer [127.0.0.4]:8805 (../lib/pfcp/xact.c:778) [32m10/08 09:32:13.611[0m: [[33mpfcp[0m] [1;37mDEBUG[0m: [55] LOCAL UPD RX-2 peer [127.0.0.4]:8805 (../lib/pfcp/xact.c:329) [32m10/08 09:32:13.611[0m: [[33mupf[0m] [1;37mDEBUG[0m: upf_pfcp_state_associated(): UPF_EVT_N4_MESSAGE (../src/upf/pfcp-sm.c:161) [32m10/08 09:32:13.611[0m: [[33mpfcp[0m] [1;37mDEBUG[0m: [55] LOCAL Commit peer [127.0.0.4]:8805 (../lib/pfcp/xact.c:500) [32m10/08 09:32:13.612[0m: [[33mpfcp[0m] [1;37mDEBUG[0m: [55] LOCAL Delete peer [127.0.0.4]:8805 (../lib/pfcp/xact.c:836) [32m10/08 09:32:13.611[0m: [[33mpfcp[0m] [1;37mDEBUG[0m: [55] REMOTE Delete peer [127.0.0.7]:8805 (../lib/pfcp/xact.c:836) MTC@4f960321ef48: External command `<
https://jenkins.osmocom.org/jenkins/job/ttcn3-5gc-test-ogs/ws/src/osmo-ttcn…
> C5G_Tests.TC_connection_suspend' was executed successfully (exit status: 0). MTC@4f960321ef48: Test case TC_connection_suspend started. GTP1U_EM(598)@4f960321ef48: Warning: sizes of 'struct sctp_event_subscribe': compile-time 14, kernel: 14 GTP1U_EM(598)@4f960321ef48: setverdict(fail): none -> fail reason: "Could not connect UECUPS socket, check your configuration", new component reason: "Could not connect UECUPS socket, check your configuration" GTP1U_EM(598)@4f960321ef48: Dynamic test case error: testcase.stop GTP1U_EM(598)@4f960321ef48: setverdict(error): fail -> error GTP1U_EM(598)@4f960321ef48: Final verdict of PTC: error TC_connection_suspend-NGAP0(599)@4f960321ef48: Warning: sizes of 'struct sctp_event_subscribe': compile-time 14, kernel: 14 [32m10/08 09:32:13.910[0m: [[33mamf[0m] [1;32mINFO[0m: gNB-N2 accepted[127.0.0.202]:50000 in ng-path module (../src/amf/ngap-sctp.c:113) [32m10/08 09:32:13.910[0m: [[33mamf[0m] [1;37mDEBUG[0m: amf_state_operational(): AMF_EVENT_NGAP_LO_ACCEPT (../src/amf/amf-sm.c:84) [32m10/08 09:32:13.910[0m: [[33mamf[0m] [1;32mINFO[0m: gNB-N2 accepted[127.0.0.202] in master_sm module (../src/amf/amf-sm.c:823) [32m10/08 09:32:13.916[0m: [[33mamf[0m] [1;37mDEBUG[0m: ngap_state_initial(): ENTRY (../src/amf/ngap-sm.c:28) [32m10/08 09:32:13.916[0m: [[33mamf[0m] [1;37mDEBUG[0m: ngap_state_operational(): ENTRY (../src/amf/ngap-sm.c:55) [32m10/08 09:32:13.916[0m: [[33mamf[0m] [1;32mINFO[0m: [Added] Number of gNBs is now 1 (../src/amf/context.c:1332) [32m10/08 09:32:13.916[0m: [[33mamf[0m] [1;37mDEBUG[0m: SCTP_ASSOC_CHANGE:[T:32769, F:0x0, S:0, I/O:64/30] (../src/amf/ngap-sctp.c:152) [32m10/08 09:32:13.916[0m: [[33mamf[0m] [1;37mDEBUG[0m: SCTP_COMM_UP (../src/amf/ngap-sctp.c:161) [32m10/08 09:32:13.916[0m: [[33mamf[0m] [1;37mDEBUG[0m: amf_state_operational(): AMF_EVENT_NGAP_LO_SCTP_COMM_UP (../src/amf/amf-sm.c:84) [32m10/08 09:32:13.916[0m: [[33mamf[0m] [1;32mINFO[0m: gNB-N2[127.0.0.202] max_num_of_ostreams : 30 (../src/amf/amf-sm.c:870) TC_connection_suspend-NGAP1(600)@4f960321ef48: Warning: sizes of 'struct sctp_event_subscribe': compile-time 14, kernel: 14 [32m10/08 09:32:13.918[0m: [[33mamf[0m] [1;32mINFO[0m: gNB-N2 accepted[127.0.0.202]:50001 in ng-path module (../src/amf/ngap-sctp.c:113) [32m10/08 09:32:13.918[0m: [[33mamf[0m] [1;37mDEBUG[0m: amf_state_operational(): AMF_EVENT_NGAP_LO_ACCEPT (../src/amf/amf-sm.c:84) [32m10/08 09:32:13.918[0m: [[33mamf[0m] [1;32mINFO[0m: gNB-N2 accepted[127.0.0.202] in master_sm module (../src/amf/amf-sm.c:823) [32m10/08 09:32:13.923[0m: [[33mamf[0m] [1;37mDEBUG[0m: ngap_state_initial(): ENTRY (../src/amf/ngap-sm.c:28) [32m10/08 09:32:13.923[0m: [[33mamf[0m] [1;37mDEBUG[0m: ngap_state_operational(): ENTRY (../src/amf/ngap-sm.c:55) [32m10/08 09:32:13.923[0m: [[33mamf[0m] [1;32mINFO[0m: [Added] Number of gNBs is now 2 (../src/amf/context.c:1332) [32m10/08 09:32:13.923[0m: [[33mamf[0m] [1;37mDEBUG[0m: SCTP_ASSOC_CHANGE:[T:32769, F:0x0, S:0, I/O:64/30] (../src/amf/ngap-sctp.c:152) [32m10/08 09:32:13.923[0m: [[33mamf[0m] [1;37mDEBUG[0m: SCTP_COMM_UP (../src/amf/ngap-sctp.c:161) [32m10/08 09:32:13.923[0m: [[33mamf[0m] [1;37mDEBUG[0m: amf_state_operational(): AMF_EVENT_NGAP_LO_SCTP_COMM_UP (../src/amf/amf-sm.c:84) [32m10/08 09:32:13.923[0m: [[33mamf[0m] [1;32mINFO[0m: gNB-N2[127.0.0.202] max_num_of_ostreams : 30 (../src/amf/amf-sm.c:870) [32m10/08 09:32:13.925[0m: [[33mamf[0m] [1;37mDEBUG[0m: amf_state_operational(): AMF_EVENT_NGAP_MESSAGE (../src/amf/amf-sm.c:84) [32m10/08 09:32:13.925[0m: [[33mamf[0m] [1;37mDEBUG[0m: ngap_state_operational(): AMF_EVENT_NGAP_MESSAGE (../src/amf/ngap-sm.c:55) [32m10/08 09:32:13.925[0m: [[33mamf[0m] [1;37mDEBUG[0m: NGSetupRequest (../src/amf/ngap-handler.c:288) [32m10/08 09:32:13.925[0m: [[33mamf[0m] [1;37mDEBUG[0m: IP[127.0.0.202] GNB_ID[0x0] GNB_ID_LENGTH[22] (../src/amf/ngap-handler.c:386) [32m10/08 09:32:13.925[0m: [[33mamf[0m] [1;37mDEBUG[0m: PLMN_ID[MCC:999 MNC:70] (../src/amf/ngap-handler.c:391) [32m10/08 09:32:13.925[0m: [[33mamf[0m] [1;37mDEBUG[0m: PagingDRX[0] (../src/amf/ngap-handler.c:395) [32m10/08 09:32:13.925[0m: [[33mamf[0m] [1;37mDEBUG[0m: TAC[1] (../src/amf/ngap-handler.c:439) [32m10/08 09:32:13.925[0m: [[33mamf[0m] [1;37mDEBUG[0m: PLMN_ID[MCC:999 MNC:70] (../src/amf/ngap-handler.c:501) [32m10/08 09:32:13.925[0m: [[33mamf[0m] [1;37mDEBUG[0m: S_NSSAI[SST:1 SD:0xffffff] (../src/amf/ngap-handler.c:562) [32m10/08 09:32:13.925[0m: [[33mamf[0m] [1;37mDEBUG[0m: TAC[1] (../src/amf/ngap-handler.c:72) [32m10/08 09:32:13.925[0m: [[33mamf[0m] [1;37mDEBUG[0m: PLMN_ID[MCC:999 MNC:70] (../src/amf/ngap-handler.c:73) [32m10/08 09:32:13.925[0m: [[33mamf[0m] [1;37mDEBUG[0m: SERVED_TAI_INDEX[0] (../src/amf/ngap-handler.c:78) [32m10/08 09:32:13.925[0m: [[33mamf[0m] [1;37mDEBUG[0m: PLMN_ID[MCC:999 MNC:70] (../src/amf/ngap-handler.c:100) [32m10/08 09:32:13.925[0m: [[33mamf[0m] [1;37mDEBUG[0m: S_NSSAI[SST:1 SD:0xffffff] (../src/amf/ngap-handler.c:105) [32m10/08 09:32:13.925[0m: [[33mamf[0m] [1;37mDEBUG[0m: NG-Setup response (../src/amf/ngap-path.c:356) [32m10/08 09:32:13.925[0m: [[33mamf[0m] [1;37mDEBUG[0m: NGSetupResponse (../src/amf/ngap-build.c:91) [32m10/08 09:32:13.925[0m: [[33mamf[0m] [1;37mDEBUG[0m: IP[127.0.0.202] RAN_ID[0] (../src/amf/ngap-path.c:64) MTC@4f960321ef48: setverdict(pass): none -> pass MTC@4f960321ef48: Dynamic test case error: Error message was received from MC: The connect operation refers to test component with component reference 598, which has already terminated. MTC@4f960321ef48: setverdict(error): pass -> error TC_connection_suspend0(601)@4f960321ef48: Final verdict of PTC: none [32m10/08 09:32:13.932[0m: [[33mamf[0m] [1;37mDEBUG[0m: SCTP_SHUTDOWN_EVENT:[T:32773, F:0x0, L:12] (../src/amf/ngap-sctp.c:193) [32m10/08 09:32:13.932[0m: [[33mamf[0m] [1;37mDEBUG[0m: amf_state_operational(): AMF_EVENT_NGAP_LO_CONNREFUSED (../src/amf/amf-sm.c:84) [32m10/08 09:32:13.932[0m: [[33mamf[0m] [1;32mINFO[0m: gNB-N2[127.0.0.202] connection refused!!! (../src/amf/amf-sm.c:883) [32m10/08 09:32:13.932[0m: [[33mamf[0m] [1;37mDEBUG[0m: ngap_state_operational(): EXIT (../src/amf/ngap-sm.c:55) [32m10/08 09:32:13.932[0m: [[33mamf[0m] [1;37mDEBUG[0m: ngap_state_final(): EXIT (../src/amf/ngap-sm.c:37) [32m10/08 09:32:13.932[0m: [[33mamf[0m] [1;32mINFO[0m: [Removed] Number of gNBs is now 1 (../src/amf/context.c:1368) [32m10/08 09:32:13.932[0m: [[33mamf[0m] [1;37mDEBUG[0m: SCTP_SHUTDOWN_EVENT:[T:32773, F:0x0, L:12] (../src/amf/ngap-sctp.c:193) [32m10/08 09:32:13.932[0m: [[33mamf[0m] [1;37mDEBUG[0m: amf_state_operational(): AMF_EVENT_NGAP_LO_CONNREFUSED (../src/amf/amf-sm.c:84) [32m10/08 09:32:13.932[0m: [[33mamf[0m] [1;32mINFO[0m: gNB-N2[127.0.0.202] connection refused!!! (../src/amf/amf-sm.c:883) [32m10/08 09:32:13.932[0m: [[33mamf[0m] [1;37mDEBUG[0m: ngap_state_operational(): EXIT (../src/amf/ngap-sm.c:55) [32m10/08 09:32:13.932[0m: [[33mamf[0m] [1;37mDEBUG[0m: ngap_state_final(): EXIT (../src/amf/ngap-sm.c:37) [32m10/08 09:32:13.932[0m: [[33mamf[0m] [1;32mINFO[0m: [Removed] Number of gNBs is now 0 (../src/amf/context.c:1368) TC_connection_suspend-NGAP1(600)@4f960321ef48: Final verdict of PTC: none TC_connection_suspend-NGAP0(599)@4f960321ef48: Final verdict of PTC: none MTC@4f960321ef48: Setting final verdict of the test case. MTC@4f960321ef48: Local verdict of MTC: error MTC@4f960321ef48: Local verdict of PTC GTP1U_EM(598): error (error -> error) MTC@4f960321ef48: Local verdict of PTC TC_connection_suspend-NGAP0(599): none (error -> error) MTC@4f960321ef48: Local verdict of PTC TC_connection_suspend-NGAP1(600): none (error -> error) MTC@4f960321ef48: Local verdict of PTC TC_connection_suspend0(601): none (error -> error) MTC@4f960321ef48: Test case TC_connection_suspend finished. Verdict: error MTC@4f960321ef48: Starting external command `<
https://jenkins.osmocom.org/jenkins/job/ttcn3-5gc-test-ogs/ws/src/osmo-ttcn…
> C5G_Tests.TC_connection_suspend error'. (09:32:13) load average: 14.19, 5.94, 5.68 [1;31m------ C5G_Tests.TC_connection_suspend error ------[0m Waiting for packet dumper to finish... 0 (prev_count=-1, count=592) Waiting for packet dumper to finish... 1 (prev_count=592, count=5016) MTC@4f960321ef48: External command `<
https://jenkins.osmocom.org/jenkins/job/ttcn3-5gc-test-ogs/ws/src/osmo-ttcn…
> C5G_Tests.TC_connection_suspend error' was executed successfully (exit status: 0). MTC@4f960321ef48: Starting external command `<
https://jenkins.osmocom.org/jenkins/job/ttcn3-5gc-test-ogs/ws/src/osmo-ttcn…
> C5G_Tests.TC_normal_reg_emergency_services'. ------ C5G_Tests.TC_normal_reg_emergency_services ------ (09:32:16) load average: 13.37, 5.91, 5.67 /usr/bin/dumpcap -q -s 1520 -n -i any -w "<
https://jenkins.osmocom.org/jenkins/job/ttcn3-5gc-test-ogs/503/artifact/log…
"> ><
https://jenkins.osmocom.org/jenkins/job/ttcn3-5gc-test-ogs/503/artifact/log…
> 2>/tmp/cmderr & Waiting for packet dumper to start... 0 [1;34m[testenv] Stopping podman container[0m [0;94m[testenv] + ['podman', 'kill', 'testenv-5gc-osmocom-nightly-20261008-0929-688f4e76-1'][0m testenv-5gc-osmocom-nightly-20261008-0929-688f4e76-1 [0;94m[testenv] Skipping clean up scripts, podman container has already stopped[0m [1;34m[testenv] Stopping testsuite (1535670)[0m [0;94m[testenv] feed_watchdog_loop: podman container has stopped[0m [1;34m[testenv] Logs saved to:
https://jenkins.osmocom.org/jenkins/job/ttcn3-5gc-test-ogs/503/artifact/log…
[0m + RC=1 + [ 1 = 0 ] + uptime + grep --color=always -o load.* [01;31m[Kload average: 13.37, 5.91, 5.67[m[K + exit 1 Build step 'Execute shell' marked build as failure Recording test results [Checks API] No suitable checks publisher found.
1
0
0
0
Build failed in Jenkins: ttcn3-sccp-test-asan #852
by jenkins@lists.osmocom.org
07 Oct '26
07 Oct '26
See <
https://jenkins.osmocom.org/jenkins/job/ttcn3-sccp-test-asan/852/display/re…
> Changes: [Oliver Smith] testenv: podman: always mount osmo-dev dir [Oliver Smith] testenv: run osmo-dev logic for --binary-repo too [Oliver Smith] testenv: cmd: init_env: split up by envtype [Oliver Smith] testenv: build package=no components with osmo-dev [Oliver Smith] bts: use osmo-dev to build osmo-trx-proxy, trxcon ------------------------------------------ Started by timer Running as SYSTEM Building remotely on build5-deb12build-ansible (ttcn3 obs osmo-gsm-tester-build qemu io_uring linux-shallow-clone osmocom-gerrit coverity osmocom-master) in workspace <
https://jenkins.osmocom.org/jenkins/job/ttcn3-sccp-test-asan/ws/
> The recommended git tool is: NONE No credentials specified Cloning the remote Git repository Cloning repository
https://gerrit.osmocom.org/osmo-ttcn3-hacks
> git init <
https://jenkins.osmocom.org/jenkins/job/ttcn3-sccp-test-asan/ws/src/osmo-tt…
> # timeout=10 Fetching upstream changes from
https://gerrit.osmocom.org/osmo-ttcn3-hacks
> git --version # timeout=10 > git --version # 'git version 2.39.5' > git fetch --tags --force --progress --
https://gerrit.osmocom.org/osmo-ttcn3-hacks
+refs/heads/*:refs/remotes/origin/* # timeout=10 > git config remote.origin.url
https://gerrit.osmocom.org/osmo-ttcn3-hacks
# timeout=10 > git config --add remote.origin.fetch +refs/heads/*:refs/remotes/origin/* # timeout=10 Avoid second fetch > git rev-parse origin/master^{commit} # timeout=10 Checking out Revision e48c4f51701bcd10519875d007b10b7c1f7eac5a (origin/master) > git config core.sparsecheckout # timeout=10 > git checkout -f e48c4f51701bcd10519875d007b10b7c1f7eac5a # timeout=10 Commit message: "bts: use osmo-dev to build osmo-trx-proxy, trxcon" > git rev-list --no-walk 26d06400905af7489a5115a303ff7fb512aefac9 # timeout=10 Copied 1 artifact from "build-kernel-none" build number 1 [ttcn3-sccp-test-asan] $ /bin/sh -xe /tmp/jenkins9817518455657725962.sh + DISTRO=debian:trixie + echo debian:trixie + tr : - +
IMAGE=registry.osmocom.org/osmocom-build/debian-trixie-osmo-ttcn3-testenv
+ KERNEL=none + echo False + tr [:upper:] [:lower:] + INIT_OSMO_DEV=false + podman pull
registry.osmocom.org/osmocom-build/debian-trixie-osmo-ttcn3-testenv
Trying to pull
registry.osmocom.org/osmocom-build/debian-trixie-osmo-ttcn3-testenv:latest
... Getting image source signatures Copying blob sha256:7fa13ad30526db36a65dae4fb3e12004c819bc9e992d312bb16d15fad7bfff07 Copying blob sha256:9bbee2b358614f45b0789da707cba82c7c94ccc80d1945afaa22e4f2aa813cb0 Copying blob sha256:bd9ddc54bea929a22b334e73e026d4136e5b73f5cc29942896c72e4ece69b13d Copying blob sha256:c4332ef953ab372a071c9279caa8e70fb96ced408f666a2d885035521afd8dda Copying blob sha256:e3e75bd290920ff882ee81af050e3b07004d3191548cd240a05347b506c6373c Copying blob sha256:745970bb62b6f7d7540c985525f372aa3a26b0117e6dff07bbd663e4210ec9e5 Copying blob sha256:1e86b21d995ec039f4fb8eba96ce9338aac6eed24451a6eff347843b90c0d5b7 Copying blob sha256:42b088c91ab829f015b1ebafb84902dfecf1691d99a6047e351fba5fdadf279e Copying blob sha256:8efb1e4560fcdff7ba0f50126316e6a63d2c74d91c1ca2510cf8460d611ae048 Copying blob sha256:5be4b5ac7424118296fe79b0c9d6cf23f721dda03f1aaf90988aca419e7f227d Copying config sha256:de96c729fb8e5f9d8860f41d84dc70f85db7283453139e0ade0442bdd59f1083 Writing manifest to image destination Storing signatures de96c729fb8e5f9d8860f41d84dc70f85db7283453139e0ade0442bdd59f1083 + [ -e cache/podman/var-*-apt-*/*/partial ] + rm -rf logs cache src/osmo-ttcn3-hacks/.linux + [ none = none ] + rm linux + set +x + uptime + grep --color=always -o load.* [01;31m[Kload average: 0.75, 0.61, 0.70[m[K + false + RC=0 + src/osmo-ttcn3-hacks/testenv.py run sccp --podman --cache <
https://jenkins.osmocom.org/jenkins/job/ttcn3-sccp-test-asan/ws/cache
> --ccache /home/osmocom-build/ccache/testenv --log-dir <
https://jenkins.osmocom.org/jenkins/job/ttcn3-sccp-test-asan/ws/logs
> -b osmocom:nightly:asan [1;91m[testenv] Missing osmo-dev for building test components from source.[0m [1;91m[testenv] Run 'testenv.py init osmo-dev' first.[0m [1;91m[testenv] [0m [1;91m[testenv] osmo-dev and other Osmocom repositories (if they don't already exist) will be cloned to:[0m [1;91m[testenv] <
https://jenkins.osmocom.org/jenkins/job/ttcn3-sccp-test-asan/ws/src[0m
> [1;91m[testenv] [0m [1;91m[testenv] Set the environment variable TESTENV_SRC_DIR to use a different path.[0m + RC=1 + [ 1 = 0 ] + + grep --color=always -ouptime load.* [01;31m[Kload average: 0.75, 0.61, 0.70[m[K + exit 1 Build step 'Execute shell' marked build as failure Recording test results ERROR: Step ‘Publish JUnit test result report’ failed: No test report files were found. Configuration error?
1
1
0
0
Build failed in Jenkins: ttcn3-ns-test-sgsn-sns-asan #547
by jenkins@lists.osmocom.org
07 Oct '26
07 Oct '26
See <
https://jenkins.osmocom.org/jenkins/job/ttcn3-ns-test-sgsn-sns-asan/547/dis…
> Changes: [Oliver Smith] testenv: podman: always mount osmo-dev dir [Oliver Smith] testenv: run osmo-dev logic for --binary-repo too [Oliver Smith] testenv: cmd: init_env: split up by envtype [Oliver Smith] testenv: build package=no components with osmo-dev [Oliver Smith] bts: use osmo-dev to build osmo-trx-proxy, trxcon ------------------------------------------ Started by timer Running as SYSTEM Building remotely on build4-deb12build-ansible (ttcn3 obs osmo-gsm-tester-build qemu io_uring linux-shallow-clone osmocom-gerrit coverity osmocom-master) in workspace <
https://jenkins.osmocom.org/jenkins/job/ttcn3-ns-test-sgsn-sns-asan/ws/
> The recommended git tool is: NONE No credentials specified Cloning the remote Git repository Cloning repository
https://gerrit.osmocom.org/osmo-ttcn3-hacks
> git init <
https://jenkins.osmocom.org/jenkins/job/ttcn3-ns-test-sgsn-sns-asan/ws/src/…
> # timeout=10 Fetching upstream changes from
https://gerrit.osmocom.org/osmo-ttcn3-hacks
> git --version # timeout=10 > git --version # 'git version 2.39.5' > git fetch --tags --force --progress --
https://gerrit.osmocom.org/osmo-ttcn3-hacks
+refs/heads/*:refs/remotes/origin/* # timeout=10 > git config remote.origin.url
https://gerrit.osmocom.org/osmo-ttcn3-hacks
# timeout=10 > git config --add remote.origin.fetch +refs/heads/*:refs/remotes/origin/* # timeout=10 Avoid second fetch > git rev-parse origin/master^{commit} # timeout=10 Checking out Revision e48c4f51701bcd10519875d007b10b7c1f7eac5a (origin/master) > git config core.sparsecheckout # timeout=10 > git checkout -f e48c4f51701bcd10519875d007b10b7c1f7eac5a # timeout=10 Commit message: "bts: use osmo-dev to build osmo-trx-proxy, trxcon" > git rev-list --no-walk 26d06400905af7489a5115a303ff7fb512aefac9 # timeout=10 Copied 1 artifact from "build-kernel-none" build number 1 [ttcn3-ns-test-sgsn-sns-asan] $ /bin/sh -xe /tmp/jenkins3677863447421604426.sh + DISTRO=debian:trixie + echo debian:trixie + tr : - +
IMAGE=registry.osmocom.org/osmocom-build/debian-trixie-osmo-ttcn3-testenv
+ KERNEL=none + echo False + tr [:upper:] [:lower:] + INIT_OSMO_DEV=false + podman pull
registry.osmocom.org/osmocom-build/debian-trixie-osmo-ttcn3-testenv
Trying to pull
registry.osmocom.org/osmocom-build/debian-trixie-osmo-ttcn3-testenv:latest
... Getting image source signatures Copying blob sha256:7fa13ad30526db36a65dae4fb3e12004c819bc9e992d312bb16d15fad7bfff07 Copying blob sha256:9bbee2b358614f45b0789da707cba82c7c94ccc80d1945afaa22e4f2aa813cb0 Copying blob sha256:bd9ddc54bea929a22b334e73e026d4136e5b73f5cc29942896c72e4ece69b13d Copying blob sha256:c4332ef953ab372a071c9279caa8e70fb96ced408f666a2d885035521afd8dda Copying blob sha256:745970bb62b6f7d7540c985525f372aa3a26b0117e6dff07bbd663e4210ec9e5 Copying blob sha256:e3e75bd290920ff882ee81af050e3b07004d3191548cd240a05347b506c6373c Copying blob sha256:1e86b21d995ec039f4fb8eba96ce9338aac6eed24451a6eff347843b90c0d5b7 Copying blob sha256:42b088c91ab829f015b1ebafb84902dfecf1691d99a6047e351fba5fdadf279e Copying blob sha256:8efb1e4560fcdff7ba0f50126316e6a63d2c74d91c1ca2510cf8460d611ae048 Copying blob sha256:5be4b5ac7424118296fe79b0c9d6cf23f721dda03f1aaf90988aca419e7f227d Copying config sha256:de96c729fb8e5f9d8860f41d84dc70f85db7283453139e0ade0442bdd59f1083 Writing manifest to image destination Storing signatures de96c729fb8e5f9d8860f41d84dc70f85db7283453139e0ade0442bdd59f1083 + [ -e cache/podman/var-*-apt-*/*/partial ] + rm -rf logs cache src/osmo-ttcn3-hacks/.linux + [ none = none ] + rm linux + set +x + uptime + grep --color=always -o load.* [01;31m[Kload average: 0.95, 1.01, 1.34[m[K + false + RC=0 + src/osmo-ttcn3-hacks/testenv.py run ns --podman --cache <
https://jenkins.osmocom.org/jenkins/job/ttcn3-ns-test-sgsn-sns-asan/ws/cache
> --ccache /home/osmocom-build/ccache/testenv --log-dir <
https://jenkins.osmocom.org/jenkins/job/ttcn3-ns-test-sgsn-sns-asan/ws/logs
> -b osmocom:nightly:asan -c sgsn_sns [1;91m[testenv] Missing osmo-dev for building test components from source.[0m [1;91m[testenv] Run 'testenv.py init osmo-dev' first.[0m [1;91m[testenv] [0m [1;91m[testenv] osmo-dev and other Osmocom repositories (if they don't already exist) will be cloned to:[0m [1;91m[testenv] <
https://jenkins.osmocom.org/jenkins/job/ttcn3-ns-test-sgsn-sns-asan/ws/src…
> [1;91m[testenv] [0m [1;91m[testenv] Set the environment variable TESTENV_SRC_DIR to use a different path.[0m + RC=1 + [ 1 = 0 ] + uptime + grep --color=always -o load.* [01;31m[Kload average: 0.95, 1.01, 1.34[m[K + exit 1 Build step 'Execute shell' marked build as failure Recording test results ERROR: Step ‘Publish JUnit test result report’ failed: No test report files were found. Configuration error?
1
1
0
0
Build failed in Jenkins: ttcn3-ns-test-asan #547
by jenkins@lists.osmocom.org
07 Oct '26
07 Oct '26
See <
https://jenkins.osmocom.org/jenkins/job/ttcn3-ns-test-asan/547/display/redi…
> Changes: [Oliver Smith] testenv: podman: always mount osmo-dev dir [Oliver Smith] testenv: run osmo-dev logic for --binary-repo too [Oliver Smith] testenv: cmd: init_env: split up by envtype [Oliver Smith] testenv: build package=no components with osmo-dev [Oliver Smith] bts: use osmo-dev to build osmo-trx-proxy, trxcon ------------------------------------------ Started by timer Running as SYSTEM Building remotely on build5-deb12build-ansible (ttcn3 obs osmo-gsm-tester-build qemu io_uring linux-shallow-clone osmocom-gerrit coverity osmocom-master) in workspace <
https://jenkins.osmocom.org/jenkins/job/ttcn3-ns-test-asan/ws/
> The recommended git tool is: NONE No credentials specified Cloning the remote Git repository Cloning repository
https://gerrit.osmocom.org/osmo-ttcn3-hacks
> git init <
https://jenkins.osmocom.org/jenkins/job/ttcn3-ns-test-asan/ws/src/osmo-ttcn…
> # timeout=10 Fetching upstream changes from
https://gerrit.osmocom.org/osmo-ttcn3-hacks
> git --version # timeout=10 > git --version # 'git version 2.39.5' > git fetch --tags --force --progress --
https://gerrit.osmocom.org/osmo-ttcn3-hacks
+refs/heads/*:refs/remotes/origin/* # timeout=10 > git config remote.origin.url
https://gerrit.osmocom.org/osmo-ttcn3-hacks
# timeout=10 > git config --add remote.origin.fetch +refs/heads/*:refs/remotes/origin/* # timeout=10 Avoid second fetch > git rev-parse origin/master^{commit} # timeout=10 Checking out Revision e48c4f51701bcd10519875d007b10b7c1f7eac5a (origin/master) > git config core.sparsecheckout # timeout=10 > git checkout -f e48c4f51701bcd10519875d007b10b7c1f7eac5a # timeout=10 Commit message: "bts: use osmo-dev to build osmo-trx-proxy, trxcon" > git rev-list --no-walk 26d06400905af7489a5115a303ff7fb512aefac9 # timeout=10 Copied 1 artifact from "build-kernel-none" build number 1 [ttcn3-ns-test-asan] $ /bin/sh -xe /tmp/jenkins4186170195933451598.sh + DISTRO=debian:trixie + echo debian:trixie + tr : - +
IMAGE=registry.osmocom.org/osmocom-build/debian-trixie-osmo-ttcn3-testenv
+ KERNEL=none + echo False + tr [:upper:] [:lower:] + INIT_OSMO_DEV=false + podman pull
registry.osmocom.org/osmocom-build/debian-trixie-osmo-ttcn3-testenv
Trying to pull
registry.osmocom.org/osmocom-build/debian-trixie-osmo-ttcn3-testenv:latest
... Getting image source signatures Copying blob sha256:7fa13ad30526db36a65dae4fb3e12004c819bc9e992d312bb16d15fad7bfff07 Copying blob sha256:9bbee2b358614f45b0789da707cba82c7c94ccc80d1945afaa22e4f2aa813cb0 Copying blob sha256:745970bb62b6f7d7540c985525f372aa3a26b0117e6dff07bbd663e4210ec9e5 Copying blob sha256:e3e75bd290920ff882ee81af050e3b07004d3191548cd240a05347b506c6373c Copying blob sha256:c4332ef953ab372a071c9279caa8e70fb96ced408f666a2d885035521afd8dda Copying blob sha256:bd9ddc54bea929a22b334e73e026d4136e5b73f5cc29942896c72e4ece69b13d Copying blob sha256:1e86b21d995ec039f4fb8eba96ce9338aac6eed24451a6eff347843b90c0d5b7 Copying blob sha256:42b088c91ab829f015b1ebafb84902dfecf1691d99a6047e351fba5fdadf279e Copying blob sha256:8efb1e4560fcdff7ba0f50126316e6a63d2c74d91c1ca2510cf8460d611ae048 Copying blob sha256:5be4b5ac7424118296fe79b0c9d6cf23f721dda03f1aaf90988aca419e7f227d Copying config sha256:de96c729fb8e5f9d8860f41d84dc70f85db7283453139e0ade0442bdd59f1083 Writing manifest to image destination Storing signatures de96c729fb8e5f9d8860f41d84dc70f85db7283453139e0ade0442bdd59f1083 + [ -e cache/podman/var-*-apt-*/*/partial ] + rm -rf logs cache src/osmo-ttcn3-hacks/.linux + [ none = none ] + rm linux + set +x + uptime + grep --color=always -o load.* [01;31m[Kload average: 1.17, 0.95, 0.93[m[K + false + RC=0 + src/osmo-ttcn3-hacks/testenv.py run ns --podman --cache <
https://jenkins.osmocom.org/jenkins/job/ttcn3-ns-test-asan/ws/cache
> --ccache /home/osmocom-build/ccache/testenv --log-dir <
https://jenkins.osmocom.org/jenkins/job/ttcn3-ns-test-asan/ws/logs
> -b osmocom:nightly:asan -c udp [1;91m[testenv] Missing osmo-dev for building test components from source.[0m [1;91m[testenv] Run 'testenv.py init osmo-dev' first.[0m [1;91m[testenv] [0m [1;91m[testenv] osmo-dev and other Osmocom repositories (if they don't already exist) will be cloned to:[0m [1;91m[testenv] <
https://jenkins.osmocom.org/jenkins/job/ttcn3-ns-test-asan/ws/src[0m
> [1;91m[testenv] [0m [1;91m[testenv] Set the environment variable TESTENV_SRC_DIR to use a different path.[0m + RC=1 + [ 1 = 0 ] + + uptime grep --color=always -o load.* [01;31m[Kload average: 1.17, 0.95, 0.93[m[K + exit 1 Build step 'Execute shell' marked build as failure Recording test results ERROR: Step ‘Publish JUnit test result report’ failed: No test report files were found. Configuration error?
1
1
0
0
Build failed in Jenkins: ttcn3-ns-test-sns-asan #547
by jenkins@lists.osmocom.org
07 Oct '26
07 Oct '26
See <
https://jenkins.osmocom.org/jenkins/job/ttcn3-ns-test-sns-asan/547/display/…
> Changes: [Oliver Smith] testenv: podman: always mount osmo-dev dir [Oliver Smith] testenv: run osmo-dev logic for --binary-repo too [Oliver Smith] testenv: cmd: init_env: split up by envtype [Oliver Smith] testenv: build package=no components with osmo-dev [Oliver Smith] bts: use osmo-dev to build osmo-trx-proxy, trxcon ------------------------------------------ Started by timer Running as SYSTEM Building remotely on build5-deb12build-ansible (ttcn3 obs osmo-gsm-tester-build qemu io_uring linux-shallow-clone osmocom-gerrit coverity osmocom-master) in workspace <
https://jenkins.osmocom.org/jenkins/job/ttcn3-ns-test-sns-asan/ws/
> The recommended git tool is: NONE No credentials specified Cloning the remote Git repository Cloning repository
https://gerrit.osmocom.org/osmo-ttcn3-hacks
> git init <
https://jenkins.osmocom.org/jenkins/job/ttcn3-ns-test-sns-asan/ws/src/osmo-…
> # timeout=10 Fetching upstream changes from
https://gerrit.osmocom.org/osmo-ttcn3-hacks
> git --version # timeout=10 > git --version # 'git version 2.39.5' > git fetch --tags --force --progress --
https://gerrit.osmocom.org/osmo-ttcn3-hacks
+refs/heads/*:refs/remotes/origin/* # timeout=10 > git config remote.origin.url
https://gerrit.osmocom.org/osmo-ttcn3-hacks
# timeout=10 > git config --add remote.origin.fetch +refs/heads/*:refs/remotes/origin/* # timeout=10 Avoid second fetch > git rev-parse origin/master^{commit} # timeout=10 Checking out Revision e48c4f51701bcd10519875d007b10b7c1f7eac5a (origin/master) > git config core.sparsecheckout # timeout=10 > git checkout -f e48c4f51701bcd10519875d007b10b7c1f7eac5a # timeout=10 Commit message: "bts: use osmo-dev to build osmo-trx-proxy, trxcon" > git rev-list --no-walk 26d06400905af7489a5115a303ff7fb512aefac9 # timeout=10 Copied 1 artifact from "build-kernel-none" build number 1 [ttcn3-ns-test-sns-asan] $ /bin/sh -xe /tmp/jenkins6735514246662958114.sh + DISTRO=debian:trixie + echo debian:trixie + tr : - +
IMAGE=registry.osmocom.org/osmocom-build/debian-trixie-osmo-ttcn3-testenv
+ KERNEL=none + echo False + tr [:upper:] [:lower:] + INIT_OSMO_DEV=false + podman pull
registry.osmocom.org/osmocom-build/debian-trixie-osmo-ttcn3-testenv
Trying to pull
registry.osmocom.org/osmocom-build/debian-trixie-osmo-ttcn3-testenv:latest
... Getting image source signatures Copying blob sha256:7fa13ad30526db36a65dae4fb3e12004c819bc9e992d312bb16d15fad7bfff07 Copying blob sha256:bd9ddc54bea929a22b334e73e026d4136e5b73f5cc29942896c72e4ece69b13d Copying blob sha256:9bbee2b358614f45b0789da707cba82c7c94ccc80d1945afaa22e4f2aa813cb0 Copying blob sha256:745970bb62b6f7d7540c985525f372aa3a26b0117e6dff07bbd663e4210ec9e5 Copying blob sha256:c4332ef953ab372a071c9279caa8e70fb96ced408f666a2d885035521afd8dda Copying blob sha256:e3e75bd290920ff882ee81af050e3b07004d3191548cd240a05347b506c6373c Copying blob sha256:1e86b21d995ec039f4fb8eba96ce9338aac6eed24451a6eff347843b90c0d5b7 Copying blob sha256:42b088c91ab829f015b1ebafb84902dfecf1691d99a6047e351fba5fdadf279e Copying blob sha256:8efb1e4560fcdff7ba0f50126316e6a63d2c74d91c1ca2510cf8460d611ae048 Copying blob sha256:5be4b5ac7424118296fe79b0c9d6cf23f721dda03f1aaf90988aca419e7f227d Copying config sha256:de96c729fb8e5f9d8860f41d84dc70f85db7283453139e0ade0442bdd59f1083 Writing manifest to image destination Storing signatures de96c729fb8e5f9d8860f41d84dc70f85db7283453139e0ade0442bdd59f1083 + [ -e cache/podman/var-*-apt-*/*/partial ] + rm -rf logs cache src/osmo-ttcn3-hacks/.linux + [ none = none ] + rm linux + set +x + uptime + grep --color=always -o load.* [01;31m[Kload average: 1.08, 0.98, 0.99[m[K + false + RC=0 + src/osmo-ttcn3-hacks/testenv.py run ns --podman --cache <
https://jenkins.osmocom.org/jenkins/job/ttcn3-ns-test-sns-asan/ws/cache
> --ccache /home/osmocom-build/ccache/testenv --log-dir <
https://jenkins.osmocom.org/jenkins/job/ttcn3-ns-test-sns-asan/ws/logs
> -b osmocom:nightly:asan -c sns [1;91m[testenv] Missing osmo-dev for building test components from source.[0m [1;91m[testenv] Run 'testenv.py init osmo-dev' first.[0m [1;91m[testenv] [0m [1;91m[testenv] osmo-dev and other Osmocom repositories (if they don't already exist) will be cloned to:[0m [1;91m[testenv] <
https://jenkins.osmocom.org/jenkins/job/ttcn3-ns-test-sns-asan/ws/src[0m
> [1;91m[testenv] [0m [1;91m[testenv] Set the environment variable TESTENV_SRC_DIR to use a different path.[0m + RC=1 + [ 1 = 0 ] + uptime + grep --color=always -o load.* [01;31m[Kload average: 1.08, 0.98, 0.99[m[K + exit 1 Build step 'Execute shell' marked build as failure Recording test results ERROR: Step ‘Publish JUnit test result report’ failed: No test report files were found. Configuration error?
1
1
0
0
← Newer
1
2
3
4
Older →
Jump to page:
1
2
3
4
Results per page:
10
25
50
100
200