lists.osmocom.org
Sign In
Sign Up
Sign In
Sign Up
Manage this list
×
Keyboard Shortcuts
Thread View
j
: Next unread message
k
: Previous unread message
j a
: Jump to all threads
j l
: Jump to MailingList overview
2025
August
July
June
May
April
March
February
January
2024
December
November
October
September
August
July
June
May
April
March
February
January
2023
December
November
October
September
August
July
June
May
April
March
February
January
2022
December
November
October
September
August
July
June
May
April
March
February
January
2021
December
November
October
September
August
July
June
May
April
March
February
January
2020
December
November
October
September
August
July
June
May
April
March
February
January
2019
December
November
October
September
August
July
June
May
April
March
List overview
Download
jenkins-notifications
August 2025
----- 2025 -----
August 2025
July 2025
June 2025
May 2025
April 2025
March 2025
February 2025
January 2025
----- 2024 -----
December 2024
November 2024
October 2024
September 2024
August 2024
July 2024
June 2024
May 2024
April 2024
March 2024
February 2024
January 2024
----- 2023 -----
December 2023
November 2023
October 2023
September 2023
August 2023
July 2023
June 2023
May 2023
April 2023
March 2023
February 2023
January 2023
----- 2022 -----
December 2022
November 2022
October 2022
September 2022
August 2022
July 2022
June 2022
May 2022
April 2022
March 2022
February 2022
January 2022
----- 2021 -----
December 2021
November 2021
October 2021
September 2021
August 2021
July 2021
June 2021
May 2021
April 2021
March 2021
February 2021
January 2021
----- 2020 -----
December 2020
November 2020
October 2020
September 2020
August 2020
July 2020
June 2020
May 2020
April 2020
March 2020
February 2020
January 2020
----- 2019 -----
December 2019
November 2019
October 2019
September 2019
August 2019
July 2019
June 2019
May 2019
April 2019
March 2019
jenkins-notifications@lists.osmocom.org
1 participants
43 discussions
Start a n
N
ew thread
Build failed in Jenkins: ttcn3-s1gw-test #445
by jenkins@lists.osmocom.org
See <
https://jenkins.osmocom.org/jenkins/job/ttcn3-s1gw-test/445/display/redirec…
> Changes: [Oliver Smith] testenv: install curl backport only for bookworm [Oliver Smith] Cosmetic: testenv: make builddir_env more readable [laforge] msc: also execute evil USSD tests for -latest [Oliver Smith] testenv: use separate cache dirs per distro [Oliver Smith] testenv: init podman: add --distro arg [Oliver Smith] testenv: debian 13: fix installing libgcc [Oliver Smith] testenv: debian 13: fix installing eclipse-titan [Oliver Smith] testenv: check for --distro without --podman [Oliver Smith] testenv: check value of --distro early [Oliver Smith] testenv: add debian:trixie [Oliver Smith] testenv: enable_binary_repo: configure apt pin [Oliver Smith] testenv: set default distro to debian:trixie [Oliver Smith] testenv: qemu: ignore builtin modules ------------------------------------------ [...truncated 40.84 KiB...] CCLD S1AP_Server_part_6.so CCLD S1AP_Server_part_7.so CCLD S1AP_Templates_part_1.so CCLD S1AP_Templates_part_2.so CCLD S1AP_Templates_part_3.so CCLD S1AP_Templates_part_4.so CCLD S1AP_Templates_part_5.so CCLD S1AP_Templates_part_6.so CCLD S1AP_Templates_part_7.so CCLD S1AP_Types_part_1.so CCLD S1AP_Types_part_2.so CCLD S1AP_Types_part_3.so CCLD S1AP_Types_part_4.so CCLD S1AP_Types_part_5.so CCLD S1AP_Types_part_6.so CCLD S1AP_Types_part_7.so CCLD S1GW_ConnHdlr_part_1.so CCLD S1GW_ConnHdlr_part_2.so CCLD S1GW_ConnHdlr_part_3.so CCLD S1GW_ConnHdlr_part_4.so CCLD S1GW_ConnHdlr_part_5.so CCLD S1GW_ConnHdlr_part_6.so CCLD S1GW_ConnHdlr_part_7.so CCLD S1GW_Tests_part_1.so CCLD S1GW_Tests_part_2.so CCLD S1GW_Tests_part_3.so CCLD S1GW_Tests_part_4.so CCLD S1GW_Tests_part_5.so CCLD S1GW_Tests_part_6.so CCLD S1GW_Tests_part_7.so CCLD S1GW_UEMux_part_1.so CCLD S1GW_UEMux_part_2.so CCLD S1GW_UEMux_part_3.so CCLD S1GW_UEMux_part_4.so CCLD S1GW_UEMux_part_5.so CCLD S1GW_UEMux_part_6.so CCLD S1GW_UEMux_part_7.so CCLD SCTP_Templates_part_1.so CCLD SCTP_Templates_part_2.so CCLD SCTP_Templates_part_3.so CCLD SCTP_Templates_part_4.so CCLD SCTP_Templates_part_5.so CCLD SCTP_Templates_part_6.so CCLD SCTP_Templates_part_7.so CCLD Socket_API_Definitions_part_1.so CCLD Socket_API_Definitions_part_2.so CCLD Socket_API_Definitions_part_3.so CCLD Socket_API_Definitions_part_4.so CCLD Socket_API_Definitions_part_5.so CCLD Socket_API_Definitions_part_6.so CCLD Socket_API_Definitions_part_7.so CCLD StatsD_CodecPort_part_1.so CCLD StatsD_CodecPort_part_2.so CCLD StatsD_CodecPort_part_3.so CCLD StatsD_CodecPort_part_4.so CCLD StatsD_CodecPort_part_6.so CCLD StatsD_CodecPort_part_5.so CCLD StatsD_CodecPort_part_7.so CCLD StatsD_CodecPort_CtrlFunct_part_1.so CCLD StatsD_CodecPort_CtrlFunct_part_2.so CCLD StatsD_CodecPort_CtrlFunct_part_3.so CCLD StatsD_CodecPort_CtrlFunct_part_4.so CCLD StatsD_CodecPort_CtrlFunct_part_5.so CCLD StatsD_CodecPort_CtrlFunct_part_6.so CCLD StatsD_CodecPort_CtrlFunct_part_7.so CCLD StatsD_Types_part_1.so CCLD StatsD_Types_part_2.so CCLD StatsD_Types_part_3.so CCLD StatsD_Types_part_4.so CCLD StatsD_Types_part_5.so CCLD StatsD_Types_part_6.so CCLD StatsD_Types_part_7.so CCLD TCCConversion_Functions_part_1.so CCLD TCCConversion_Functions_part_2.so CCLD TCCConversion_Functions_part_3.so CCLD TCCConversion_Functions_part_4.so CCLD TCCConversion_Functions_part_5.so CCLD TCCConversion_Functions_part_6.so CCLD TCCConversion_Functions_part_7.so CCLD TCCEncoding_Functions_part_1.so CCLD TCCEncoding_Functions_part_2.so CCLD TCCEncoding_Functions_part_3.so CCLD TCCEncoding_Functions_part_4.so CCLD TCCEncoding_Functions_part_5.so CCLD TCCEncoding_Functions_part_6.so CCLD TCCEncoding_Functions_part_7.so CCLD TCCInterface_Functions_part_1.so CCLD TCCInterface_Functions_part_2.so CCLD TCCInterface_Functions_part_3.so CCLD TCCInterface_Functions_part_4.so CCLD TCCInterface_Functions_part_5.so CCLD TCCInterface_Functions_part_6.so CCLD TCCInterface_Functions_part_7.so CCLD StatsD_Checker.so CCLD StatsD_Checker_part_1.so CCLD StatsD_Checker_part_2.so CCLD StatsD_Checker_part_3.so CCLD StatsD_Checker_part_4.so CCLD StatsD_Checker_part_5.so CCLD StatsD_Checker_part_6.so CCLD StatsD_Checker_part_7.so CCLD S1AP_CommonDataTypes.so CCLD S1AP_Constants.so CCLD S1AP_Containers.so CCLD S1AP_PDU_Contents.so CCLD S1AP_IEs.so CCLD S1AP_PDU_Descriptions.so CCLD S1AP_CommonDataTypes_part_1.so CCLD S1AP_CommonDataTypes_part_2.so CCLD S1AP_CommonDataTypes_part_3.so CCLD S1AP_CommonDataTypes_part_4.so CCLD S1AP_CommonDataTypes_part_5.so CCLD S1AP_CommonDataTypes_part_6.so CCLD S1AP_CommonDataTypes_part_7.so CCLD S1AP_Constants_part_1.so CCLD S1AP_Constants_part_2.so CCLD S1AP_Constants_part_3.so CCLD S1AP_Constants_part_4.so CCLD S1AP_Constants_part_5.so CCLD S1AP_Constants_part_6.so CCLD S1AP_Constants_part_7.so CCLD S1AP_Containers_part_1.so CCLD S1AP_Containers_part_2.so CCLD S1AP_Containers_part_3.so CCLD S1AP_Containers_part_4.so CCLD S1AP_Containers_part_5.so CCLD S1AP_Containers_part_6.so CCLD S1AP_Containers_part_7.so CCLD S1AP_PDU_Contents_part_7.so CCLD S1AP_PDU_Descriptions_part_1.so CCLD S1AP_PDU_Descriptions_part_2.so CCLD S1AP_PDU_Descriptions_part_3.so CCLD S1AP_PDU_Descriptions_part_4.so CCLD S1AP_PDU_Descriptions_part_5.so CCLD S1AP_PDU_Descriptions_part_6.so CCLD S1AP_PDU_Descriptions_part_7.so CCLD IPL4asp_PT.so CCLD IPL4asp_discovery.so CCLD Native_FunctionDefs.so CCLD PFCP_CodecPort_CtrlFunctDef.so CCLD S1AP_CodecPort_CtrlFunctDef.so CCLD S1AP_EncDec.so CCLD StatsD_CodecPort_CtrlFunctdef.so CCLD TCCConversion.so CCLD TCCEncoding.so CCLD TCCInterface.so CCLD S1AP_IEs_part_7.so CCLD PFCP_Types_part_1.so CCLD S1AP_PDU_Contents_part_1.so CCLD S1AP_IEs_part_4.so CCLD S1AP_IEs_part_1.so CCLD S1AP_IEs_part_6.so CCLD S1AP_IEs_part_3.so CCLD S1AP_PDU_Contents_part_3.so CCLD S1AP_PDU_Contents_part_2.so CCLD S1AP_IEs_part_5.so CCLD S1AP_PDU_Contents_part_4.so CCLD S1AP_IEs_part_2.so CCLD S1AP_PDU_Contents_part_6.so CCLD S1AP_PDU_Contents_part_5.so CCLD S1GW_Tests make[1]: Leaving directory '<
https://jenkins.osmocom.org/jenkins/job/ttcn3-s1gw-test/ws/_cache/podman/ti…
'> [0;94m[testenv] + ['podman', 'exec', '-e', 'CCACHE_DIR=/home/osmocom-build/ccache/testenv', '-e', 'TESTENV_CACHE_DIR=<
https://jenkins.osmocom.org/jenkins/job/ttcn3-s1gw-test/ws/_cache
',> '-e', 'TESTENV_SRC_DIR=/home/osmocom-build/jenkins/workspace', '-e', 'TESTENV_INSTALL_DIR=/-debian-trixie', '-e', 'TERM=dumb', '-e', 'PATH=<
https://jenkins.osmocom.org/jenkins/job/ttcn3-s1gw-test/ws/_testenv/data/sc…
>:<
https://jenkins.osmocom.org/jenkins/job/ttcn3-s1gw-test/ws/_testenv/data/sc…
>:<
https://jenkins.osmocom.org/jenkins/job/ttcn3-s1gw-test/ws/s1gw
>:/-debian-trixie/bin:/-debian-trixie/usr/bin:/usr/local/bin:/usr/sbin:/usr/bin:/sbin:/bin', '-e', 'HOME=/home/osmocom-build', '-t', 'testenv-s1gw-osmocom-nightly-20250828-0903-cb7fd018-0', 'sh', '-c', "echo 'deb [signed-by=/obs.key]
https://downloads.osmocom.org/packages/osmocom:/nightly/Debian_13/
./' > /etc/apt/sources.list.d/osmocom.list"][0m [0;94m[testenv] + ['podman', 'exec', '-e', 'CCACHE_DIR=/home/osmocom-build/ccache/testenv', '-e', 'TESTENV_CACHE_DIR=<
https://jenkins.osmocom.org/jenkins/job/ttcn3-s1gw-test/ws/_cache
',> '-e', 'TESTENV_SRC_DIR=/home/osmocom-build/jenkins/workspace', '-e', 'TESTENV_INSTALL_DIR=/-debian-trixie', '-e', 'TERM=dumb', '-e', 'PATH=<
https://jenkins.osmocom.org/jenkins/job/ttcn3-s1gw-test/ws/_testenv/data/sc…
>:<
https://jenkins.osmocom.org/jenkins/job/ttcn3-s1gw-test/ws/_testenv/data/sc…
>:<
https://jenkins.osmocom.org/jenkins/job/ttcn3-s1gw-test/ws/s1gw
>:/-debian-trixie/bin:/-debian-trixie/usr/bin:/usr/local/bin:/usr/sbin:/usr/bin:/sbin:/bin', '-e', 'HOME=/home/osmocom-build', '-t', 'testenv-s1gw-osmocom-nightly-20250828-0903-cb7fd018-0', 'sh', '-c', 'echo \'Package: *\nPin: origin "
downloads.osmocom.org
"\nPin-Priority: 1100\n\' > /etc/apt/preferences.d/osmocom-apt-pin'][0m [0;94m[testenv] + ['podman', 'exec', '-e', 'CCACHE_DIR=/home/osmocom-build/ccache/testenv', '-e', 'TESTENV_CACHE_DIR=<
https://jenkins.osmocom.org/jenkins/job/ttcn3-s1gw-test/ws/_cache
',> '-e', 'TESTENV_SRC_DIR=/home/osmocom-build/jenkins/workspace', '-e', 'TESTENV_INSTALL_DIR=/-debian-trixie', '-e', 'TERM=dumb', '-e', 'PATH=<
https://jenkins.osmocom.org/jenkins/job/ttcn3-s1gw-test/ws/_testenv/data/sc…
>:<
https://jenkins.osmocom.org/jenkins/job/ttcn3-s1gw-test/ws/_testenv/data/sc…
>:<
https://jenkins.osmocom.org/jenkins/job/ttcn3-s1gw-test/ws/s1gw
>:/-debian-trixie/bin:/-debian-trixie/usr/bin:/usr/local/bin:/usr/sbin:/usr/bin:/sbin:/bin', '-e', 'HOME=/home/osmocom-build', '-t', 'testenv-s1gw-osmocom-nightly-20250828-0903-cb7fd018-0', 'apt-get', '-q', 'update'][0m Hit:1
http://deb.debian.org/debian
trixie InRelease Hit:2
http://deb.debian.org/debian
trixie-updates InRelease Hit:3
http://deb.debian.org/debian-security
trixie-security InRelease Get:4
https://downloads.osmocom.org/packages/osmocom:/nightly/Debian_13
./ InRelease [1579 B] Get:5
https://downloads.osmocom.org/packages/osmocom:/nightly/Debian_13
./ Packages [200 kB] Fetched 201 kB in 0s (805 kB/s) Reading package lists... W:
https://downloads.osmocom.org/packages/osmocom:/nightly/Debian_13/./InRelea…
: Policy will reject signature within a year, see --audit for details [0;94m[testenv] + ['podman', 'exec', '-e', 'CCACHE_DIR=/home/osmocom-build/ccache/testenv', '-e', 'TESTENV_CACHE_DIR=<
https://jenkins.osmocom.org/jenkins/job/ttcn3-s1gw-test/ws/_cache
',> '-e', 'TESTENV_SRC_DIR=/home/osmocom-build/jenkins/workspace', '-e', 'TESTENV_INSTALL_DIR=/-debian-trixie', '-e', 'TERM=dumb', '-e', 'PATH=<
https://jenkins.osmocom.org/jenkins/job/ttcn3-s1gw-test/ws/_testenv/data/sc…
>:<
https://jenkins.osmocom.org/jenkins/job/ttcn3-s1gw-test/ws/_testenv/data/sc…
>:<
https://jenkins.osmocom.org/jenkins/job/ttcn3-s1gw-test/ws/s1gw
>:/-debian-trixie/bin:/-debian-trixie/usr/bin:/usr/local/bin:/usr/sbin:/usr/bin:/sbin:/bin', '-e', 'HOME=/home/osmocom-build', '-t', 'testenv-s1gw-osmocom-nightly-20250828-0903-cb7fd018-0', 'sh', '-c', 'apt-cache pkgnames | grep -- -dbg > <
https://jenkins.osmocom.org/jenkins/job/ttcn3-s1gw-test/ws/_cache/podman/db…
'][0m> [0;94m[testenv] + ['podman', 'exec', '-e', 'CCACHE_DIR=/home/osmocom-build/ccache/testenv', '-e', 'TESTENV_CACHE_DIR=<
https://jenkins.osmocom.org/jenkins/job/ttcn3-s1gw-test/ws/_cache
',> '-e', 'TESTENV_SRC_DIR=/home/osmocom-build/jenkins/workspace', '-e', 'TESTENV_INSTALL_DIR=/-debian-trixie', '-e', 'TERM=dumb', '-e', 'PATH=<
https://jenkins.osmocom.org/jenkins/job/ttcn3-s1gw-test/ws/_testenv/data/sc…
>:<
https://jenkins.osmocom.org/jenkins/job/ttcn3-s1gw-test/ws/_testenv/data/sc…
>:<
https://jenkins.osmocom.org/jenkins/job/ttcn3-s1gw-test/ws/s1gw
>:/-debian-trixie/bin:/-debian-trixie/usr/bin:/usr/local/bin:/usr/sbin:/usr/bin:/sbin:/bin', '-e', 'HOME=/home/osmocom-build', '-t', 'testenv-s1gw-osmocom-nightly-20250828-0903-cb7fd018-0', 'apt-rdepends', 'osmo-s1gw'][0m [0;94m[testenv] osmo-s1gw -> osmo-s1gw: installing osmo-s1gw-dbgsym[0m [0;94m[testenv] osmo-s1gw -> libc6: installing libc6-dbg[0m [1;34m[testenv] Installing packages: osmo-s1gw, osmo-s1gw-dbgsym, libc6-dbg[0m [0;94m[testenv] + ['podman', 'exec', '-e', 'CCACHE_DIR=/home/osmocom-build/ccache/testenv', '-e', 'TESTENV_CACHE_DIR=<
https://jenkins.osmocom.org/jenkins/job/ttcn3-s1gw-test/ws/_cache
',> '-e', 'TESTENV_SRC_DIR=/home/osmocom-build/jenkins/workspace', '-e', 'TESTENV_INSTALL_DIR=/-debian-trixie', '-e', 'TERM=dumb', '-e', 'PATH=<
https://jenkins.osmocom.org/jenkins/job/ttcn3-s1gw-test/ws/_testenv/data/sc…
>:<
https://jenkins.osmocom.org/jenkins/job/ttcn3-s1gw-test/ws/_testenv/data/sc…
>:<
https://jenkins.osmocom.org/jenkins/job/ttcn3-s1gw-test/ws/s1gw
>:/-debian-trixie/bin:/-debian-trixie/usr/bin:/usr/local/bin:/usr/sbin:/usr/bin:/sbin:/bin', '-e', 'HOME=/home/osmocom-build', '-t', 'testenv-s1gw-osmocom-nightly-20250828-0903-cb7fd018-0', 'apt-get', '-q', 'install', '-y', '--no-install-recommends', 'osmo-s1gw', 'osmo-s1gw-dbgsym', 'libc6-dbg'][0m Reading package lists... Building dependency tree... The following additional packages will be installed: osmocom-keyring osmocom-nightly The following NEW packages will be installed: libc6-dbg osmo-s1gw osmo-s1gw-dbgsym osmocom-keyring osmocom-nightly 0 upgraded, 5 newly installed, 0 to remove and 0 not upgraded. Need to get 20.1 MB of archives. After this operation, 45.1 MB of additional disk space will be used. Get:1
http://deb.debian.org/debian
trixie/main amd64 libc6-dbg amd64 2.41-12 [7341 kB] Get:2
https://downloads.osmocom.org/packages/osmocom:/nightly/Debian_13
./ osmocom-keyring 1.0.2.5.fc66.202508272026 [3028 B] Get:3
https://downloads.osmocom.org/packages/osmocom:/nightly/Debian_13
./ osmocom-nightly 202508272026 [1192 B] Get:4
https://downloads.osmocom.org/packages/osmocom:/nightly/Debian_13
./ osmo-s1gw 0.3.0.201.949f.202508272026 [12.5 MB] Get:5
https://downloads.osmocom.org/packages/osmocom:/nightly/Debian_13
./ osmo-s1gw-dbgsym 0.3.0.201.949f.202508272026 [249 kB] Fetched 20.1 MB in 0s (86.5 MB/s) Selecting previously unselected package libc6-dbg:amd64. (Reading database ... (Reading database ... 5%(Reading database ... 10%(Reading database ... 15%(Reading database ... 20%(Reading database ... 25%(Reading database ... 30%(Reading database ... 35%(Reading database ... 40%(Reading database ... 45%(Reading database ... 50%(Reading database ... 55%(Reading database ... 60%(Reading database ... 65%(Reading database ... 70%(Reading database ... 75%(Reading database ... 80%(Reading database ... 85%(Reading database ... 90%(Reading database ... 95%(Reading database ... 100%(Reading database ... 43483 files and directories currently installed.) Preparing to unpack .../libc6-dbg_2.41-12_amd64.deb ... Unpacking libc6-dbg:amd64 (2.41-12) ... Selecting previously unselected package osmocom-keyring. Preparing to unpack .../osmocom-keyring_1.0.2.5.fc66.202508272026_amd64.deb ... Unpacking osmocom-keyring (1.0.2.5.fc66.202508272026) ... Selecting previously unselected package osmocom-nightly. Preparing to unpack .../osmocom-nightly_202508272026_amd64.deb ... Unpacking osmocom-nightly (202508272026) ... Selecting previously unselected package osmo-s1gw. Preparing to unpack .../osmo-s1gw_0.3.0.201.949f.202508272026_amd64.deb ... Unpacking osmo-s1gw (0.3.0.201.949f.202508272026) ... Selecting previously unselected package osmo-s1gw-dbgsym. Preparing to unpack .../osmo-s1gw-dbgsym_0.3.0.201.949f.202508272026_amd64.deb ... Unpacking osmo-s1gw-dbgsym (0.3.0.201.949f.202508272026) ... Setting up libc6-dbg:amd64 (2.41-12) ... Setting up osmocom-nightly (202508272026) ... Setting up osmocom-keyring (1.0.2.5.fc66.202508272026) ... Setting up osmo-s1gw (0.3.0.201.949f.202508272026) ... Created symlink '/etc/systemd/system/multi-user.target.wants/osmo-s1gw.service' → '/usr/lib/systemd/system/osmo-s1gw.service'. Setting up osmo-s1gw-dbgsym (0.3.0.201.949f.202508272026) ... [1;34m[testenv] Preparing testdir: <
https://jenkins.osmocom.org/jenkins/job/ttcn3-s1gw-test/ws/logs[0m
> [0;94m[testenv] + ['podman', 'exec', '-e', 'CCACHE_DIR=/home/osmocom-build/ccache/testenv', '-e', 'TESTENV_CACHE_DIR=<
https://jenkins.osmocom.org/jenkins/job/ttcn3-s1gw-test/ws/_cache
',> '-e', 'TESTENV_SRC_DIR=/home/osmocom-build/jenkins/workspace', '-e', 'TESTENV_INSTALL_DIR=/-debian-trixie', '-e', 'TERM=dumb', '-e', 'PATH=<
https://jenkins.osmocom.org/jenkins/job/ttcn3-s1gw-test/ws/_testenv/data/sc…
>:<
https://jenkins.osmocom.org/jenkins/job/ttcn3-s1gw-test/ws/_testenv/data/sc…
>:<
https://jenkins.osmocom.org/jenkins/job/ttcn3-s1gw-test/ws/s1gw
>:/-debian-trixie/bin:/-debian-trixie/usr/bin:/usr/local/bin:/usr/sbin:/usr/bin:/sbin:/bin', '-e', 'HOME=/home/osmocom-build', '-t', 'testenv-s1gw-osmocom-nightly-20250828-0903-cb7fd018-0', 'install', '-Dm644', '<
https://jenkins.osmocom.org/jenkins/job/ttcn3-s1gw-test/ws/s1gw/S1GW_Tests.…
',> '<
https://jenkins.osmocom.org/jenkins/job/ttcn3-s1gw-test/445/artifact/logs/t…
'][0m> [0;94m[testenv] + ['cp', '-a', 'osmo-s1gw.config', '<
https://jenkins.osmocom.org/jenkins/job/ttcn3-s1gw-test/445/artifact/logs/s…
'][0m> [0;94m[testenv] + ['podman', 'exec', '-e', 'CCACHE_DIR=/home/osmocom-build/ccache/testenv', '-e', 'TESTENV_CACHE_DIR=<
https://jenkins.osmocom.org/jenkins/job/ttcn3-s1gw-test/ws/_cache
',> '-e', 'TESTENV_SRC_DIR=/home/osmocom-build/jenkins/workspace', '-e', 'TESTENV_INSTALL_DIR=/-debian-trixie', '-e', 'TERM=dumb', '-e', 'PATH=<
https://jenkins.osmocom.org/jenkins/job/ttcn3-s1gw-test/ws/_testenv/data/sc…
>:<
https://jenkins.osmocom.org/jenkins/job/ttcn3-s1gw-test/ws/_testenv/data/sc…
>:<
https://jenkins.osmocom.org/jenkins/job/ttcn3-s1gw-test/ws/s1gw
>:/-debian-trixie/bin:/-debian-trixie/usr/bin:/usr/local/bin:/usr/sbin:/usr/bin:/sbin:/bin', '-e', 'HOME=/home/osmocom-build', '-t', 'testenv-s1gw-osmocom-nightly-20250828-0903-cb7fd018-0', 'install', '-Dm644', '<
https://jenkins.osmocom.org/jenkins/job/ttcn3-s1gw-test/ws/s1gw/S1GW_Tests.…
',> '<
https://jenkins.osmocom.org/jenkins/job/ttcn3-s1gw-test/445/artifact/logs/t…
'][0m> [0;94m[testenv] + ['podman', 'exec', '-e', 'CCACHE_DIR=/home/osmocom-build/ccache/testenv', '-e', 'TESTENV_CACHE_DIR=<
https://jenkins.osmocom.org/jenkins/job/ttcn3-s1gw-test/ws/_cache
',> '-e', 'TESTENV_SRC_DIR=/home/osmocom-build/jenkins/workspace', '-e', 'TESTENV_INSTALL_DIR=/-debian-trixie', '-e', 'TERM=dumb', '-e', 'PATH=<
https://jenkins.osmocom.org/jenkins/job/ttcn3-s1gw-test/ws/_testenv/data/sc…
>:<
https://jenkins.osmocom.org/jenkins/job/ttcn3-s1gw-test/ws/_testenv/data/sc…
>:<
https://jenkins.osmocom.org/jenkins/job/ttcn3-s1gw-test/ws/s1gw
>:/-debian-trixie/bin:/-debian-trixie/usr/bin:/usr/local/bin:/usr/sbin:/usr/bin:/sbin:/bin', '-e', 'HOME=/home/osmocom-build', '-t', 'testenv-s1gw-osmocom-nightly-20250828-0903-cb7fd018-0', 'install', '-Dm644', '<
https://jenkins.osmocom.org/jenkins/job/ttcn3-s1gw-test/ws/Common.cfg
',> '<
https://jenkins.osmocom.org/jenkins/job/ttcn3-s1gw-test/445/artifact/logs/t…
'][0m> [0;94m[testenv] + ['podman', 'exec', '-e', 'CCACHE_DIR=/home/osmocom-build/ccache/testenv', '-e', 'TESTENV_CACHE_DIR=<
https://jenkins.osmocom.org/jenkins/job/ttcn3-s1gw-test/ws/_cache
',> '-e', 'TESTENV_SRC_DIR=/home/osmocom-build/jenkins/workspace', '-e', 'TESTENV_INSTALL_DIR=/-debian-trixie', '-e', 'TERM=dumb', '-e', 'PATH=<
https://jenkins.osmocom.org/jenkins/job/ttcn3-s1gw-test/ws/_testenv/data/sc…
>:<
https://jenkins.osmocom.org/jenkins/job/ttcn3-s1gw-test/ws/_testenv/data/sc…
>:<
https://jenkins.osmocom.org/jenkins/job/ttcn3-s1gw-test/ws/s1gw
>:/-debian-trixie/bin:/-debian-trixie/usr/bin:/usr/local/bin:/usr/sbin:/usr/bin:/sbin:/bin', '-e', 'HOME=/home/osmocom-build', '-t', 'testenv-s1gw-osmocom-nightly-20250828-0903-cb7fd018-0', 'sed', '-i', 's#TTCN3_HACKS_PATH := .*#TTCN3_HACKS_PATH := "<
https://jenkins.osmocom.org/jenkins/job/ttcn3-s1gw-test/ws/
">#', '<
https://jenkins.osmocom.org/jenkins/job/ttcn3-s1gw-test/445/artifact/logs/t…
'][0m> [0;94m[testenv] Adjusting testsuite config: <
https://jenkins.osmocom.org/jenkins/job/ttcn3-s1gw-test/445/artifact/logs/t…
> [0;94m[testenv] + ['podman', 'exec', '-e', 'CCACHE_DIR=/home/osmocom-build/ccache/testenv', '-e', 'TESTENV_CACHE_DIR=<
https://jenkins.osmocom.org/jenkins/job/ttcn3-s1gw-test/ws/_cache
',> '-e', 'TESTENV_SRC_DIR=/home/osmocom-build/jenkins/workspace', '-e', 'TESTENV_INSTALL_DIR=/-debian-trixie', '-e', 'TERM=dumb', '-e', 'PATH=<
https://jenkins.osmocom.org/jenkins/job/ttcn3-s1gw-test/ws/_testenv/data/sc…
>:<
https://jenkins.osmocom.org/jenkins/job/ttcn3-s1gw-test/ws/_testenv/data/sc…
>:<
https://jenkins.osmocom.org/jenkins/job/ttcn3-s1gw-test/ws/s1gw
>:/-debian-trixie/bin:/-debian-trixie/usr/bin:/usr/local/bin:/usr/sbin:/usr/bin:/sbin:/bin', '-e', 'HOME=/home/osmocom-build', '-t', 'testenv-s1gw-osmocom-nightly-20250828-0903-cb7fd018-0', 'sed', '-i', '-e', 's/\\[MODULE_PARAMETERS\\]/\\[MODULE_PARAMETERS\\]\\nMisc_Helpers.mp_osmo_repo := "nightly"/g', '-e', 's#../Common.cfg#Common.cfg#', '<
https://jenkins.osmocom.org/jenkins/job/ttcn3-s1gw-test/445/artifact/logs/t…
'][0m> [0;94m[testenv] Adjusting testsuite config: <
https://jenkins.osmocom.org/jenkins/job/ttcn3-s1gw-test/445/artifact/logs/t…
> [0;94m[testenv] + ['podman', 'exec', '-e', 'CCACHE_DIR=/home/osmocom-build/ccache/testenv', '-e', 'TESTENV_CACHE_DIR=<
https://jenkins.osmocom.org/jenkins/job/ttcn3-s1gw-test/ws/_cache
',> '-e', 'TESTENV_SRC_DIR=/home/osmocom-build/jenkins/workspace', '-e', 'TESTENV_INSTALL_DIR=/-debian-trixie', '-e', 'TERM=dumb', '-e', 'PATH=<
https://jenkins.osmocom.org/jenkins/job/ttcn3-s1gw-test/ws/_testenv/data/sc…
>:<
https://jenkins.osmocom.org/jenkins/job/ttcn3-s1gw-test/ws/_testenv/data/sc…
>:<
https://jenkins.osmocom.org/jenkins/job/ttcn3-s1gw-test/ws/s1gw
>:/-debian-trixie/bin:/-debian-trixie/usr/bin:/usr/local/bin:/usr/sbin:/usr/bin:/sbin:/bin', '-e', 'HOME=/home/osmocom-build', '-t', 'testenv-s1gw-osmocom-nightly-20250828-0903-cb7fd018-0', 'sed', '-i', '-e', 's/\\[MODULE_PARAMETERS\\]/\\[MODULE_PARAMETERS\\]\\nMisc_Helpers.mp_osmo_repo := "nightly"/g', '-e', 's#../Common.cfg#Common.cfg#', '<
https://jenkins.osmocom.org/jenkins/job/ttcn3-s1gw-test/445/artifact/logs/t…
'][0m> [0;94m[testenv] Adjusting testsuite config: <
https://jenkins.osmocom.org/jenkins/job/ttcn3-s1gw-test/445/artifact/logs/t…
> [0;94m[testenv] + ['podman', 'exec', '-e', 'CCACHE_DIR=/home/osmocom-build/ccache/testenv', '-e', 'TESTENV_CACHE_DIR=<
https://jenkins.osmocom.org/jenkins/job/ttcn3-s1gw-test/ws/_cache
',> '-e', 'TESTENV_SRC_DIR=/home/osmocom-build/jenkins/workspace', '-e', 'TESTENV_INSTALL_DIR=/-debian-trixie', '-e', 'TERM=dumb', '-e', 'PATH=<
https://jenkins.osmocom.org/jenkins/job/ttcn3-s1gw-test/ws/_testenv/data/sc…
>:<
https://jenkins.osmocom.org/jenkins/job/ttcn3-s1gw-test/ws/_testenv/data/sc…
>:<
https://jenkins.osmocom.org/jenkins/job/ttcn3-s1gw-test/ws/s1gw
>:/-debian-trixie/bin:/-debian-trixie/usr/bin:/usr/local/bin:/usr/sbin:/usr/bin:/sbin:/bin', '-e', 'HOME=/home/osmocom-build', '-t', 'testenv-s1gw-osmocom-nightly-20250828-0903-cb7fd018-0', 'sed', '-i', '-e', 's/\\[MODULE_PARAMETERS\\]/\\[MODULE_PARAMETERS\\]\\nMisc_Helpers.mp_osmo_repo := "nightly"/g', '-e', 's#../Common.cfg#Common.cfg#', '<
https://jenkins.osmocom.org/jenkins/job/ttcn3-s1gw-test/445/artifact/logs/t…
'][0m> [1;34m[testenv] Running s1gw[0m [0;94m[testenv] + ['podman', 'exec', '-e', 'CCACHE_DIR=/home/osmocom-build/ccache/testenv', '-e', 'TESTENV_CACHE_DIR=<
https://jenkins.osmocom.org/jenkins/job/ttcn3-s1gw-test/ws/_cache
',> '-e', 'TESTENV_SRC_DIR=/home/osmocom-build/jenkins/workspace', '-e', 'TESTENV_INSTALL_DIR=/-debian-trixie', '-e', 'TERM=dumb', '-e', 'PATH=<
https://jenkins.osmocom.org/jenkins/job/ttcn3-s1gw-test/ws/_testenv/data/sc…
>:<
https://jenkins.osmocom.org/jenkins/job/ttcn3-s1gw-test/ws/_testenv/data/sc…
>:<
https://jenkins.osmocom.org/jenkins/job/ttcn3-s1gw-test/ws/s1gw
>:/-debian-trixie/bin:/-debian-trixie/usr/bin:/usr/local/bin:/usr/sbin:/usr/bin:/sbin:/bin', '-e', 'HOME=/home/osmocom-build', '-w', '<
https://jenkins.osmocom.org/jenkins/job/ttcn3-s1gw-test/445/artifact/logs/s…
',> 'testenv-s1gw-osmocom-nightly-20250828-0903-cb7fd018-0', 'sh', '-c', 'osmo-s1gw -c osmo-s1gw.config -r "$TESTENV_INSTALL_DIR"/usr/lib/osmo-s1gw 2>&1 | tee <
https://jenkins.osmocom.org/jenkins/job/ttcn3-s1gw-test/445/artifact/logs/s…
'][0m> realpath: /-debian-trixie/usr/lib/osmo-s1gw: No such file or directory [1;34m[testenv] Looking for a coredump on lxc host[0m [0;94m[testenv] + ['ip', '-j', '-o', '-4', 'addr', 'show', 'dev', 'eth0'][0m [0;94m[testenv] No coredump found[0m [1;91m[testenv] program failed to start: osmo-s1gw -c osmo-s1gw.config -r "$TESTENV_INSTALL_DIR"/usr/lib/osmo-s1gw[0m [1;34m[testenv] Stopping podman container[0m [0;94m[testenv] + ['podman', 'kill', 'testenv-s1gw-osmocom-nightly-20250828-0903-cb7fd018-0'][0m testenv-s1gw-osmocom-nightly-20250828-0903-cb7fd018-0 [0;94m[testenv] feed_watchdog_loop: podman container has stopped[0m [1;34m[testenv] Logs saved to:
https://jenkins.osmocom.org/jenkins/job/ttcn3-s1gw-test/445/artifact/logs/
[0m + RC=1 + [ 1 = 0 ] + uptime + grep --color=always -o load.* [01;31m[Kload average: 7.39, 2.79, 1.60[m[K + exit 1 Build step 'Execute shell' marked build as failure Recording test results ERROR: Step ‘Publish JUnit test result report’ failed: No test report files were found. Configuration error?
1 day, 8 hours
1
1
0
0
Build failed in Jenkins: ttcn3-5gc-test-ogs #97
by jenkins@lists.osmocom.org
See <
https://jenkins.osmocom.org/jenkins/job/ttcn3-5gc-test-ogs/97/display/redir…
> Changes: [Oliver Smith] testenv: install curl backport only for bookworm [Oliver Smith] Cosmetic: testenv: make builddir_env more readable [laforge] msc: also execute evil USSD tests for -latest [Oliver Smith] testenv: use separate cache dirs per distro [Oliver Smith] testenv: init podman: add --distro arg [Oliver Smith] testenv: debian 13: fix installing libgcc [Oliver Smith] testenv: debian 13: fix installing eclipse-titan [Oliver Smith] testenv: check for --distro without --podman [Oliver Smith] testenv: check value of --distro early [Oliver Smith] testenv: add debian:trixie [Oliver Smith] testenv: enable_binary_repo: configure apt pin [Oliver Smith] testenv: set default distro to debian:trixie [Oliver Smith] testenv: qemu: ignore builtin modules ------------------------------------------ [...truncated 2.34 MiB...] 0070: 7454696d 6572223a 31302c22 706c6d6e tTimer":10,"plmn 0080: 4c697374 223a5b7b 226d6363 223a2239 List":[{"mcc":"9 0090: 3939222c 226d6e63 223a2237 30227d5d 99","mnc":"70"}] 00a0: 2c226970 76344164 64726573 73657322 ,"ipv4Addresses" 00b0: 3a5b2231 32372e30 2e302e35 225d2c22 :["127.0.0.5"]," 00c0: 616c6c6f 7765644e 66547970 6573223a allowedNfTypes": 00d0: 5b225343 50222c22 534d4622 2c22414d ["SCP","SMF","AM 00e0: 46225d2c 22707269 6f726974 79223a30 F"],"priority":0 00f0: 2c226361 70616369 7479223a 3130302c ,"capacity":100, 0100: 226c6f61 64223a30 2c22616d 66496e66 "load":0,"amfInf 0110: 6f223a7b 22616d66 53657449 64223a22 o":{"amfSetId":" 0120: 30303122 2c22616d 66526567 696f6e49 001","amfRegionI 0130: 64223a22 3032222c 22677561 6d694c69 d":"02","guamiLi 0140: 7374223a 5b7b2270 6c6d6e49 64223a7b st":[{"plmnId":{ 0150: 226d6363 223a2239 3939222c 226d6e63 "mcc":"999","mnc 0160: 223a2237 30227d2c 22616d66 4964223a ":"70"},"amfId": 0170: 22303230 30343022 7d5d2c22 7461694c "020040"}],"taiL 0180: 69737422 3a5b7b22 706c6d6e 4964223a ist":[{"plmnId": 0190: 7b226d63 63223a22 39393922 2c226d6e {"mcc":"999","mn 01a0: 63223a22 3730227d 2c227461 63223a22 c":"70"},"tac":" 01b0: 30303030 3031227d 5d7d2c22 6e665365 000001"}]},"nfSe 01c0: 72766963 654c6973 74223a7b 22626331 rviceList":{"bc1 01d0: 66373365 342d3833 66312d34 3166302d f73e4-83f1-41f0- 01e0: 61383037 2d373766 62333631 36316362 a807-77fb36161cb 01f0: 66223a7b 22736572 76696365 496e7374 f":{"serviceInst 0200: 616e6365 4964223a 22626331 66373365 anceId":"bc1f73e 0210: 342d3833 66312d34 3166302d 61383037 4-83f1-41f0-a807 0220: 2d373766 62333631 36316362 66222c22 -77fb36161cbf"," 0230: 73657276 6963654e 616d6522 3a226e61 serviceName":"na 0240: 6d662d63 6f6d6d22 2c227665 7273696f mf-comm","versio 0250: 6e73223a 5b7b2261 70695665 7273696f ns":[{"apiVersio 0260: 6e496e55 7269223a 22763122 2c226170 nInUri":"v1","ap 0270: 6946756c 6c566572 73696f6e 223a2231 iFullVersion":"1 0280: 2e302e30 227d5d2c 22736368 656d6522 .0.0"}],"scheme" 0290: 3a226874 7470222c 226e6653 65727669 :"http","nfServi 02a0: 63655374 61747573 223a2252 45474953 ceStatus":"REGIS 02b0: 54455245 44222c22 6970456e 64506f69 TERED","ipEndPoi 02c0: 6e747322 3a5b7b22 69707634 41646472 nts":[{"ipv4Addr 02d0: 65737322 3a223132 372e302e 302e3522 ess":"127.0.0.5" 02e0: 2c22706f 7274223a 37373737 7d5d2c22 ,"port":7777}]," 02f0: 616c6c6f 7765644e 66547970 6573223a allowedNfTypes": 0300: 5b22534d 46222c22 414d4622 5d2c2270 ["SMF","AMF"],"p 0310: 72696f72 69747922 3a302c22 63617061 riority":0,"capa 0320: 63697479 223a3130 302c226c 6f616422 city":100,"load" 0330: 3a307d7d 7d :0}}} 0000: 00000901 04000000 2188c1c0 0f0d8278 ........!......x 0010: 22bf ". [32m08/28 09:31:11.505[0m: [[33msbi[0m] [1;37mDEBUG[0m: [200:GET]
http://127.0.0.200:7777/nnrf-nfm/v1/nf-instances/bc1f585a-83f1-41f0-a807-77…
(../lib/sbi/client.c:734) [32m08/28 09:31:11.505[0m: [[33msbi[0m] [1;37mDEBUG[0m: RECEIVED[812] (../lib/sbi/client.c:745) [32m08/28 09:31:11.505[0m: [[33msbi[0m] [1;37mDEBUG[0m: {"nfInstanceId":"bc1f585a-83f1-41f0-a807-77fb36161cbf","nfType":"AMF","nfStatus":"REGISTERED","heartBeatTimer":10,"plmnList":[{"mcc":"999","mnc":"70"}],"ipv4Addresses":["127.0.0.5"],"allowedNfTypes":["SCP","SMF","AMF"],"priority":0,"capacity":100,"load":0,"amfInfo":{"amfSetId":"001","amfRegionId":"02","guamiList":[{"plmnId":{"mcc":"999","mnc":"70"},"amfId":"020040"}],"taiList":[{"plmnId":{"mcc":"999","mnc":"70"},"tac":"000001"}]},"nfServiceList":{"bc1f73e4-83f1-41f0-a807-77fb36161cbf":{"serviceInstanceId":"bc1f73e4-83f1-41f0-a807-77fb36161cbf","serviceName":"namf-comm","versions":[{"apiVersionInUri":"v1","apiFullVersion":"1.0.0"}],"scheme":"http","nfServiceStatus":"REGISTERED","ipEndPoints":[{"ipv4Address":"127.0.0.5","port":7777}],"allowedNfTypes":["SMF","AMF"],"priority":0,"capacity":100,"load":0}}} (../lib/sbi/client.c:748) [32m08/28 09:31:11.505[0m: [[33mamf[0m] [1;37mDEBUG[0m: amf_state_operational(): OGS_EVENT_NAME_SBI_CLIENT (../src/amf/amf-sm.c:84) [32m08/28 09:31:11.506[0m: [[33msbi[0m] [1;37mDEBUG[0m: ogs_sbi_nf_state_registered(): OGS_EVENT_NAME_SBI_CLIENT (../lib/sbi/nf-sm.c:285) 0000: 00032c00 01000000 217b226e 66496e73 ..,.....!{"nfIns 0010: 74616e63 65496422 3a226263 31663538 tanceId":"bc1f58 0020: 35612d38 3366312d 34316630 2d613830 5a-83f1-41f0-a80 0030: 372d3737 66623336 31363163 6266222c 7-77fb36161cbf", 0040: 226e6654 79706522 3a22414d 46222c22 "nfType":"AMF"," 0050: 6e665374 61747573 223a2252 45474953 nfStatus":"REGIS 0060: 54455245 44222c22 68656172 74426561 TERED","heartBea 0070: 7454696d 6572223a 31302c22 706c6d6e tTimer":10,"plmn 0080: 4c697374 223a5b7b 226d6363 223a2239 List":[{"mcc":"9 0090: 3939222c 226d6e63 223a2237 30227d5d 99","mnc":"70"}] 00a0: 2c226970 76344164 64726573 73657322 ,"ipv4Addresses" 00b0: 3a5b2231 32372e30 2e302e35 225d2c22 :["127.0.0.5"]," 00c0: 616c6c6f 7765644e 66547970 6573223a allowedNfTypes": 00d0: 5b225343 50222c22 534d4622 2c22414d ["SCP","SMF","AM 00e0: 46225d2c 22707269 6f726974 79223a30 F"],"priority":0 00f0: 2c226361 70616369 7479223a 3130302c ,"capacity":100, 0100: 226c6f61 64223a30 2c22616d 66496e66 "load":0,"amfInf 0110: 6f223a7b 22616d66 53657449 64223a22 o":{"amfSetId":" 0120: 30303122 2c22616d 66526567 696f6e49 001","amfRegionI 0130: 64223a22 3032222c 22677561 6d694c69 d":"02","guamiLi 0140: 7374223a 5b7b2270 6c6d6e49 64223a7b st":[{"plmnId":{ 0150: 226d6363 223a2239 3939222c 226d6e63 "mcc":"999","mnc 0160: 223a2237 30227d2c 22616d66 4964223a ":"70"},"amfId": 0170: 22303230 30343022 7d5d2c22 7461694c "020040"}],"taiL 0180: 69737422 3a5b7b22 706c6d6e 4964223a ist":[{"plmnId": 0190: 7b226d63 63223a22 39393922 2c226d6e {"mcc":"999","mn 01a0: 63223a22 3730227d 2c227461 63223a22 c":"70"},"tac":" 01b0: 30303030 3031227d 5d7d2c22 6e665365 000001"}]},"nfSe 01c0: 72766963 654c6973 74223a7b 22626331 rviceList":{"bc1 01d0: 66373365 342d3833 66312d34 3166302d f73e4-83f1-41f0- 01e0: 61383037 2d373766 62333631 36316362 a807-77fb36161cb 01f0: 66223a7b 22736572 76696365 496e7374 f":{"serviceInst 0200: 616e6365 4964223a 22626331 66373365 anceId":"bc1f73e 0210: 342d3833 66312d34 3166302d 61383037 4-83f1-41f0-a807 0220: 2d373766 62333631 36316362 66222c22 -77fb36161cbf"," 0230: 73657276 6963654e 616d6522 3a226e61 serviceName":"na 0240: 6d662d63 6f6d6d22 2c227665 7273696f mf-comm","versio 0250: 6e73223a 5b7b2261 70695665 7273696f ns":[{"apiVersio 0260: 6e496e55 7269223a 22763122 2c226170 nInUri":"v1","ap 0270: 6946756c 6c566572 73696f6e 223a2231 iFullVersion":"1 0280: 2e302e30 227d5d2c 22736368 656d6522 .0.0"}],"scheme" 0290: 3a226874 7470222c 226e6653 65727669 :"http","nfServi 02a0: 63655374 61747573 223a2252 45474953 ceStatus":"REGIS 02b0: 54455245 44222c22 6970456e 64506f69 TERED","ipEndPoi 02c0: 6e747322 3a5b7b22 69707634 41646472 nts":[{"ipv4Addr 02d0: 65737322 3a223132 372e302e 302e3522 ess":"127.0.0.5" 02e0: 2c22706f 7274223a 37373737 7d5d2c22 ,"port":7777}]," 02f0: 616c6c6f 7765644e 66547970 6573223a allowedNfTypes": 0300: 5b22534d 46222c22 414d4622 5d2c2270 ["SMF","AMF"],"p 0310: 72696f72 69747922 3a302c22 63617061 riority":0,"capa 0320: 63697479 223a3130 302c226c 6f616422 city":100,"load" 0330: 3a307d7d 7d :0}}} [1;34m[testenv] Running uecups-daemon[0m [0;94m[testenv] + ['podman', 'exec', '-e', 'CCACHE_DIR=/home/osmocom-build/ccache/testenv', '-e', 'TESTENV_CACHE_DIR=<
https://jenkins.osmocom.org/jenkins/job/ttcn3-5gc-test-ogs/ws/_cache
',> '-e', 'TESTENV_SRC_DIR=/home/osmocom-build/jenkins/workspace', '-e', 'TESTENV_INSTALL_DIR=/-debian-trixie', '-e', 'TERM=dumb', '-e', 'PATH=<
https://jenkins.osmocom.org/jenkins/job/ttcn3-5gc-test-ogs/ws/_testenv/data…
>:<
https://jenkins.osmocom.org/jenkins/job/ttcn3-5gc-test-ogs/ws/_testenv/data…
>:<
https://jenkins.osmocom.org/jenkins/job/ttcn3-5gc-test-ogs/ws/5gc
>:/-debian-trixie/bin:/-debian-trixie/usr/bin:/usr/local/bin:/usr/sbin:/usr/bin:/sbin:/bin', '-e', 'HOME=/home/osmocom-build', '-w', '<
https://jenkins.osmocom.org/jenkins/job/ttcn3-5gc-test-ogs/97/artifact/logs…
',> 'testenv-5gc-osmocom-nightly-20250828-0929-a30f78ff-0', 'sh', '-c', 'sudo $(which osmo-uecups-daemon) 2>&1 | tee <
https://jenkins.osmocom.org/jenkins/job/ttcn3-5gc-test-ogs/97/artifact/logs…
'][0m> [1;34m[testenv] Running testsuite (eclipse-titan 11.1.0, from titan_min= in testenv.cfg)[0m 20250828093111833 [1;33mDLGLOBAL[0;m [1;33mNOTICE[0;m Available via telnet 127.0.0.20 4268 (telnet_interface.c:88) [0;94m[testenv] + ['podman', 'exec', '-e', 'CCACHE_DIR=/home/osmocom-build/ccache/testenv', '-e', 'TESTENV_CACHE_DIR=<
https://jenkins.osmocom.org/jenkins/job/ttcn3-5gc-test-ogs/ws/_cache
',> '-e', 'TESTENV_SRC_DIR=/home/osmocom-build/jenkins/workspace', '-e', 'TESTENV_INSTALL_DIR=/-debian-trixie', '-e', 'TERM=dumb', '-e', 'PATH=/opt/eclipse-titan-11.1.0/bin:<
https://jenkins.osmocom.org/jenkins/job/ttcn3-5gc-test-ogs/ws/_testenv/data…
>:<
https://jenkins.osmocom.org/jenkins/job/ttcn3-5gc-test-ogs/ws/_testenv/data…
>:<
https://jenkins.osmocom.org/jenkins/job/ttcn3-5gc-test-ogs/ws/5gc
>:/-debian-trixie/bin:/-debian-trixie/usr/bin:/usr/local/bin:/usr/sbin:/usr/bin:/sbin:/bin', '-e', 'HOME=/home/osmocom-build', '-e', 'BUILDDIR=<
https://jenkins.osmocom.org/jenkins/job/ttcn3-5gc-test-ogs/ws/_cache/podman…
',> '-e', 'TTCN3_DIR=/opt/eclipse-titan-11.1.0', '-e', 'TTCN3_PCAP_PATH=<
https://jenkins.osmocom.org/jenkins/job/ttcn3-5gc-test-ogs/97/artifact/logs…
',> '-w', '<
https://jenkins.osmocom.org/jenkins/job/ttcn3-5gc-test-ogs/97/artifact/logs…
',> 'testenv-5gc-osmocom-nightly-20250828-0929-a30f78ff-0', '<
https://jenkins.osmocom.org/jenkins/job/ttcn3-5gc-test-ogs/ws/start-testsui…
',> '5gc/C5G_Tests', 'C5G_Tests.cfg'][0m ttcn3_start: Starting the test suite spawn /opt/eclipse-titan-11.1.0/bin/mctr_cli C5G_Tests.cfg ************************************************************************* * TTCN-3 Test Executor - Main Controller 2 * * Version: 11.1.0 * * Copyright (c) 2000-2025 Ericsson Telecom AB * * All rights reserved. This program and the accompanying materials * * are made available under the terms of the Eclipse Public License v2.0 * * which accompanies this distribution, and is available at * *
https://www.eclipse.org/org/documents/epl-2.0/EPL-2.0.html
* ************************************************************************* Using configuration file: C5G_Tests.cfg MC@8c4b9ca3a635: Unix server socket created successfully. MC@8c4b9ca3a635: Listening on TCP port 33971. 8c4b9ca3a635 is the default MC2> spawn <
https://jenkins.osmocom.org/jenkins/job/ttcn3-5gc-test-ogs/ws/_cache/podman…
> 8c4b9ca3a635 33971 TTCN-3 Host Controller (parallel mode), version 11.1.0 MC@8c4b9ca3a635: New HC connected from 10.0.2.100 [10.0.2.100]. 8c4b9ca3a635: Linux 6.1.0-29-amd64 on x86_64. cmtc MC@8c4b9ca3a635: Downloading configuration file to all HCs. construct junitlogger Initializing `JUnitLogger' (v2.0): JUnitLogger writes JUnit-compatible XML HC@8c4b9ca3a635: Warning: Option `FileMask' was given more than once in section [LOGGING] of the configuration file. MC@8c4b9ca3a635: Configuration file was processed on all HCs. MC@8c4b9ca3a635: Creating MTC on host 10.0.2.100. MC@8c4b9ca3a635: MTC is created. MC2> smtc Executing all items of [EXECUTE] section. MC2> MTC@8c4b9ca3a635: Starting external command `<
https://jenkins.osmocom.org/jenkins/job/ttcn3-5gc-test-ogs/ws/ttcn3-tcpdump…
> C5G_Tests.TC_ng_setup'. ------ C5G_Tests.TC_ng_setup ------ Thu Aug 28 09:31:12 UTC 2025 /usr/bin/dumpcap -q -s 1520 -n -i any -w "<
https://jenkins.osmocom.org/jenkins/job/ttcn3-5gc-test-ogs/97/artifact/logs…
"> ><
https://jenkins.osmocom.org/jenkins/job/ttcn3-5gc-test-ogs/97/artifact/logs…
> 2>/tmp/cmderr & Waiting for packet dumper to start... 0 [1;34m[testenv] Looking for a coredump on lxc host[0m [0;94m[testenv] + ['ip', '-j', '-o', '-4', 'addr', 'show', 'dev', 'eth0'][0m [32m08/28 09:31:12.952[0m: [[33mpfcp[0m] [1;37mDEBUG[0m: [1] LOCAL Response Timeout for step 1 type 5 peer [127.0.0.7]:8805 (../lib/pfcp/xact.c:583) [32m08/28 09:31:12.953[0m: [[33mupf[0m] [1;37mDEBUG[0m: ogs_pfcp_extract_node_id() type [5] pfcp_status [0] node_id [127.0.0.4] from [127.0.0.4]:8805 (../src/upf/pfcp-path.c:101) [32m08/28 09:31:12.953[0m: [[33mupf[0m] [1;37mDEBUG[0m: Added PFCP-Node: addr_list [127.0.0.4]:8805 (../src/upf/pfcp-path.c:140) [32m08/28 09:31:12.953[0m: [[33mupf[0m] [1;37mDEBUG[0m: upf_pfcp_state_initial(): ENTRY (../src/upf/pfcp-sm.c:38) [32m08/28 09:31:12.953[0m: [[33mupf[0m] [1;37mDEBUG[0m: upf_pfcp_state_will_associate(): ENTRY (../src/upf/pfcp-sm.c:72) [32m08/28 09:31:12.953[0m: [[33mupf[0m] [1;37mDEBUG[0m: upf_state_operational(): UPF_EVT_N4_MESSAGE (../src/upf/upf-sm.c:51) [32m08/28 09:31:12.953[0m: [[33mpfcp[0m] [1;37mDEBUG[0m: [1] Cannot find new type 5 from PFCP peer [127.0.0.4]:8805 (../lib/pfcp/xact.c:727) [32m08/28 09:31:12.953[0m: [[33mpfcp[0m] [1;37mDEBUG[0m: [1] REMOTE Create peer [127.0.0.4]:8805 (../lib/pfcp/xact.c:156) [32m08/28 09:31:12.953[0m: [[33mpfcp[0m] [1;37mDEBUG[0m: [1] REMOTE Receive peer [127.0.0.4]:8805 (../lib/pfcp/xact.c:733) [32m08/28 09:31:12.953[0m: [[33mpfcp[0m] [1;37mDEBUG[0m: [1] REMOTE UPD RX-5 peer [127.0.0.4]:8805 (../lib/pfcp/xact.c:289) [32m08/28 09:31:12.953[0m: [[33mupf[0m] [1;37mDEBUG[0m: upf_pfcp_state_will_associate(): UPF_EVT_N4_MESSAGE (../src/upf/pfcp-sm.c:72) [32m08/28 09:31:12.953[0m: [[33mpfcp[0m] [1;37mDEBUG[0m: Association Setup Response (../lib/pfcp/build.c:252) [32m08/28 09:31:12.953[0m: [[33mpfcp[0m] [1;37mDEBUG[0m: [1] REMOTE UPD TX-6 peer [127.0.0.4]:8805 (../lib/pfcp/xact.c:191) [32m08/28 09:31:12.953[0m: [[33mpfcp[0m] [1;37mDEBUG[0m: [1] REMOTE Commit peer [127.0.0.4]:8805 (../lib/pfcp/xact.c:460) [32m08/28 09:31:12.953[0m: [[33mupf[0m] [1;37mDEBUG[0m: upf_pfcp_state_will_associate(): EXIT (../src/upf/pfcp-sm.c:72) [32m08/28 09:31:12.953[0m: [[33mupf[0m] [1;37mDEBUG[0m: upf_pfcp_state_associated(): ENTRY (../src/upf/pfcp-sm.c:161) [32m08/28 09:31:12.953[0m: [[33mupf[0m] [1;32mINFO[0m: PFCP associated [127.0.0.4]:8805 (../src/upf/pfcp-sm.c:168) [32m08/28 09:31:12.953[0m: [[33mpfcp[0m] [1;37mDEBUG[0m: [1] LOCAL Create peer [127.0.0.4]:8805 (../lib/pfcp/xact.c:111) [32m08/28 09:31:12.953[0m: [[33mpfcp[0m] [1;37mDEBUG[0m: Heartbeat Request (../lib/pfcp/build.c:28) [32m08/28 09:31:12.953[0m: [[33mpfcp[0m] [1;37mDEBUG[0m: [1] LOCAL UPD TX-1 peer [127.0.0.4]:8805 (../lib/pfcp/xact.c:191) [32m08/28 09:31:12.953[0m: [[33mpfcp[0m] [1;37mDEBUG[0m: [1] LOCAL Commit peer [127.0.0.4]:8805 (../lib/pfcp/xact.c:460) [32m08/28 09:31:12.953[0m: [[33msmf[0m] [1;37mDEBUG[0m: ogs_pfcp_extract_node_id() type [6] pfcp_status [0] node_id [127.0.0.7] from [127.0.0.7]:8805 (../src/smf/pfcp-path.c:138) [32m08/28 09:31:12.953[0m: [[33msmf[0m] [1;37mDEBUG[0m: Found PFCP-Node: addr_list [127.0.0.7]:8805 (../src/smf/pfcp-path.c:192) [32m08/28 09:31:12.953[0m: [[33msmf[0m] [1;37mDEBUG[0m: Merged PFCP-Node: addr_list [127.0.0.7]:8805 (../src/smf/pfcp-path.c:198) [32m08/28 09:31:12.953[0m: [[33msmf[0m] [1;37mDEBUG[0m: smf_state_operational(): SMF_EVT_N4_MESSAGE (../src/smf/smf-sm.c:93) [32m08/28 09:31:12.953[0m: [[33mpfcp[0m] [1;37mDEBUG[0m: [1] LOCAL Find peer [127.0.0.7]:8805 (../lib/pfcp/xact.c:718) [32m08/28 09:31:12.953[0m: [[33mpfcp[0m] [1;37mDEBUG[0m: [1] LOCAL Receive peer [127.0.0.7]:8805 (../lib/pfcp/xact.c:733) [32m08/28 09:31:12.953[0m: [[33mpfcp[0m] [1;37mDEBUG[0m: [1] LOCAL UPD RX-6 peer [127.0.0.7]:8805 (../lib/pfcp/xact.c:289) [32m08/28 09:31:12.953[0m: [[33msmf[0m] [1;37mDEBUG[0m: smf_pfcp_state_will_associate(): SMF_EVT_N4_MESSAGE (../src/smf/pfcp-sm.c:74) [32m08/28 09:31:12.953[0m: [[33mpfcp[0m] [1;37mDEBUG[0m: [1] LOCAL Commit peer [127.0.0.7]:8805 (../lib/pfcp/xact.c:460) [32m08/28 09:31:12.953[0m: [[33mpfcp[0m] [1;37mDEBUG[0m: [1] LOCAL Delete peer [127.0.0.7]:8805 (../lib/pfcp/xact.c:791) [32m08/28 09:31:12.953[0m: [[33msmf[0m] [1;37mDEBUG[0m: smf_pfcp_state_will_associate(): EXIT (../src/smf/pfcp-sm.c:74) [32m08/28 09:31:12.953[0m: [[33msmf[0m] [1;37mDEBUG[0m: smf_pfcp_state_associated(): ENTRY (../src/smf/pfcp-sm.c:182) [32m08/28 09:31:12.953[0m: [[33msmf[0m] [1;32mINFO[0m: PFCP associated [127.0.0.7]:8805 (../src/smf/pfcp-sm.c:189) [32m08/28 09:31:12.953[0m: [[33mpfcp[0m] [1;37mDEBUG[0m: [2] LOCAL Create peer [127.0.0.7]:8805 (../lib/pfcp/xact.c:111) [32m08/28 09:31:12.953[0m: [[33mpfcp[0m] [1;37mDEBUG[0m: Heartbeat Request (../lib/pfcp/build.c:28) [32m08/28 09:31:12.953[0m: [[33mpfcp[0m] [1;37mDEBUG[0m: [2] LOCAL UPD TX-1 peer [127.0.0.7]:8805 (../lib/pfcp/xact.c:191) [32m08/28 09:31:12.953[0m: [[33mpfcp[0m] [1;37mDEBUG[0m: [2] LOCAL Commit peer [127.0.0.7]:8805 (../lib/pfcp/xact.c:460) [32m08/28 09:31:12.953[0m: [[33msmf[0m] [1;37mDEBUG[0m: ogs_pfcp_extract_node_id() type [1] pfcp_status [1] node_id [NULL] from [127.0.0.7]:8805 (../src/smf/pfcp-path.c:138) [32m08/28 09:31:12.953[0m: [[33msmf[0m] [1;37mDEBUG[0m: Found PFCP-Node: addr_list [127.0.0.7]:8805 (../src/smf/pfcp-path.c:192) [32m08/28 09:31:12.953[0m: [[33msmf[0m] [1;37mDEBUG[0m: Merged PFCP-Node: addr_list [127.0.0.7]:8805 (../src/smf/pfcp-path.c:198) [32m08/28 09:31:12.953[0m: [[33msmf[0m] [1;37mDEBUG[0m: smf_state_operational(): SMF_EVT_N4_MESSAGE (../src/smf/smf-sm.c:93) [32m08/28 09:31:12.953[0m: [[33mpfcp[0m] [1;37mDEBUG[0m: [1] Cannot find new type 1 from PFCP peer [127.0.0.7]:8805 (../lib/pfcp/xact.c:727) [32m08/28 09:31:12.953[0m: [[33mpfcp[0m] [1;37mDEBUG[0m: [1] REMOTE Create peer [127.0.0.7]:8805 (../lib/pfcp/xact.c:156) [32m08/28 09:31:12.953[0m: [[33mpfcp[0m] [1;37mDEBUG[0m: [1] REMOTE Receive peer [127.0.0.7]:8805 (../lib/pfcp/xact.c:733) [32m08/28 09:31:12.953[0m: [[33mpfcp[0m] [1;37mDEBUG[0m: [1] REMOTE UPD RX-1 peer [127.0.0.7]:8805 (../lib/pfcp/xact.c:289) [32m08/28 09:31:12.953[0m: [[33msmf[0m] [1;37mDEBUG[0m: smf_pfcp_state_associated(): SMF_EVT_N4_MESSAGE (../src/smf/pfcp-sm.c:182) [32m08/28 09:31:12.953[0m: [[33mpfcp[0m] [1;37mDEBUG[0m: Heartbeat Response (../lib/pfcp/build.c:56) [32m08/28 09:31:12.953[0m: [[33mpfcp[0m] [1;37mDEBUG[0m: [1] REMOTE UPD TX-2 peer [127.0.0.7]:8805 (../lib/pfcp/xact.c:191) [32m08/28 09:31:12.953[0m: [[33mpfcp[0m] [1;37mDEBUG[0m: [1] REMOTE Commit peer [127.0.0.7]:8805 (../lib/pfcp/xact.c:460) [32m08/28 09:31:12.953[0m: [[33mpfcp[0m] [1;37mDEBUG[0m: [1] REMOTE Delete peer [127.0.0.7]:8805 (../lib/pfcp/xact.c:791) [32m08/28 09:31:12.953[0m: [[33mupf[0m] [1;37mDEBUG[0m: ogs_pfcp_extract_node_id() type [1] pfcp_status [1] node_id [NULL] from [127.0.0.4]:8805 (../src/upf/pfcp-path.c:101) [32m08/28 09:31:12.953[0m: [[33mupf[0m] [1;37mDEBUG[0m: Found PFCP-Node: addr_list [127.0.0.4]:8805 (../src/upf/pfcp-path.c:155) [32m08/28 09:31:12.953[0m: [[33mupf[0m] [1;37mDEBUG[0m: Merged PFCP-Node: addr_list [127.0.0.4]:8805 (../src/upf/pfcp-path.c:161) [32m08/28 09:31:12.953[0m: [[33mupf[0m] [1;37mDEBUG[0m: upf_state_operational(): UPF_EVT_N4_MESSAGE (../src/upf/upf-sm.c:51) [32m08/28 09:31:12.953[0m: [[33mpfcp[0m] [1;37mDEBUG[0m: [2] Cannot find new type 1 from PFCP peer [127.0.0.4]:8805 (../lib/pfcp/xact.c:727) [32m08/28 09:31:12.953[0m: [[33mpfcp[0m] [1;37mDEBUG[0m: [2] REMOTE Create peer [127.0.0.4]:8805 (../lib/pfcp/xact.c:156) [32m08/28 09:31:12.953[0m: [[33mpfcp[0m] [1;37mDEBUG[0m: [2] REMOTE Receive peer [127.0.0.4]:8805 (../lib/pfcp/xact.c:733) [32m08/28 09:31:12.953[0m: [[33mpfcp[0m] [1;37mDEBUG[0m: [2] REMOTE UPD RX-1 peer [127.0.0.4]:8805 (../lib/pfcp/xact.c:289) [32m08/28 09:31:12.953[0m: [[33mupf[0m] [1;37mDEBUG[0m: upf_pfcp_state_associated(): UPF_EVT_N4_MESSAGE (../src/upf/pfcp-sm.c:161) [32m08/28 09:31:12.953[0m: [[33mpfcp[0m] [1;37mDEBUG[0m: Heartbeat Response (../lib/pfcp/build.c:56) [32m08/28 09:31:12.953[0m: [[33mpfcp[0m] [1;37mDEBUG[0m: [2] REMOTE UPD TX-2 peer [127.0.0.4]:8805 (../lib/pfcp/xact.c:191) [32m08/28 09:31:12.953[0m: [[33mpfcp[0m] [1;37mDEBUG[0m: [2] REMOTE Commit peer [127.0.0.4]:8805 (../lib/pfcp/xact.c:460) [32m08/28 09:31:12.953[0m: [[33mpfcp[0m] [1;37mDEBUG[0m: [2] REMOTE Delete peer [127.0.0.4]:8805 (../lib/pfcp/xact.c:791) [32m08/28 09:31:12.953[0m: [[33mupf[0m] [1;37mDEBUG[0m: ogs_pfcp_extract_node_id() type [2] pfcp_status [1] node_id [NULL] from [127.0.0.4]:8805 (../src/upf/pfcp-path.c:101) [32m08/28 09:31:12.953[0m: [[33mupf[0m] [1;37mDEBUG[0m: Found PFCP-Node: addr_list [127.0.0.4]:8805 (../src/upf/pfcp-path.c:155) [32m08/28 09:31:12.953[0m: [[33mupf[0m] [1;37mDEBUG[0m: Merged PFCP-Node: addr_list [127.0.0.4]:8805 (../src/upf/pfcp-path.c:161) [32m08/28 09:31:12.953[0m: [[33mupf[0m] [1;37mDEBUG[0m: upf_state_operational(): UPF_EVT_N4_MESSAGE (../src/upf/upf-sm.c:51) [32m08/28 09:31:12.953[0m: [[33mpfcp[0m] [1;37mDEBUG[0m: [1] LOCAL Find peer [127.0.0.4]:8805 (../lib/pfcp/xact.c:718) [32m08/28 09:31:12.953[0m: [[33mpfcp[0m] [1;37mDEBUG[0m: [1] LOCAL Receive peer [127.0.0.4]:8805 (../lib/pfcp/xact.c:733) [32m08/28 09:31:12.953[0m: [[33mpfcp[0m] [1;37mDEBUG[0m: [1] LOCAL UPD RX-2 peer [127.0.0.4]:8805 (../lib/pfcp/xact.c:289) [32m08/28 09:31:12.953[0m: [[33mupf[0m] [1;37mDEBUG[0m: upf_pfcp_state_associated(): UPF_EVT_N4_MESSAGE (../src/upf/pfcp-sm.c:161) [32m08/28 09:31:12.953[0m: [[33mpfcp[0m] [1;37mDEBUG[0m: [1] LOCAL Commit peer [127.0.0.4]:8805 (../lib/pfcp/xact.c:460) [32m08/28 09:31:12.953[0m: [[33mpfcp[0m] [1;37mDEBUG[0m: [1] LOCAL Delete peer [127.0.0.4]:8805 (../lib/pfcp/xact.c:791) [32m08/28 09:31:12.953[0m: [[33msmf[0m] [1;37mDEBUG[0m: ogs_pfcp_extract_node_id() type [2] pfcp_status [1] node_id [NULL] from [127.0.0.7]:8805 (../src/smf/pfcp-path.c:138) [32m08/28 09:31:12.953[0m: [[33msmf[0m] [1;37mDEBUG[0m: Found PFCP-Node: addr_list [127.0.0.7]:8805 (../src/smf/pfcp-path.c:192) [32m08/28 09:31:12.953[0m: [[33msmf[0m] [1;37mDEBUG[0m: Merged PFCP-Node: addr_list [127.0.0.7]:8805 (../src/smf/pfcp-path.c:198) [32m08/28 09:31:12.953[0m: [[33msmf[0m] [1;37mDEBUG[0m: smf_state_operational(): SMF_EVT_N4_MESSAGE (../src/smf/smf-sm.c:93) [32m08/28 09:31:12.953[0m: [[33mpfcp[0m] [1;37mDEBUG[0m: [2] LOCAL Find peer [127.0.0.7]:8805 (../lib/pfcp/xact.c:718) [32m08/28 09:31:12.953[0m: [[33mpfcp[0m] [1;37mDEBUG[0m: [2] LOCAL Receive peer [127.0.0.7]:8805 (../lib/pfcp/xact.c:733) [32m08/28 09:31:12.953[0m: [[33mpfcp[0m] [1;37mDEBUG[0m: [2] LOCAL UPD RX-2 peer [127.0.0.7]:8805 (../lib/pfcp/xact.c:289) [32m08/28 09:31:12.953[0m: [[33msmf[0m] [1;37mDEBUG[0m: smf_pfcp_state_associated(): SMF_EVT_N4_MESSAGE (../src/smf/pfcp-sm.c:182) [32m08/28 09:31:12.953[0m: [[33mpfcp[0m] [1;37mDEBUG[0m: [2] LOCAL Commit peer [127.0.0.7]:8805 (../lib/pfcp/xact.c:460) [32m08/28 09:31:12.953[0m: [[33mpfcp[0m] [1;37mDEBUG[0m: [2] LOCAL Delete peer [127.0.0.7]:8805 (../lib/pfcp/xact.c:791) [0;94m[testenv] No coredump found[0m [1;91m[testenv] sepp1 unexpected exit! rc=0[0m [1;34m[testenv] Stopping podman container[0m [0;94m[testenv] + ['podman', 'kill', 'testenv-5gc-osmocom-nightly-20250828-0929-a30f78ff-0'][0m testenv-5gc-osmocom-nightly-20250828-0929-a30f78ff-0 [0;94m[testenv] Skipping clean up scripts, podman container has already stopped[0m [1;34m[testenv] Stopping testsuite (300031)[0m [0;94m[testenv] feed_watchdog_loop: podman container has stopped[0m [1;34m[testenv] Logs saved to:
https://jenkins.osmocom.org/jenkins/job/ttcn3-5gc-test-ogs/97/artifact/logs/
[0m + RC=1 + [ 1 = 0 ] + grep --color=always -o load.* + uptime [01;31m[Kload average: 8.95, 4.75, 2.57[m[K + exit 1 Error: container has already been removed Build step 'Execute shell' marked build as failure Recording test results [Checks API] No suitable checks publisher found.
1 day, 8 hours
1
1
0
0
Build failed in Jenkins: ttcn3-asterisk-ims-ue-test #546
by jenkins@lists.osmocom.org
See <
https://jenkins.osmocom.org/jenkins/job/ttcn3-asterisk-ims-ue-test/546/disp…
> Changes: ------------------------------------------ [...truncated 217.77 KiB...] #18 99.91 Installing file configs/samples/skinny.conf.sample #18 99.91 Installing file configs/samples/sla.conf.sample #18 99.92 Installing file configs/samples/smdi.conf.sample #18 99.92 Installing file configs/samples/sorcery.conf.sample #18 99.93 Installing file configs/samples/ss7.timers.sample #18 99.93 Installing file configs/samples/stasis.conf.sample #18 99.94 Installing file configs/samples/statsd.conf.sample #18 99.95 Installing file configs/samples/stir_shaken.conf.sample #18 99.95 Installing file configs/samples/test_sorcery.conf.sample #18 99.96 Installing file configs/samples/udptl.conf.sample #18 99.96 Installing file configs/samples/unistim.conf.sample #18 99.97 Installing file configs/samples/users.conf.sample #18 99.99 Installing file configs/samples/voicemail.conf.sample #18 99.99 Installing file configs/samples/xmpp.conf.sample #18 100.00 Updating asterisk.conf #18 100.0 /usr/bin/install -c -d "/var/spool/asterisk/voicemail/default/1234/INBOX" #18 100.0 build_tools/make_sample_voicemail "//var/lib/asterisk" "//var/spool/asterisk" #18 100.0 Installing file phoneprov/000000000000-directory.xml #18 100.0 Installing file phoneprov/000000000000-phone.cfg #18 100.1 Installing file phoneprov/000000000000.cfg #18 100.1 Installing file phoneprov/polycom.xml #18 100.1 Installing file phoneprov/polycom_line.xml #18 100.1 Installing file phoneprov/snom-mac.xml #18 DONE 100.4s #19 [14/15] RUN SETCAP 'cap_net_admin,cap_sys_resource=ep' /usr/sbin/asterisk #19 DONE 0.5s #20 [15/15] RUN CD asterisk/codec_server && make "-j$(nproc)" && cp cserver /usr/bin/cserver #20 0.377 cc -O3 -ggdb -pthread cserver.c -o cserver #20 DONE 0.5s #21 exporting to image #21 exporting layers #21 exporting layers 3.0s done #21 writing image sha256:9e9dc1a99a189f7cff5a8f99c8aba6f241e8ba312ad044cd024e7cc384dbaff3 0.0s done #21 naming to docker.io/osmocom-build/asterisk-master:latest 0.0s done #21 DONE 3.0s [33m1 warning found (use docker --debug to expand): [0m - InvalidDefaultArgInFrom: Default value for ARG $USER/$DISTRO-build results in empty or invalid base image name (line 4) rm -rf .common make: Leaving directory '<
https://jenkins.osmocom.org/jenkins/job/ttcn3-asterisk-ims-ue-test/ws/aster…
'> + docker_image_exists asterisk-master + docker images -q osmocom-build/asterisk-master + test -n 9e9dc1a99a18 + list_osmo_packages debian-bookworm asterisk-master + local distro=debian-bookworm + local image=asterisk-master + local docker_run_sh=docker run --rm --entrypoint=/bin/sh osmocom-build/asterisk-master -c + [ -n ] + return + [
registry.osmocom.org
=
registry.osmocom.org
] + docker_depends ttcn3-asterisk-ims-ue-test + local feed + echo debian-bookworm-titan + depends=debian-bookworm-titan + [ -n debian-bookworm-titan ] + docker_images_require debian-bookworm-titan + local i + local from_line + local pull_arg + local upstream_distro_arg + local distro_arg + local depends + local dir + [
registry.osmocom.org
=
registry.osmocom.org
] + docker pull
registry.osmocom.org/osmocom-build/debian-bookworm-titan
Using default tag: latest latest: Pulling from osmocom-build/debian-bookworm-titan Digest: sha256:3fa9c1f903cb8f18c099720d64cbfaf41dbc4b84a4cdbbcb934cefffcc54df7d Status: Image is up to date for
registry.osmocom.org/osmocom-build/debian-bookworm-titan:latest
registry.osmocom.org/osmocom-build/debian-bookworm-titan:latest
+ continue + docker_distro_from_image_name ttcn3-asterisk-ims-ue-test + echo debian-bookworm + distro_arg=debian-bookworm + [ -z ] + docker_upstream_distro_from_image_name ttcn3-asterisk-ims-ue-test + echo debian:bookworm + upstream_distro_arg=debian:bookworm + docker_dir_from_image_name ttcn3-asterisk-ims-ue-test + echo ttcn3-asterisk-ims-ue-test + dir=ttcn3-asterisk-ims-ue-test + [ -z ] + pull_arg=--pull + grep ^FROM ../ttcn3-asterisk-ims-ue-test/Dockerfile + from_line=FROM $REGISTRY/$USER/debian-bookworm-titan + echo FROM $REGISTRY/$USER/debian-bookworm-titan + grep -q $USER + pull_arg= + set +x Building image: ttcn3-asterisk-ims-ue-test (export NO_DOCKER_IMAGE_BUILD=1 to prevent this) + docker_osmo_ttcn3_branch + [ -n ] + echo master + make -C ../ttcn3-asterisk-ims-ue-test BUILD_ARGS= UPSTREAM_DISTRO=debian:bookworm DISTRO=debian-bookworm IMAGE=osmocom-build/ttcn3-asterisk-ims-ue-test OSMO_TTCN3_BRANCH=master make: Entering directory '<
https://jenkins.osmocom.org/jenkins/job/ttcn3-asterisk-ims-ue-test/ws/ttcn3…
'> awk: fatal: cannot open file `.release' for reading: No such file or directory awk: fatal: cannot open file `.release' for reading: No such file or directory awk: fatal: cannot open file `.release' for reading: No such file or directory rm -rf .common cp -r <
https://jenkins.osmocom.org/jenkins/job/ttcn3-asterisk-ims-ue-test/ws/common
> .common INFO: .release created release=0.0.0 docker build \ --build-arg USER=osmocom-build \ --build-arg UID=1000 \ --build-arg
REGISTRY=registry.osmocom.org
\ --build-arg OSMO_TTCN3_BRANCH=master \ --build-arg UPSTREAM_DISTRO=debian:bookworm \ --build-arg DISTRO=debian-bookworm \ --build-arg
OSMOCOM_REPO_MIRROR=https://downloads.osmocom.org
\ --build-arg OSMOCOM_REPO_PATH=packages/osmocom: \ --build-arg OSMOCOM_REPO_VERSION=latest \ --build-arg
OSMOCOM_REPO_TESTSUITE_MIRROR=https://downloads.osmocom.org
\ --build-arg ASTERISK_BRANCH=sysmocom/20.7.0 \ --build-arg LIBOSMOCORE_BRANCH=master \ --build-arg OSMO_BB_BRANCH=master \ --build-arg OSMO_BSC_BRANCH=master \ --build-arg OSMO_BTS_BRANCH=master \ --build-arg OSMO_CBC_BRANCH=master \ --build-arg OSMO_DIA2GSUP_BRANCH=master \ --build-arg OSMO_EPDG_BRANCH=master \ --build-arg OSMO_GBPROXY_BRANCH=master \ --build-arg OSMO_GGSN_BRANCH=master \ --build-arg OSMO_GSM_TESTER_BRANCH=master \ --build-arg OSMO_HLR_BRANCH=master \ --build-arg OSMO_HNBGW_BRANCH=master \ --build-arg OSMO_HNODEB_BRANCH=master \ --build-arg OSMO_IUH_BRANCH=master \ --build-arg OSMO_MGW_BRANCH=master \ --build-arg OSMO_MSC_BRANCH=master \ --build-arg OSMO_NITB_BRANCH=master \ --build-arg OSMO_PCU_BRANCH=master \ --build-arg OSMO_REMSIM_BRANCH=master \ --build-arg OSMO_S1GW_BRANCH=master \ --build-arg OSMO_SGSN_BRANCH=master \ --build-arg OSMO_SIP_BRANCH=master \ --build-arg OSMO_STP_BRANCH=master \ --build-arg OSMO_UECUPS_BRANCH=master \ --build-arg OPEN5GS_BRANCH=main \ --build-arg PJPROJECT_BRANCH=sysmocom/2.14 \ -t osmocom-build/ttcn3-asterisk-ims-ue-test:latest . #0 building with "default" instance using docker driver #1 [internal] load build definition from Dockerfile #1 transferring dockerfile: 461B done #1 WARN: InvalidDefaultArgInFrom: Default value for ARG $REGISTRY/$USER/debian-bookworm-titan results in empty or invalid base image name (line 3) #1 DONE 0.1s #2 [internal] load metadata for
registry.osmocom.org/osmocom-build/debian-bookworm-titan:latest
#2 DONE 0.0s #3 [internal] load .dockerignore #3 transferring context: #3 transferring context: 2B done #3 DONE 0.1s #4 [1/5] FROM
registry.osmocom.org/osmocom-build/debian-bookworm-titan:latest
#4 DONE 0.0s #5 [internal] load build context #5 transferring context: 2.21kB done #5 DONE 0.1s #6 [2/5] ADD
HTTPS://GERRIT.OSMOCOM.ORG/PLUGINS/GITILES/OSMO-TTCN3-HACKS/+/MASTER?FORMAT…
/tmp/commit #6 DONE 0.1s #7 [2/5] ADD
HTTPS://GERRIT.OSMOCOM.ORG/PLUGINS/GITILES/OSMO-TTCN3-HACKS/+/MASTER?FORMAT…
/tmp/commit #7 CACHED #8 [3/5] RUN TTCN3-DOCKER-PREPARE "master" asterisk #8 0.317 + OSMO_TTCN3_BRANCH=master #8 0.317 + shift #8 0.317 + cd /osmo-ttcn3-hacks #8 0.317 + git fetch #8 0.413 From
https://gerrit.osmocom.org/osmo-ttcn3-hacks
#8 0.413 b5e80f8c..2d1513ae master -> origin/master #8 0.422 + 3478f998...2d1513ae pespin/5gc -> origin/pespin/5gc (forced update) #8 0.429 + git checkout master #8 0.463 Already on 'master' #8 0.464 Your branch is behind 'origin/master' by 3 commits, and can be fast-forwarded. #8 0.464 (use "git pull" to update your local branch) #8 0.464 + git symbolic-ref -q HEAD #8 0.465 refs/heads/master #8 0.465 + git reset --hard origin/master #8 0.486 HEAD is now at 2d1513ae NGAP_Templates: Improve InitialContextSetupRequest template #8 0.487 + git rev-parse --abbrev-ref HEAD #8 0.488 master #8 0.488 + git rev-parse HEAD #8 0.489 2d1513aec135f550b405795ecd9a4ba974913cc8 #8 0.489 + diff -q /tmp/deps-Makefile deps/Makefile #8 0.491 Files /tmp/deps-Makefile and deps/Makefile differ #8 0.491 + make -j8 deps #8 0.616 make: Nothing to be done for 'deps'. #8 0.617 + ln -sv /osmo-ttcn3-hacks/ttcn3-dumpcap-start.sh /ttcn3-dumpcap-start.sh #8 0.627 '/ttcn3-dumpcap-start.sh' -> '/osmo-ttcn3-hacks/ttcn3-dumpcap-start.sh' #8 0.627 + ln -sv /osmo-ttcn3-hacks/ttcn3-tcpdump-start.sh /ttcn3-tcpdump-start.sh #8 0.629 '/ttcn3-tcpdump-start.sh' -> '/osmo-ttcn3-hacks/ttcn3-tcpdump-start.sh' #8 0.629 + ln -sv /osmo-ttcn3-hacks/ttcn3-dumpcap-stop.sh /ttcn3-dumpcap-stop.sh #8 0.630 '/ttcn3-dumpcap-stop.sh' -> '/osmo-ttcn3-hacks/ttcn3-dumpcap-stop.sh' #8 0.630 + ln -sv /osmo-ttcn3-hacks/ttcn3-tcpdump-stop.sh /ttcn3-tcpdump-stop.sh #8 0.632 '/ttcn3-tcpdump-stop.sh' -> '/osmo-ttcn3-hacks/ttcn3-tcpdump-stop.sh' #8 0.632 + ln -sv /osmo-ttcn3-hacks/_scripts /_scripts #8 0.633 '/_scripts' -> '/osmo-ttcn3-hacks/_scripts' #8 0.633 + make asterisk #8 0.763 (cd asterisk && ./gen_links.sh && ./regen_makefile.sh) #8 0.816 ttcn3_makefilegen: error: Cannot find any source file for argument `PIPEasp_Templates.ttcn'. #8 0.821 ttcn3_makefilegen: warning: TTCN-3 preprocessing (option `-p') is enabled, but no TTCN-3 files to be preprocessed were given for the Makefile. #8 0.822 make: *** [Makefile:131: _build/asterisk/Makefile] Error 1 #8 ERROR: process "/bin/sh -c ttcn3-docker-prepare \"$OSMO_TTCN3_BRANCH\" asterisk" did not complete successfully: exit code: 2 ------ > [3/5] RUN TTCN3-DOCKER-PREPARE "master" asterisk: 0.630 '/ttcn3-dumpcap-stop.sh' -> '/osmo-ttcn3-hacks/ttcn3-dumpcap-stop.sh' 0.630 + ln -sv /osmo-ttcn3-hacks/ttcn3-tcpdump-stop.sh /ttcn3-tcpdump-stop.sh 0.632 '/ttcn3-tcpdump-stop.sh' -> '/osmo-ttcn3-hacks/ttcn3-tcpdump-stop.sh' 0.632 + ln -sv /osmo-ttcn3-hacks/_scripts /_scripts 0.633 '/_scripts' -> '/osmo-ttcn3-hacks/_scripts' 0.633 + make asterisk 0.763 (cd asterisk && ./gen_links.sh && ./regen_makefile.sh) 0.816 ttcn3_makefilegen: error: Cannot find any source file for argument `PIPEasp_Templates.ttcn'. 0.821 ttcn3_makefilegen: warning: TTCN-3 preprocessing (option `-p') is enabled, but no TTCN-3 files to be preprocessed were given for the Makefile. 0.822 make: *** [Makefile:131: _build/asterisk/Makefile] Error 1 ------ [33m2 warnings found (use docker --debug to expand): [0m - InvalidDefaultArgInFrom: Default value for ARG $REGISTRY/$USER/debian-bookworm-titan results in empty or invalid base image name (line 3) - JSONArgsRecommended: JSON arguments recommended for CMD to prevent unintended behavior related to OS signals (line 14) Dockerfile:7 -------------------- 5 | 6 | ADD
https://gerrit.osmocom.org/plugins/gitiles/osmo-ttcn3-hacks/+/$OSMO_TTCN3_B…
/tmp/commit 7 | >>> RUN ttcn3-docker-prepare "$OSMO_TTCN3_BRANCH" asterisk 8 | 9 | VOLUME /data -------------------- ERROR: failed to solve: process "/bin/sh -c ttcn3-docker-prepare \"$OSMO_TTCN3_BRANCH\" asterisk" did not complete successfully: exit code: 2 make: *** [../make/Makefile:96: docker-build] Error 1 make: Leaving directory '<
https://jenkins.osmocom.org/jenkins/job/ttcn3-asterisk-ims-ue-test/ws/ttcn3…
'> + exit 1 + RC=1 + uptime + grep --color=always -o load.* [01;31m[Kload average: 5.42, 3.11, 2.14[m[K + exit 1 Build step 'Execute shell' marked build as failure Recording test results ERROR: Step ‘Publish JUnit test result report’ failed: No test report files were found. Configuration error?
1 day, 14 hours
1
1
0
0
Build failed in Jenkins: ttcn3-ggsn-test-kernel-latest #1665
by jenkins@lists.osmocom.org
See <
https://jenkins.osmocom.org/jenkins/job/ttcn3-ggsn-test-kernel-latest/1665/…
> Changes: [Oliver Smith] testenv: install curl backport only for bookworm [Oliver Smith] Cosmetic: testenv: make builddir_env more readable [laforge] msc: also execute evil USSD tests for -latest [Oliver Smith] testenv: use separate cache dirs per distro [Oliver Smith] testenv: init podman: add --distro arg [Oliver Smith] testenv: debian 13: fix installing libgcc [Oliver Smith] testenv: debian 13: fix installing eclipse-titan [Oliver Smith] testenv: check for --distro without --podman [Oliver Smith] testenv: check value of --distro early [Oliver Smith] testenv: add debian:trixie [Oliver Smith] testenv: enable_binary_repo: configure apt pin [Oliver Smith] testenv: set default distro to debian:trixie ------------------------------------------ [...truncated 80.25 KiB...] Unpacking libosmoctrl0:amd64 (1.11.2) ... Selecting previously unselected package libosmosim2:amd64. Preparing to unpack .../18-libosmosim2_1.11.2_amd64.deb ... Unpacking libosmosim2:amd64 (1.11.2) ... Selecting previously unselected package libosmousb0:amd64. Preparing to unpack .../19-libosmousb0_1.11.2_amd64.deb ... Unpacking libosmousb0:amd64 (1.11.2) ... Selecting previously unselected package libosmocore. Preparing to unpack .../20-libosmocore_1.11.2_amd64.deb ... Unpacking libosmocore (1.11.2) ... Selecting previously unselected package libosmocore-utils:amd64. Preparing to unpack .../21-libosmocore-utils_1.11.2_amd64.deb ... Unpacking libosmocore-utils:amd64 (1.11.2) ... Selecting previously unselected package libxau6:amd64. Preparing to unpack .../22-libxau6_1%3a1.0.11-1_amd64.deb ... Unpacking libxau6:amd64 (1:1.0.11-1) ... Selecting previously unselected package libxdmcp6:amd64. Preparing to unpack .../23-libxdmcp6_1%3a1.1.5-1_amd64.deb ... Unpacking libxdmcp6:amd64 (1:1.1.5-1) ... Selecting previously unselected package libxcb1:amd64. Preparing to unpack .../24-libxcb1_1.17.0-2+b1_amd64.deb ... Unpacking libxcb1:amd64 (1.17.0-2+b1) ... Selecting previously unselected package libx11-data. Preparing to unpack .../25-libx11-data_2%3a1.8.12-1_all.deb ... Unpacking libx11-data (2:1.8.12-1) ... Selecting previously unselected package libx11-6:amd64. Preparing to unpack .../26-libx11-6_2%3a1.8.12-1_amd64.deb ... Unpacking libx11-6:amd64 (2:1.8.12-1) ... Selecting previously unselected package libxrender1:amd64. Preparing to unpack .../27-libxrender1_1%3a0.9.12-1_amd64.deb ... Unpacking libxrender1:amd64 (1:0.9.12-1) ... Selecting previously unselected package libxft2:amd64. Preparing to unpack .../28-libxft2_2.3.6-1+b4_amd64.deb ... Unpacking libxft2:amd64 (2.3.6-1+b4) ... Selecting previously unselected package libxext6:amd64. Preparing to unpack .../29-libxext6_2%3a1.3.4-1+b3_amd64.deb ... Unpacking libxext6:amd64 (2:1.3.4-1+b3) ... Selecting previously unselected package x11-common. Preparing to unpack .../30-x11-common_1%3a7.7+24_all.deb ... Unpacking x11-common (1:7.7+24) ... Selecting previously unselected package libxss1:amd64. Preparing to unpack .../31-libxss1_1%3a1.2.3-1+b3_amd64.deb ... Unpacking libxss1:amd64 (1:1.2.3-1+b3) ... Selecting previously unselected package libtk8.6:amd64. Preparing to unpack .../32-libtk8.6_8.6.16-1_amd64.deb ... Unpacking libtk8.6:amd64 (8.6.16-1) ... Selecting previously unselected package libpython3.13-dbg:amd64. Preparing to unpack .../33-libpython3.13-dbg_3.13.5-2_amd64.deb ... Unpacking libpython3.13-dbg:amd64 (3.13.5-2) ... Selecting previously unselected package libpython3-dbg:amd64. Preparing to unpack .../34-libpython3-dbg_3.13.5-1_amd64.deb ... Unpacking libpython3-dbg:amd64 (3.13.5-1) ... Selecting previously unselected package osmo-ggsn. Preparing to unpack .../35-osmo-ggsn_1.13.0_amd64.deb ... Unpacking osmo-ggsn (1.13.0) ... Selecting previously unselected package python3.13-dbg. Preparing to unpack .../36-python3.13-dbg_3.13.5-2_amd64.deb ... Unpacking python3.13-dbg (3.13.5-2) ... Selecting previously unselected package python3-dbg. Preparing to unpack .../37-python3-dbg_3.13.5-1_amd64.deb ... Unpacking python3-dbg (3.13.5-1) ... Selecting previously unselected package libgtp-dbg:amd64. Preparing to unpack .../38-libgtp-dbg_1.13.0_amd64.deb ... Unpacking libgtp-dbg:amd64 (1.13.0) ... Selecting previously unselected package libosmocore-dbg:amd64. Preparing to unpack .../39-libosmocore-dbg_1.11.2_amd64.deb ... Unpacking libosmocore-dbg:amd64 (1.11.2) ... Selecting previously unselected package osmo-ggsn-dbg:amd64. Preparing to unpack .../40-osmo-ggsn-dbg_1.13.0_amd64.deb ... Unpacking osmo-ggsn-dbg:amd64 (1.13.0) ... Setting up libxau6:amd64 (1:1.0.11-1) ... Setting up libxdmcp6:amd64 (1:1.1.5-1) ... Setting up libxcb1:amd64 (1.17.0-2+b1) ... Setting up x11-common (1:7.7+24) ... invoke-rc.d: could not determine current runlevel invoke-rc.d: policy-rc.d denied execution of start. Setting up libc6-dbg:amd64 (2.41-12) ... Setting up libfreetype6:amd64 (2.13.3+dfsg-1) ... Setting up libx11-data (2:1.8.12-1) ... Setting up fonts-dejavu-mono (2.37-8) ... Setting up fonts-dejavu-core (2.37-8) ... Setting up libx11-6:amd64 (2:1.8.12-1) ... Setting up libxrender1:amd64 (1:0.9.12-1) ... Setting up fontconfig-config (2.15.0-2.3) ... Setting up libxext6:amd64 (2:1.3.4-1+b3) ... Setting up libxss1:amd64 (1:1.2.3-1+b3) ... Setting up osmocom-keyring (1.0.2) ... Setting up osmocom-latest (1.1.0) ... Setting up libgtpnl0:amd64 (1.3.2) ... Setting up libosmocore22:amd64 (1.11.2) ... Setting up libosmocodec4:amd64 (1.11.2) ... Setting up libosmovty13:amd64 (1.11.2) ... Setting up libosmoisdn0:amd64 (1.11.2) ... Setting up libgtp11:amd64 (1.13.0) ... Setting up libosmousb0:amd64 (1.11.2) ... Setting up libosmogsm20:amd64 (1.11.2) ... Setting up libosmoctrl0:amd64 (1.11.2) ... Setting up libosmogb14:amd64 (1.11.2) ... Setting up libgtp-dbg:amd64 (1.13.0) ... Setting up osmo-ggsn (1.13.0) ... changed ownership of '/etc/osmocom/osmo-ggsn.cfg' from root:root to osmocom:osmocom mode of '/etc/osmocom/osmo-ggsn.cfg' changed from 0644 (rw-r--r--) to 0660 (rw-rw----) changed ownership of '/etc/osmocom' from root:root to root:osmocom mode of '/etc/osmocom' changed from 0755 (rwxr-xr-x) to 2775 (rwxrwsr-x) changed ownership of '/var/lib/osmocom' from root:root to osmocom:osmocom Created symlink '/etc/systemd/system/multi-user.target.wants/osmo-ggsn.service' → '/usr/lib/systemd/system/osmo-ggsn.service'. Setting up libosmocoding0:amd64 (1.11.2) ... Setting up libosmosim2:amd64 (1.11.2) ... Setting up libosmocore (1.11.2) ... Setting up libosmocore-utils:amd64 (1.11.2) ... Setting up osmo-ggsn-dbg:amd64 (1.13.0) ... Setting up libosmocore-dbg:amd64 (1.11.2) ... Processing triggers for sgml-base (1.31+nmu1) ... Setting up libfontconfig1:amd64 (2.15.0-2.3) ... Setting up libxft2:amd64 (2.3.6-1+b4) ... Setting up libtk8.6:amd64 (8.6.16-1) ... Processing triggers for libc-bin (2.41-12) ... Setting up libpython3.13-dbg:amd64 (3.13.5-2) ... Setting up python3.13-dbg (3.13.5-2) ... python3.13-dbg: can't get files for byte-compilation Setting up libpython3-dbg:amd64 (3.13.5-1) ... Setting up python3-dbg (3.13.5-1) ... Processing triggers for libc-bin (2.41-12) ... [1;34m[testenv][osmo_ggsn_v4_only] Preparing testdir: <
https://jenkins.osmocom.org/jenkins/job/ttcn3-ggsn-test-kernel-latest/1665/…
> [0;94m[testenv][osmo_ggsn_v4_only] + ['podman', 'exec', '-e', 'CCACHE_DIR=/home/osmocom-build/ccache/testenv', '-e', 'TESTENV_CACHE_DIR=<
https://jenkins.osmocom.org/jenkins/job/ttcn3-ggsn-test-kernel-latest/ws/_c…
',> '-e', 'TESTENV_SRC_DIR=/home/osmocom-build/jenkins/workspace', '-e', 'TESTENV_INSTALL_DIR=/-debian-trixie', '-e', 'TERM=dumb', '-e', 'TESTENV_QEMU_KERNEL=debian', '-e', 'TESTENV_QEMU_SCRIPTS=<
https://jenkins.osmocom.org/jenkins/job/ttcn3-ggsn-test-kernel-latest/ws/_t…
',> '-e', 'PATH=<
https://jenkins.osmocom.org/jenkins/job/ttcn3-ggsn-test-kernel-latest/ws/_t…
>:<
https://jenkins.osmocom.org/jenkins/job/ttcn3-ggsn-test-kernel-latest/ws/_t…
>:<
https://jenkins.osmocom.org/jenkins/job/ttcn3-ggsn-test-kernel-latest/ws/gg…
>:/-debian-trixie/bin:/-debian-trixie/usr/bin:/usr/local/bin:/usr/sbin:/usr/bin:/sbin:/bin', '-e', 'HOME=/home/osmocom-build', '-t', 'testenv-ggsn_tests-osmo_ggsn_v_only-osmocom-latest-20250827-1243-99fbde12-0', 'install', '-Dm644', '<
https://jenkins.osmocom.org/jenkins/job/ttcn3-ggsn-test-kernel-latest/ws/gg…
',> '<
https://jenkins.osmocom.org/jenkins/job/ttcn3-ggsn-test-kernel-latest/1665/…
'][0m> [0;94m[testenv][osmo_ggsn_v4_only] + ['cp', '-a', 'osmo-ggsn', '<
https://jenkins.osmocom.org/jenkins/job/ttcn3-ggsn-test-kernel-latest/1665/…
'][0m> [0;94m[testenv][osmo_ggsn_v4_only] + ['podman', 'exec', '-e', 'CCACHE_DIR=/home/osmocom-build/ccache/testenv', '-e', 'TESTENV_CACHE_DIR=<
https://jenkins.osmocom.org/jenkins/job/ttcn3-ggsn-test-kernel-latest/ws/_c…
',> '-e', 'TESTENV_SRC_DIR=/home/osmocom-build/jenkins/workspace', '-e', 'TESTENV_INSTALL_DIR=/-debian-trixie', '-e', 'TERM=dumb', '-e', 'TESTENV_QEMU_KERNEL=debian', '-e', 'TESTENV_QEMU_SCRIPTS=<
https://jenkins.osmocom.org/jenkins/job/ttcn3-ggsn-test-kernel-latest/ws/_t…
',> '-e', 'PATH=<
https://jenkins.osmocom.org/jenkins/job/ttcn3-ggsn-test-kernel-latest/ws/_t…
>:<
https://jenkins.osmocom.org/jenkins/job/ttcn3-ggsn-test-kernel-latest/ws/_t…
>:<
https://jenkins.osmocom.org/jenkins/job/ttcn3-ggsn-test-kernel-latest/ws/gg…
>:/-debian-trixie/bin:/-debian-trixie/usr/bin:/usr/local/bin:/usr/sbin:/usr/bin:/sbin:/bin', '-e', 'HOME=/home/osmocom-build', '-t', 'testenv-ggsn_tests-osmo_ggsn_v_only-osmocom-latest-20250827-1243-99fbde12-0', 'install', '-Dm644', '<
https://jenkins.osmocom.org/jenkins/job/ttcn3-ggsn-test-kernel-latest/ws/gg…
',> '<
https://jenkins.osmocom.org/jenkins/job/ttcn3-ggsn-test-kernel-latest/1665/…
'][0m> [0;94m[testenv][osmo_ggsn_v4_only] + ['podman', 'exec', '-e', 'CCACHE_DIR=/home/osmocom-build/ccache/testenv', '-e', 'TESTENV_CACHE_DIR=<
https://jenkins.osmocom.org/jenkins/job/ttcn3-ggsn-test-kernel-latest/ws/_c…
',> '-e', 'TESTENV_SRC_DIR=/home/osmocom-build/jenkins/workspace', '-e', 'TESTENV_INSTALL_DIR=/-debian-trixie', '-e', 'TERM=dumb', '-e', 'TESTENV_QEMU_KERNEL=debian', '-e', 'TESTENV_QEMU_SCRIPTS=<
https://jenkins.osmocom.org/jenkins/job/ttcn3-ggsn-test-kernel-latest/ws/_t…
',> '-e', 'PATH=<
https://jenkins.osmocom.org/jenkins/job/ttcn3-ggsn-test-kernel-latest/ws/_t…
>:<
https://jenkins.osmocom.org/jenkins/job/ttcn3-ggsn-test-kernel-latest/ws/_t…
>:<
https://jenkins.osmocom.org/jenkins/job/ttcn3-ggsn-test-kernel-latest/ws/gg…
>:/-debian-trixie/bin:/-debian-trixie/usr/bin:/usr/local/bin:/usr/sbin:/usr/bin:/sbin:/bin', '-e', 'HOME=/home/osmocom-build', '-t', 'testenv-ggsn_tests-osmo_ggsn_v_only-osmocom-latest-20250827-1243-99fbde12-0', 'install', '-Dm644', '<
https://jenkins.osmocom.org/jenkins/job/ttcn3-ggsn-test-kernel-latest/ws/Co…
',> '<
https://jenkins.osmocom.org/jenkins/job/ttcn3-ggsn-test-kernel-latest/1665/…
'][0m> [0;94m[testenv][osmo_ggsn_v4_only] + ['podman', 'exec', '-e', 'CCACHE_DIR=/home/osmocom-build/ccache/testenv', '-e', 'TESTENV_CACHE_DIR=<
https://jenkins.osmocom.org/jenkins/job/ttcn3-ggsn-test-kernel-latest/ws/_c…
',> '-e', 'TESTENV_SRC_DIR=/home/osmocom-build/jenkins/workspace', '-e', 'TESTENV_INSTALL_DIR=/-debian-trixie', '-e', 'TERM=dumb', '-e', 'TESTENV_QEMU_KERNEL=debian', '-e', 'TESTENV_QEMU_SCRIPTS=<
https://jenkins.osmocom.org/jenkins/job/ttcn3-ggsn-test-kernel-latest/ws/_t…
',> '-e', 'PATH=<
https://jenkins.osmocom.org/jenkins/job/ttcn3-ggsn-test-kernel-latest/ws/_t…
>:<
https://jenkins.osmocom.org/jenkins/job/ttcn3-ggsn-test-kernel-latest/ws/_t…
>:<
https://jenkins.osmocom.org/jenkins/job/ttcn3-ggsn-test-kernel-latest/ws/gg…
>:/-debian-trixie/bin:/-debian-trixie/usr/bin:/usr/local/bin:/usr/sbin:/usr/bin:/sbin:/bin', '-e', 'HOME=/home/osmocom-build', '-t', 'testenv-ggsn_tests-osmo_ggsn_v_only-osmocom-latest-20250827-1243-99fbde12-0', 'sed', '-i', 's#TTCN3_HACKS_PATH := .*#TTCN3_HACKS_PATH := "<
https://jenkins.osmocom.org/jenkins/job/ttcn3-ggsn-test-kernel-latest/ws/
">#', '<
https://jenkins.osmocom.org/jenkins/job/ttcn3-ggsn-test-kernel-latest/1665/…
'][0m> [0;94m[testenv][osmo_ggsn_v4_only] Adjusting testsuite config: <
https://jenkins.osmocom.org/jenkins/job/ttcn3-ggsn-test-kernel-latest/1665/…
> [0;94m[testenv][osmo_ggsn_v4_only] + ['podman', 'exec', '-e', 'CCACHE_DIR=/home/osmocom-build/ccache/testenv', '-e', 'TESTENV_CACHE_DIR=<
https://jenkins.osmocom.org/jenkins/job/ttcn3-ggsn-test-kernel-latest/ws/_c…
',> '-e', 'TESTENV_SRC_DIR=/home/osmocom-build/jenkins/workspace', '-e', 'TESTENV_INSTALL_DIR=/-debian-trixie', '-e', 'TERM=dumb', '-e', 'TESTENV_QEMU_KERNEL=debian', '-e', 'TESTENV_QEMU_SCRIPTS=<
https://jenkins.osmocom.org/jenkins/job/ttcn3-ggsn-test-kernel-latest/ws/_t…
',> '-e', 'PATH=<
https://jenkins.osmocom.org/jenkins/job/ttcn3-ggsn-test-kernel-latest/ws/_t…
>:<
https://jenkins.osmocom.org/jenkins/job/ttcn3-ggsn-test-kernel-latest/ws/_t…
>:<
https://jenkins.osmocom.org/jenkins/job/ttcn3-ggsn-test-kernel-latest/ws/gg…
>:/-debian-trixie/bin:/-debian-trixie/usr/bin:/usr/local/bin:/usr/sbin:/usr/bin:/sbin:/bin', '-e', 'HOME=/home/osmocom-build', '-t', 'testenv-ggsn_tests-osmo_ggsn_v_only-osmocom-latest-20250827-1243-99fbde12-0', 'sed', '-i', '-e', 's/\\[MODULE_PARAMETERS\\]/\\[MODULE_PARAMETERS\\]\\nMisc_Helpers.mp_osmo_repo := "latest"/g', '-e', 's#../Common.cfg#Common.cfg#', '<
https://jenkins.osmocom.org/jenkins/job/ttcn3-ggsn-test-kernel-latest/1665/…
'][0m> [0;94m[testenv][osmo_ggsn_v4_only] Adjusting testsuite config: <
https://jenkins.osmocom.org/jenkins/job/ttcn3-ggsn-test-kernel-latest/1665/…
> [0;94m[testenv][osmo_ggsn_v4_only] + ['podman', 'exec', '-e', 'CCACHE_DIR=/home/osmocom-build/ccache/testenv', '-e', 'TESTENV_CACHE_DIR=<
https://jenkins.osmocom.org/jenkins/job/ttcn3-ggsn-test-kernel-latest/ws/_c…
',> '-e', 'TESTENV_SRC_DIR=/home/osmocom-build/jenkins/workspace', '-e', 'TESTENV_INSTALL_DIR=/-debian-trixie', '-e', 'TERM=dumb', '-e', 'TESTENV_QEMU_KERNEL=debian', '-e', 'TESTENV_QEMU_SCRIPTS=<
https://jenkins.osmocom.org/jenkins/job/ttcn3-ggsn-test-kernel-latest/ws/_t…
',> '-e', 'PATH=<
https://jenkins.osmocom.org/jenkins/job/ttcn3-ggsn-test-kernel-latest/ws/_t…
>:<
https://jenkins.osmocom.org/jenkins/job/ttcn3-ggsn-test-kernel-latest/ws/_t…
>:<
https://jenkins.osmocom.org/jenkins/job/ttcn3-ggsn-test-kernel-latest/ws/gg…
>:/-debian-trixie/bin:/-debian-trixie/usr/bin:/usr/local/bin:/usr/sbin:/usr/bin:/sbin:/bin', '-e', 'HOME=/home/osmocom-build', '-t', 'testenv-ggsn_tests-osmo_ggsn_v_only-osmocom-latest-20250827-1243-99fbde12-0', 'sed', '-i', '-e', 's/\\[MODULE_PARAMETERS\\]/\\[MODULE_PARAMETERS\\]\\nMisc_Helpers.mp_osmo_repo := "latest"/g', '-e', 's#../Common.cfg#Common.cfg#', '<
https://jenkins.osmocom.org/jenkins/job/ttcn3-ggsn-test-kernel-latest/1665/…
'][0m> [0;94m[testenv][osmo_ggsn_v4_only] Adjusting testsuite config: <
https://jenkins.osmocom.org/jenkins/job/ttcn3-ggsn-test-kernel-latest/1665/…
> [0;94m[testenv][osmo_ggsn_v4_only] + ['podman', 'exec', '-e', 'CCACHE_DIR=/home/osmocom-build/ccache/testenv', '-e', 'TESTENV_CACHE_DIR=<
https://jenkins.osmocom.org/jenkins/job/ttcn3-ggsn-test-kernel-latest/ws/_c…
',> '-e', 'TESTENV_SRC_DIR=/home/osmocom-build/jenkins/workspace', '-e', 'TESTENV_INSTALL_DIR=/-debian-trixie', '-e', 'TERM=dumb', '-e', 'TESTENV_QEMU_KERNEL=debian', '-e', 'TESTENV_QEMU_SCRIPTS=<
https://jenkins.osmocom.org/jenkins/job/ttcn3-ggsn-test-kernel-latest/ws/_t…
',> '-e', 'PATH=<
https://jenkins.osmocom.org/jenkins/job/ttcn3-ggsn-test-kernel-latest/ws/_t…
>:<
https://jenkins.osmocom.org/jenkins/job/ttcn3-ggsn-test-kernel-latest/ws/_t…
>:<
https://jenkins.osmocom.org/jenkins/job/ttcn3-ggsn-test-kernel-latest/ws/gg…
>:/-debian-trixie/bin:/-debian-trixie/usr/bin:/usr/local/bin:/usr/sbin:/usr/bin:/sbin:/bin', '-e', 'HOME=/home/osmocom-build', '-t', 'testenv-ggsn_tests-osmo_ggsn_v_only-osmocom-latest-20250827-1243-99fbde12-0', 'sed', '-i', '-e', 's/\\[MODULE_PARAMETERS\\]/\\[MODULE_PARAMETERS\\]\\nMisc_Helpers.mp_osmo_repo := "latest"/g', '-e', 's#../Common.cfg#Common.cfg#', '<
https://jenkins.osmocom.org/jenkins/job/ttcn3-ggsn-test-kernel-latest/1665/…
'][0m> [1;34m[testenv][osmo_ggsn_v4_only] Running ggsn clean script (reason: prepare)[0m [0;94m[testenv][osmo_ggsn_v4_only] + ['podman', 'exec', '-e', 'CCACHE_DIR=/home/osmocom-build/ccache/testenv', '-e', 'TESTENV_CACHE_DIR=<
https://jenkins.osmocom.org/jenkins/job/ttcn3-ggsn-test-kernel-latest/ws/_c…
',> '-e', 'TESTENV_SRC_DIR=/home/osmocom-build/jenkins/workspace', '-e', 'TESTENV_INSTALL_DIR=/-debian-trixie', '-e', 'TERM=dumb', '-e', 'TESTENV_QEMU_KERNEL=debian', '-e', 'TESTENV_QEMU_SCRIPTS=<
https://jenkins.osmocom.org/jenkins/job/ttcn3-ggsn-test-kernel-latest/ws/_t…
',> '-e', 'PATH=<
https://jenkins.osmocom.org/jenkins/job/ttcn3-ggsn-test-kernel-latest/ws/_t…
>:<
https://jenkins.osmocom.org/jenkins/job/ttcn3-ggsn-test-kernel-latest/ws/_t…
>:<
https://jenkins.osmocom.org/jenkins/job/ttcn3-ggsn-test-kernel-latest/ws/gg…
>:/-debian-trixie/bin:/-debian-trixie/usr/bin:/usr/local/bin:/usr/sbin:/usr/bin:/sbin:/bin', '-e', 'HOME=/home/osmocom-build', '-e', 'TESTENV_CLEAN_REASON=prepare', '-t', '-w', '<
https://jenkins.osmocom.org/jenkins/job/ttcn3-ggsn-test-kernel-latest/1665/…
',> 'testenv-ggsn_tests-osmo_ggsn_v_only-osmocom-latest-20250827-1243-99fbde12-0', 'sh', '-c', 'osmo-ggsn/testenv.sh v4_only'][0m + CONFIG=v4_only + check_usage + local valid=all|v4_only|v6_only|v4v6_only + [ -z v4_only ] + [ -n debian ] + add_remove_testenv0_bridge.sh + del_bridge + ip link ls dev testenv0 + add_bridge + local ip + sudo brctl addbr testenv0 + sudo ip link set testenv0 up + sudo ip addr add 172.18.3.1/24 dev testenv0 + sudo ip addr add fd02:db8:3::1/128 dev testenv0 + check_usage_qemu + [ -n debian ] + [ v4_only = all ] + adjust_osmo_ggsn_config + osmo-config-merge osmo-ggsn/osmo-ggsn.src.cfg osmo-ggsn/osmo-ggsn-v4_only.confmerge + replace_ips osmo-ggsn.cfg + sed -i s/127\.0\.0\./172.18.3./g osmo-ggsn.cfg + [ -n debian ] + sed -i s/gtpu-mode tun/gtpu-mode kernel-gtp/ osmo-ggsn.cfg + adjust_ttcn3_config + echo v4_only + tr [:lower:] [:upper:] + local config_upper=V4_ONLY + sed -i s/^GGSN_Tests.m_ggsn_conf := .*/GGSN_Tests.m_ggsn_conf := GGSN_CONF_V4_ONLY/ ../testsuite/GGSN_Tests.cfg + replace_ips ../testsuite/GGSN_Tests.cfg + sed -i s/127\.0\.0\./172.18.3./g ../testsuite/GGSN_Tests.cfg + setcap_osmo_ggsn + [ -z debian ] [1;34m[testenv][osmo_ggsn_v4_only] Running ggsn[0m [0;94m[testenv][osmo_ggsn_v4_only] + ['podman', 'exec', '-e', 'CCACHE_DIR=/home/osmocom-build/ccache/testenv', '-e', 'TESTENV_CACHE_DIR=<
https://jenkins.osmocom.org/jenkins/job/ttcn3-ggsn-test-kernel-latest/ws/_c…
',> '-e', 'TESTENV_SRC_DIR=/home/osmocom-build/jenkins/workspace', '-e', 'TESTENV_INSTALL_DIR=/-debian-trixie', '-e', 'TERM=dumb', '-e', 'TESTENV_QEMU_KERNEL=debian', '-e', 'TESTENV_QEMU_SCRIPTS=<
https://jenkins.osmocom.org/jenkins/job/ttcn3-ggsn-test-kernel-latest/ws/_t…
',> '-e', 'PATH=<
https://jenkins.osmocom.org/jenkins/job/ttcn3-ggsn-test-kernel-latest/ws/_t…
>:<
https://jenkins.osmocom.org/jenkins/job/ttcn3-ggsn-test-kernel-latest/ws/_t…
>:<
https://jenkins.osmocom.org/jenkins/job/ttcn3-ggsn-test-kernel-latest/ws/gg…
>:/-debian-trixie/bin:/-debian-trixie/usr/bin:/usr/local/bin:/usr/sbin:/usr/bin:/sbin:/bin', '-e', 'HOME=/home/osmocom-build', '-w', '<
https://jenkins.osmocom.org/jenkins/job/ttcn3-ggsn-test-kernel-latest/1665/…
',> 'testenv-ggsn_tests-osmo_ggsn_v_only-osmocom-latest-20250827-1243-99fbde12-0', 'sh', '-c', 'osmo-ggsn/run.sh 2>&1 | tee <
https://jenkins.osmocom.org/jenkins/job/ttcn3-ggsn-test-kernel-latest/1665/…
'][0m> [1;34m[testenv][osmo_ggsn_v4_only] Running ggsn setup script[0m [0;94m[testenv][osmo_ggsn_v4_only] + ['podman', 'exec', '-e', 'CCACHE_DIR=/home/osmocom-build/ccache/testenv', '-e', 'TESTENV_CACHE_DIR=<
https://jenkins.osmocom.org/jenkins/job/ttcn3-ggsn-test-kernel-latest/ws/_c…
',> '-e', 'TESTENV_SRC_DIR=/home/osmocom-build/jenkins/workspace', '-e', 'TESTENV_INSTALL_DIR=/-debian-trixie', '-e', 'TERM=dumb', '-e', 'TESTENV_QEMU_KERNEL=debian', '-e', 'TESTENV_QEMU_SCRIPTS=<
https://jenkins.osmocom.org/jenkins/job/ttcn3-ggsn-test-kernel-latest/ws/_t…
',> '-e', 'PATH=<
https://jenkins.osmocom.org/jenkins/job/ttcn3-ggsn-test-kernel-latest/ws/_t…
>:<
https://jenkins.osmocom.org/jenkins/job/ttcn3-ggsn-test-kernel-latest/ws/_t…
>:<
https://jenkins.osmocom.org/jenkins/job/ttcn3-ggsn-test-kernel-latest/ws/gg…
>:/-debian-trixie/bin:/-debian-trixie/usr/bin:/usr/local/bin:/usr/sbin:/usr/bin:/sbin:/bin', '-e', 'HOME=/home/osmocom-build', '-t', '-w', '<
https://jenkins.osmocom.org/jenkins/job/ttcn3-ggsn-test-kernel-latest/1665/…
',> 'testenv-ggsn_tests-osmo_ggsn_v_only-osmocom-latest-20250827-1243-99fbde12-0', 'sh', '-c', 'qemu_wait.sh'][0m + [ -z debian ] + . qemu_functions.sh + INITRD_DIR=<
https://jenkins.osmocom.org/jenkins/job/ttcn3-ggsn-test-kernel-latest/1665/…
> + CORE_DIR=<
https://jenkins.osmocom.org/jenkins/job/ttcn3-ggsn-test-kernel-latest/1665/…
> + qemu_build_initrd_with_log_redirect + trap qemu_initrd_exit_error EXIT INT TERM 0 + build_initrd + qemu_initrd_exit_error + trap - EXIT INT TERM 0 + cat build_initrd.log + qemu_initrd_init + mkdir <
https://jenkins.osmocom.org/jenkins/job/ttcn3-ggsn-test-kernel-latest/1665/…
> + ln -s usr/bin <
https://jenkins.osmocom.org/jenkins/job/ttcn3-ggsn-test-kernel-latest/1665/…
> + ln -s usr/sbin <
https://jenkins.osmocom.org/jenkins/job/ttcn3-ggsn-test-kernel-latest/1665/…
> + ln -s usr/lib <
https://jenkins.osmocom.org/jenkins/job/ttcn3-ggsn-test-kernel-latest/1665/…
> + ln -s usr/lib64 <
https://jenkins.osmocom.org/jenkins/job/ttcn3-ggsn-test-kernel-latest/1665/…
> + mkdir -p <
https://jenkins.osmocom.org/jenkins/job/ttcn3-ggsn-test-kernel-latest/1665/…
> <
https://jenkins.osmocom.org/jenkins/job/ttcn3-ggsn-test-kernel-latest/1665/…
> <
https://jenkins.osmocom.org/jenkins/job/ttcn3-ggsn-test-kernel-latest/1665/…
> <
https://jenkins.osmocom.org/jenkins/job/ttcn3-ggsn-test-kernel-latest/1665/…
> <
https://jenkins.osmocom.org/jenkins/job/ttcn3-ggsn-test-kernel-latest/1665/…
> <
https://jenkins.osmocom.org/jenkins/job/ttcn3-ggsn-test-kernel-latest/1665/…
> + qemu_initrd_add_bin busybox + local bin + local bin_path + local file + local bin_path + which busybox + bin_path=/usr/bin/busybox + [ -z /usr/bin/busybox ] + lddtree -l /usr/bin/busybox + lddtree_out=/usr/bin/busybox + [ -z /usr/bin/busybox ] + qemu_initrd_add_file /usr/bin/busybox + local i + local cp=cp --no-dereference --recursive --parents + cp --no-dereference --recursive --parents /usr/bin/busybox <
https://jenkins.osmocom.org/jenkins/job/ttcn3-ggsn-test-kernel-latest/1665/…
> + [ -L /usr/bin/busybox ] + qemu_initrd_add_cmd export PATH='<
https://jenkins.osmocom.org/jenkins/job/ttcn3-ggsn-test-kernel-latest/ws/_t…
>:<
https://jenkins.osmocom.org/jenkins/job/ttcn3-ggsn-test-kernel-latest/ws/_t…
>:<
https://jenkins.osmocom.org/jenkins/job/ttcn3-ggsn-test-kernel-latest/ws/gg…
>:/-debian-trixie/bin:/-debian-trixie/usr/bin:/usr/local/bin:/usr/sbin:/usr/bin:/sbin:/bin:$PATH' + local i + [ -e <
https://jenkins.osmocom.org/jenkins/job/ttcn3-ggsn-test-kernel-latest/1665/…
> ] + echo #!/bin/sh -ex + chmod +x <
https://jenkins.osmocom.org/jenkins/job/ttcn3-ggsn-test-kernel-latest/1665/…
> + echo export PATH='<
https://jenkins.osmocom.org/jenkins/job/ttcn3-ggsn-test-kernel-latest/ws/_t…
>:<
https://jenkins.osmocom.org/jenkins/job/ttcn3-ggsn-test-kernel-latest/ws/_t…
>:<
https://jenkins.osmocom.org/jenkins/job/ttcn3-ggsn-test-kernel-latest/ws/gg…
>:/-debian-trixie/bin:/-debian-trixie/usr/bin:/usr/local/bin:/usr/sbin:/usr/bin:/sbin:/bin:$PATH' + [ debian = debian ] + qemu_initrd_add_mod virtio_net virtio_pci + [ debian != debian ] + basename /lib/modules/6.12.41+deb13-amd64 + local kernel=6.12.41+deb13-amd64 + modprobe -a --dry-run --show-depends --set-version=6.12.41+deb13-amd64 virtio_net virtio_pci + sort -u + cut -d -f 2 + local files=virtio_pci /lib/modules/6.12.41+deb13-amd64/kernel/drivers/net/net_failover.ko.xz /lib/modules/6.12.41+deb13-amd64/kernel/drivers/net/virtio_net.ko.xz /lib/modules/6.12.41+deb13-amd64/kernel/net/core/failover.ko.xz + qemu_initrd_add_file virtio_pci /lib/modules/6.12.41+deb13-amd64/kernel/drivers/net/net_failover.ko.xz /lib/modules/6.12.41+deb13-amd64/kernel/drivers/net/virtio_net.ko.xz /lib/modules/6.12.41+deb13-amd64/kernel/net/core/failover.ko.xz /usr/lib/modules/6.12.41+deb13-amd64/modules.alias + local i + local cp=cp --no-dereference --recursive --parents + cp --no-dereference --recursive --parents virtio_pci <
https://jenkins.osmocom.org/jenkins/job/ttcn3-ggsn-test-kernel-latest/1665/…
> cp: cannot stat 'virtio_pci': No such file or directory + set +x ERROR: failed to build the initrd! [1;91m[testenv][osmo_ggsn_v4_only] ggsn: setup script failed[0m [1;34m[testenv][osmo_ggsn_v4_only] Stopping podman container[0m [0;94m[testenv][osmo_ggsn_v4_only] + ['podman', 'kill', 'testenv-ggsn_tests-osmo_ggsn_v_only-osmocom-latest-20250827-1243-99fbde12-0'][0m testenv-ggsn_tests-osmo_ggsn_v_only-osmocom-latest-20250827-1243-99fbde12-0 [0;94m[testenv][osmo_ggsn_v4_only] Skipping clean up scripts, podman container has already stopped[0m [0;94m[testenv] feed_watchdog_loop: podman container has stopped[0m [1;34m[testenv][osmo_ggsn_v4_only] Logs saved to:
https://jenkins.osmocom.org/jenkins/job/ttcn3-ggsn-test-kernel-latest/1665/…
[0m + RC=1 + [ 1 = 0 ] + grep --color=always -o+ load.* uptime [01;31m[Kload average: 14.03, 6.28, 3.24[m[K + exit 1 Build step 'Execute shell' marked build as failure Recording test results ERROR: Step ‘Publish JUnit test result report’ failed: No test report files were found. Configuration error?
2 days, 8 hours
1
0
0
0
Build failed in Jenkins: ttcn3-bts-test-latest #2528
by jenkins@lists.osmocom.org
See <
https://jenkins.osmocom.org/jenkins/job/ttcn3-bts-test-latest/2528/display/…
> Changes: ------------------------------------------ [...truncated 2.32 MiB...] <testcase classname='BTS_Tests_LAPDm' name='TC_sabm_ua_dcch_sapi3' time='15.034917'> <failure type='fail-verdict'>"BTS_Tests.ttcn:291 : Timeout waiting for RSL bring up" BTS_Tests_LAPDm.ttcn:1476 BTS_Tests_LAPDm control part BTS_Tests_LAPDm.ttcn:162 TC_sabm_ua_dcch_sapi3 testcase </failure> </testcase> <testcase classname='BTS_Tests_LAPDm' name='TC_sabm_ua_dcch_sapi4' time='15.035268'> <failure type='fail-verdict'>"BTS_Tests.ttcn:291 : Timeout waiting for RSL bring up" BTS_Tests_LAPDm.ttcn:1477 BTS_Tests_LAPDm control part BTS_Tests_LAPDm.ttcn:167 TC_sabm_ua_dcch_sapi4 testcase </failure> </testcase> <testcase classname='BTS_Tests_LAPDm' name='TC_sabm_contention' time='15.043406'> <failure type='fail-verdict'>"BTS_Tests.ttcn:291 : Timeout waiting for RSL bring up" BTS_Tests_LAPDm.ttcn:1478 BTS_Tests_LAPDm control part BTS_Tests_LAPDm.ttcn:201 TC_sabm_contention testcase </failure> </testcase> <testcase classname='BTS_Tests_LAPDm' name='TC_sabm_retransmit' time='15.041676'> <failure type='fail-verdict'>"BTS_Tests.ttcn:291 : Timeout waiting for RSL bring up" BTS_Tests_LAPDm.ttcn:1479 BTS_Tests_LAPDm control part BTS_Tests_LAPDm.ttcn:225 TC_sabm_retransmit testcase </failure> </testcase> <testcase classname='BTS_Tests_LAPDm' name='TC_sabm_retransmit_bts' time='15.045715'> <failure type='fail-verdict'>"BTS_Tests.ttcn:291 : Timeout waiting for RSL bring up" BTS_Tests_LAPDm.ttcn:1480 BTS_Tests_LAPDm control part BTS_Tests_LAPDm.ttcn:315 TC_sabm_retransmit_bts testcase </failure> </testcase> <testcase classname='BTS_Tests_LAPDm' name='TC_sabm_invalid_resp' time='15.045264'> <failure type='fail-verdict'>"BTS_Tests.ttcn:291 : Timeout waiting for RSL bring up" BTS_Tests_LAPDm.ttcn:1481 BTS_Tests_LAPDm control part BTS_Tests_LAPDm.ttcn:379 TC_sabm_invalid_resp testcase </failure> </testcase> <testcase classname='BTS_Tests_LAPDm' name='TC_sabm_dm' time='15.045423'> <failure type='fail-verdict'>"BTS_Tests.ttcn:291 : Timeout waiting for RSL bring up" BTS_Tests_LAPDm.ttcn:1482 BTS_Tests_LAPDm control part BTS_Tests_LAPDm.ttcn:425 TC_sabm_dm testcase </failure> </testcase> <testcase classname='BTS_Tests_LAPDm' name='TC_establish_ign_first_sabm' time='15.034119'> <failure type='fail-verdict'>"BTS_Tests.ttcn:291 : Timeout waiting for RSL bring up" BTS_Tests_LAPDm.ttcn:1483 BTS_Tests_LAPDm control part BTS_Tests_LAPDm.ttcn:488 TC_establish_ign_first_sabm testcase </failure> </testcase> <testcase classname='BTS_Tests_LAPDm' name='TC_iframe_seq_and_ack' time='15.032143'> <failure type='fail-verdict'>"BTS_Tests.ttcn:291 : Timeout waiting for RSL bring up" BTS_Tests_LAPDm.ttcn:1484 BTS_Tests_LAPDm control part BTS_Tests_LAPDm.ttcn:579 TC_iframe_seq_and_ack testcase </failure> </testcase> <testcase classname='BTS_Tests_LAPDm' name='TC_iframe_timer_recovery' time='15.038443'> <failure type='fail-verdict'>"BTS_Tests.ttcn:291 : Timeout waiting for RSL bring up" BTS_Tests_LAPDm.ttcn:1485 BTS_Tests_LAPDm control part BTS_Tests_LAPDm.ttcn:685 TC_iframe_timer_recovery testcase </failure> </testcase> <testcase classname='BTS_Tests_LAPDm' name='TC_ns_seq_error' time='15.046139'> <failure type='fail-verdict'>"BTS_Tests.ttcn:291 : Timeout waiting for RSL bring up" BTS_Tests_LAPDm.ttcn:1486 BTS_Tests_LAPDm control part BTS_Tests_LAPDm.ttcn:768 TC_ns_seq_error testcase </failure> </testcase> <testcase classname='BTS_Tests_LAPDm' name='TC_nr_seq_error' time='15.037043'> <failure type='fail-verdict'>"BTS_Tests.ttcn:291 : Timeout waiting for RSL bring up" BTS_Tests_LAPDm.ttcn:1487 BTS_Tests_LAPDm control part BTS_Tests_LAPDm.ttcn:831 TC_nr_seq_error testcase </failure> </testcase> <testcase classname='BTS_Tests_LAPDm' name='TC_rec_invalid_frame' time='15.039735'> <failure type='fail-verdict'>"BTS_Tests.ttcn:291 : Timeout waiting for RSL bring up" BTS_Tests_LAPDm.ttcn:1488 BTS_Tests_LAPDm control part BTS_Tests_LAPDm.ttcn:961 TC_rec_invalid_frame testcase </failure> </testcase> <testcase classname='BTS_Tests_LAPDm' name='TC_segm_concat_dcch' time='15.048162'> <failure type='fail-verdict'>"BTS_Tests.ttcn:291 : Timeout waiting for RSL bring up" BTS_Tests_LAPDm.ttcn:1489 BTS_Tests_LAPDm control part BTS_Tests_LAPDm.ttcn:1088 TC_segm_concat_dcch testcase </failure> </testcase> <testcase classname='BTS_Tests_LAPDm' name='TC_segm_concat_sacch' time='15.022080'> <failure type='fail-verdict'>"BTS_Tests.ttcn:291 : Timeout waiting for RSL bring up" BTS_Tests_LAPDm.ttcn:1490 BTS_Tests_LAPDm control part BTS_Tests_LAPDm.ttcn:1093 TC_segm_concat_sacch testcase </failure> </testcase> <testcase classname='BTS_Tests_LAPDm' name='TC_t200_n200' time='15.047008'> <failure type='fail-verdict'>"BTS_Tests.ttcn:291 : Timeout waiting for RSL bring up" BTS_Tests_LAPDm.ttcn:1491 BTS_Tests_LAPDm control part BTS_Tests_LAPDm.ttcn:1182 TC_t200_n200 testcase </failure> </testcase> <testcase classname='BTS_Tests_LAPDm' name='TC_rr_response_frame_loss' time='15.028993'> <failure type='fail-verdict'>"BTS_Tests.ttcn:291 : Timeout waiting for RSL bring up" BTS_Tests_LAPDm.ttcn:1492 BTS_Tests_LAPDm control part BTS_Tests_LAPDm.ttcn:1239 TC_rr_response_frame_loss testcase </failure> </testcase> <testcase classname='BTS_Tests_LAPDm' name='TC_incorrect_cr' time='15.037924'> <failure type='fail-verdict'>"BTS_Tests.ttcn:291 : Timeout waiting for RSL bring up" BTS_Tests_LAPDm.ttcn:1493 BTS_Tests_LAPDm control part BTS_Tests_LAPDm.ttcn:1293 TC_incorrect_cr testcase </failure> </testcase> <testcase classname='BTS_Tests_LAPDm' name='TC_sabm_incorrect_c' time='15.041500'> <failure type='fail-verdict'>"BTS_Tests.ttcn:291 : Timeout waiting for RSL bring up" BTS_Tests_LAPDm.ttcn:1494 BTS_Tests_LAPDm control part BTS_Tests_LAPDm.ttcn:1341 TC_sabm_incorrect_c testcase </failure> </testcase> <testcase classname='BTS_Tests_LAPDm' name='TC_normal_reestablishment' time='15.035659'> <failure type='fail-verdict'>"BTS_Tests.ttcn:291 : Timeout waiting for RSL bring up" BTS_Tests_LAPDm.ttcn:1495 BTS_Tests_LAPDm control part BTS_Tests_LAPDm.ttcn:1403 TC_normal_reestablishment testcase </failure> </testcase> <testcase classname='BTS_Tests_LAPDm' name='TC_normal_reestablishment_state_unacked' time='15.034919'> <failure type='fail-verdict'>"BTS_Tests.ttcn:291 : Timeout waiting for RSL bring up" BTS_Tests_LAPDm.ttcn:1496 BTS_Tests_LAPDm control part BTS_Tests_LAPDm.ttcn:1470 TC_normal_reestablishment_state_unacked testcase </failure> </testcase> <testcase classname='BTS_Tests_VAMOS' name='TC_vamos_chan_act_vff' time='15.034559'> <failure type='fail-verdict'>"BTS_Tests.ttcn:291 : Timeout waiting for RSL bring up" BTS_Tests_VAMOS.ttcn:316 BTS_Tests_VAMOS control part BTS_Tests_VAMOS.ttcn:210 TC_vamos_chan_act_vff testcase </failure> </testcase> <testcase classname='BTS_Tests_VAMOS' name='TC_vamos_chan_act_vhh' time='15.035322'> <failure type='fail-verdict'>"BTS_Tests.ttcn:291 : Timeout waiting for RSL bring up" BTS_Tests_VAMOS.ttcn:317 BTS_Tests_VAMOS control part BTS_Tests_VAMOS.ttcn:224 TC_vamos_chan_act_vhh testcase </failure> </testcase> <testcase classname='BTS_Tests_VAMOS' name='TC_vamos_chan_act_hvhh' time='15.034005'> <failure type='fail-verdict'>"BTS_Tests.ttcn:291 : Timeout waiting for RSL bring up" BTS_Tests_VAMOS.ttcn:318 BTS_Tests_VAMOS control part BTS_Tests_VAMOS.ttcn:234 TC_vamos_chan_act_hvhh testcase </failure> </testcase> <testcase classname='BTS_Tests_VAMOS' name='TC_vamos_chan_act_dyn_ipa_vff' time='15.033809'> <failure type='fail-verdict'>"BTS_Tests.ttcn:291 : Timeout waiting for RSL bring up" BTS_Tests_VAMOS.ttcn:319 BTS_Tests_VAMOS control part BTS_Tests_VAMOS.ttcn:214 TC_vamos_chan_act_dyn_ipa_vff testcase </failure> </testcase> <testcase classname='BTS_Tests_VAMOS' name='TC_vamos_chan_act_dyn_osmo_vff' time='15.031351'> <failure type='fail-verdict'>"BTS_Tests.ttcn:291 : Timeout waiting for RSL bring up" BTS_Tests_VAMOS.ttcn:320 BTS_Tests_VAMOS control part BTS_Tests_VAMOS.ttcn:218 TC_vamos_chan_act_dyn_osmo_vff testcase </failure> </testcase> <testcase classname='BTS_Tests_VAMOS' name='TC_vamos_chan_act_dyn_osmo_vhh' time='15.040954'> <failure type='fail-verdict'>"BTS_Tests.ttcn:291 : Timeout waiting for RSL bring up" BTS_Tests_VAMOS.ttcn:321 BTS_Tests_VAMOS control part BTS_Tests_VAMOS.ttcn:228 TC_vamos_chan_act_dyn_osmo_vhh testcase </failure> </testcase> <testcase classname='BTS_Tests_VAMOS' name='TC_vamos_chan_act_dyn_osmo_hvhh' time='15.043124'> <failure type='fail-verdict'>"BTS_Tests.ttcn:291 : Timeout waiting for RSL bring up" BTS_Tests_VAMOS.ttcn:322 BTS_Tests_VAMOS control part BTS_Tests_VAMOS.ttcn:238 TC_vamos_chan_act_dyn_osmo_hvhh testcase </failure> </testcase> <testcase classname='BTS_Tests_VAMOS' name='TC_vamos_chan_mode_modify_vff' time='15.044714'> <failure type='fail-verdict'>"BTS_Tests.ttcn:291 : Timeout waiting for RSL bring up" BTS_Tests_VAMOS.ttcn:325 BTS_Tests_VAMOS control part BTS_Tests_VAMOS.ttcn:283 TC_vamos_chan_mode_modify_vff testcase </failure> </testcase> <testcase classname='BTS_Tests_VAMOS' name='TC_vamos_chan_mode_modify_vhh' time='15.047355'> <failure type='fail-verdict'>"BTS_Tests.ttcn:291 : Timeout waiting for RSL bring up" BTS_Tests_VAMOS.ttcn:326 BTS_Tests_VAMOS control part BTS_Tests_VAMOS.ttcn:297 TC_vamos_chan_mode_modify_vhh testcase </failure> </testcase> <testcase classname='BTS_Tests_VAMOS' name='TC_vamos_chan_mode_modify_hvhh' time='15.041670'> <failure type='fail-verdict'>"BTS_Tests.ttcn:291 : Timeout waiting for RSL bring up" BTS_Tests_VAMOS.ttcn:327 BTS_Tests_VAMOS control part BTS_Tests_VAMOS.ttcn:307 TC_vamos_chan_mode_modify_hvhh testcase </failure> </testcase> <testcase classname='BTS_Tests_VAMOS' name='TC_vamos_chan_mode_modify_dyn_ipa_vff' time='15.052417'> <failure type='fail-verdict'>"BTS_Tests.ttcn:291 : Timeout waiting for RSL bring up" BTS_Tests_VAMOS.ttcn:328 BTS_Tests_VAMOS control part BTS_Tests_VAMOS.ttcn:287 TC_vamos_chan_mode_modify_dyn_ipa_vff testcase </failure> </testcase> <testcase classname='BTS_Tests_VAMOS' name='TC_vamos_chan_mode_modify_dyn_osmo_vff' time='15.039391'> <failure type='fail-verdict'>"BTS_Tests.ttcn:291 : Timeout waiting for RSL bring up" BTS_Tests_VAMOS.ttcn:329 BTS_Tests_VAMOS control part BTS_Tests_VAMOS.ttcn:291 TC_vamos_chan_mode_modify_dyn_osmo_vff testcase </failure> </testcase> <testcase classname='BTS_Tests_VAMOS' name='TC_vamos_chan_mode_modify_dyn_osmo_vhh' time='15.036312'> <failure type='fail-verdict'>"BTS_Tests.ttcn:291 : Timeout waiting for RSL bring up" BTS_Tests_VAMOS.ttcn:330 BTS_Tests_VAMOS control part BTS_Tests_VAMOS.ttcn:301 TC_vamos_chan_mode_modify_dyn_osmo_vhh testcase </failure> </testcase> <testcase classname='BTS_Tests_VAMOS' name='TC_vamos_chan_mode_modify_dyn_osmo_hvhh' time='15.045793'> <failure type='fail-verdict'>"BTS_Tests.ttcn:291 : Timeout waiting for RSL bring up" BTS_Tests_VAMOS.ttcn:331 BTS_Tests_VAMOS control part BTS_Tests_VAMOS.ttcn:311 TC_vamos_chan_mode_modify_dyn_osmo_hvhh testcase </failure> </testcase> <testcase classname='BTS_Tests_ASCI' name='TC_vbs_notification' time='15.040598'> <failure type='fail-verdict'>"BTS_Tests.ttcn:291 : Timeout waiting for RSL bring up" BTS_Tests_ASCI.ttcn:422 BTS_Tests_ASCI control part BTS_Tests_ASCI.ttcn:83 TC_vbs_notification testcase </failure> </testcase> <testcase classname='BTS_Tests_ASCI' name='TC_vgcs_uplink_free_and_busy' time='15.043355'> <failure type='fail-verdict'>"BTS_Tests.ttcn:291 : Timeout waiting for RSL bring up" BTS_Tests_ASCI.ttcn:423 BTS_Tests_ASCI control part BTS_Tests_ASCI.ttcn:190 TC_vgcs_uplink_free_and_busy testcase </failure> </testcase> <testcase classname='BTS_Tests_ASCI' name='TC_vgcs_talker_fail' time='15.042099'> <failure type='fail-verdict'>"BTS_Tests.ttcn:291 : Timeout waiting for RSL bring up" BTS_Tests_ASCI.ttcn:424 BTS_Tests_ASCI control part BTS_Tests_ASCI.ttcn:289 TC_vgcs_talker_fail testcase </failure> </testcase> <testcase classname='BTS_Tests_ASCI' name='TC_vgcs_talker_est_rel' time='15.033877'> <failure type='fail-verdict'>"BTS_Tests.ttcn:291 : Timeout waiting for RSL bring up" BTS_Tests_ASCI.ttcn:425 BTS_Tests_ASCI control part BTS_Tests_ASCI.ttcn:333 TC_vgcs_talker_est_rel testcase </failure> </testcase> <testcase classname='BTS_Tests_ASCI' name='TC_vgcs_listener_det' time='15.031960'> <failure type='fail-verdict'>"BTS_Tests.ttcn:291 : Timeout waiting for RSL bring up" BTS_Tests_ASCI.ttcn:426 BTS_Tests_ASCI control part BTS_Tests_ASCI.ttcn:411 TC_vgcs_listener_det testcase </failure> </testcase> </testsuite> + RC=1 + uptime + grep --color=always -o load.* [01;31m[Kload average: 0.64, 0.25, 0.53[m[K + exit 1 Build step 'Execute shell' marked build as failure Recording test results [Checks API] No suitable checks publisher found.
2 days, 16 hours
1
0
0
0
Jenkins build became unstable: ttcn3-s1gw-test #442
by jenkins@lists.osmocom.org
See <
https://jenkins.osmocom.org/jenkins/job/ttcn3-s1gw-test/442/display/redirect
>
3 days, 11 hours
1
1
0
0
Build failed in Jenkins: Osmocom-repo-install-debian11 » nightly,qemu #1178
by jenkins@lists.osmocom.org
See <
https://jenkins.osmocom.org/jenkins/job/Osmocom-repo-install-debian11/feed=…
> Changes: ------------------------------------------ [...truncated 50.58 KiB...] libosmo-gprs-gmm1-dbgsym libosmo-gprs-gmm-dbg libosmo-gprs-gmm-dev libosmo-gprs-llc1 libosmo-gprs-llc1-dbgsym libosmo-gprs-llc-dbg libosmo-gprs-llc-dev libosmo-gprs-rlcmac1 libosmo-gprs-rlcmac1-dbgsym libosmo-gprs-rlcmac-dbg libosmo-gprs-rlcmac-dev libosmo-gprs-sm1 libosmo-gprs-sm1-dbgsym libosmo-gprs-sm-dbg libosmo-gprs-sm-dev libosmo-gprs-sndcp1 libosmo-gprs-sndcp1-dbgsym libosmo-gprs-sndcp-dbg libosmo-gprs-sndcp-dev libosmogsm20 libosmogsm-doc libosmo-gsup-client0 libosmo-gsup-client-dev libosmo-gtlv1 libosmo-gtlv-dbg libosmo-gtlv-dev libosmo-hnbap0 libosmo-hnbap-dbg libosmo-hnbap-dev libosmoisdn0 libosmoisdn-doc libosmo-iuh-dev libosmo-mgcp-client14 libosmo-mgcp-client14-dbgsym libosmo-mgcp-client-dev libosmo-mslookup1 libosmo-mslookup-dev libosmonetif11 libosmo-netif-dbg libosmo-netif-dev libosmo-netif-doc libosmo-octoi3 libosmo-octoi3-dbgsym libosmo-octoi-dev libosmo-pfcp libosmo-pfcp4 libosmo-pfcp-dbg libosmo-pfcp-dev libosmo-ranap7 libosmo-ranap-dbg libosmo-ranap-dev libosmo-rspro2 libosmo-rspro2-dbgsym libosmo-rspro-dev libosmo-rua0 libosmo-rua-dbg libosmo-rua-dev libosmo-sabp1 libosmo-sabp-dbg libosmo-sabp-dev libosmo-sbcap2 libosmo-sbcap-dev libosmo-sigtran11 libosmo-sigtran-dbg libosmo-sigtran-dev libosmo-sigtran-doc libosmosim2 libosmosim-doc libosmo-simtrace2-1 libosmo-simtrace2-1-dbgsym libosmo-simtrace2-dev libosmotrau11 libosmousb0 libosmousb-doc libosmovty13 libosmovty-doc librtlsdr0 librtlsdr-dev libsmpp1 libsmpp34-dbg libsmpp34-dev libsmpp34-utils libusrp1 libusrp1-dbgsym libusrp-dev libusrp-doc libusrp-firmware libusrp-utils libusrp-utils-dbgsym neocon neocon-dbgsym nftables nftables-dbgsym osmo-bsc osmo-bsc-bs11-utils osmo-bsc-dbg osmo-bsc-doc osmo-bsc-ipaccess-utils osmo-bsc-meas-utils osmo-bsc-nat osmo-bsc-nat-dbg osmo-bsc-nat-doc osmo-bts osmo-bts-doc osmo-bts-trx osmo-bts-trx-dbg osmo-bts-virtual osmo-bts-virtual-dbg osmo-cbc osmo-cbc-dbg osmo-cbc-doc osmo-cbc-utils osmocom-keyring osmocom-nightly osmo-diameter2gsup osmo-e1d osmo-e1d-dbgsym osmo-fl2k osmo-fl2k-dbgsym osmo-gbproxy osmo-gbproxy-dbg osmo-gbproxy-doc osmo-ggsn osmo-ggsn-dbg osmo-ggsn-doc osmo-gsm-manuals-dev osmo-gtphub osmo-gtphub-dbg osmo-hlr osmo-hlr-dbg osmo-hlr-doc osmo-hnbgw osmo-hnbgw-dbg osmo-hnbgw-doc osmo-hnodeb osmo-hnodeb-dbg osmo-hnodeb-doc osmo-mgw osmo-mgw-dbgsym osmo-mgw-doc osmo-msc osmo-msc-dbg osmo-msc-doc osmo-mslookup-utils osmo-pcap-client osmo-pcap-client-dbg osmo-pcap-server osmo-pcap-server-dbg osmo-pcu osmo-pcu-dbg osmo-pcu-doc osmo-remsim-apitool osmo-remsim-bankd osmo-remsim-bankd-dbgsym osmo-remsim-client-shell osmo-remsim-client-shell-dbgsym osmo-remsim-client-st2 osmo-remsim-client-st2-dbgsym osmo-remsim-doc osmo-remsim-server osmo-remsim-server-dbgsym osmo-sgsn osmo-sgsn-dbg osmo-sgsn-doc osmo-sip-connector osmo-sip-connector-dbg osmo-sip-connector-doc osmo-smlc osmo-smlc-dbg osmo-smlc-doc osmo-stp osmo-stp-dbg osmo-stp-doc osmo-sysmon osmo-sysmon-dbg osmo-trx osmo-trx-dbg osmo-trx-doc osmo-trx-ipc osmo-trx-lms osmo-trx-ms-blade osmo-trx-uhd osmo-trx-usrp1 osmo-uecups osmo-uecups-dbgsym osmo-upf osmo-upf-dbg osmo-upf-doc python3-osmopy-libs python3-osmopy-utils rebar3 rtl-sdr simtrace2-firmware simtrace2-utils simtrace2-utils-dbgsym uwsc uwsc-dbgsym + apt-get install -y --no-install-recommends -- abisip-find eclipse-titan eclipse-titan-dbgsym gtp-echo-responder gtp-echo-responder-dbg libasn1c1 libasn1c-dbg libasn1c-dev libgtp11 libgtp-dbg libgtp-dev libgtpnl0 libgtpnl-dbg libgtpnl-dev libgtpnl-tools libifd-osmo-remsim-client0 libifd-osmo-remsim-client0-dbgsym libnftables1 libnftables1-dbgsym libnftables-dev libnftnl11 libnftnl11-dbgsym libnftnl-dev libnftnl-dev-doc libosmo-abis libosmoabis15 libosmo-abis-dbg libosmo-abis-dev libosmocodec4 libosmocodec-doc libosmocoding0 libosmocoding-doc libosmocore libosmocore22 libosmocore-dbg libosmocore-dev libosmocore-doc libosmocore-utils libosmo-csn1-1 libosmo-csn1-1-dbgsym libosmo-csn1-dbg libosmo-csn1-dev libosmoctrl0 libosmoctrl-doc libosmodsp0 libosmodsp-dbg libosmodsp-dev libosmodsp-doc libosmo-e1d3 libosmo-e1d3-dbgsym libosmo-e1d-dev libosmo-fl2k0 libosmo-fl2k0-dbgsym libosmo-fl2k-dev libosmogb14 libosmogb-doc libosmo-gprs-gmm1 libosmo-gprs-gmm1-dbgsym libosmo-gprs-gmm-dbg libosmo-gprs-gmm-dev libosmo-gprs-llc1 libosmo-gprs-llc1-dbgsym libosmo-gprs-llc-dbg libosmo-gprs-llc-dev libosmo-gprs-rlcmac1 libosmo-gprs-rlcmac1-dbgsym libosmo-gprs-rlcmac-dbg libosmo-gprs-rlcmac-dev libosmo-gprs-sm1 libosmo-gprs-sm1-dbgsym libosmo-gprs-sm-dbg libosmo-gprs-sm-dev libosmo-gprs-sndcp1 libosmo-gprs-sndcp1-dbgsym libosmo-gprs-sndcp-dbg libosmo-gprs-sndcp-dev libosmogsm20 libosmogsm-doc libosmo-gsup-client0 libosmo-gsup-client-dev libosmo-gtlv1 libosmo-gtlv-dbg libosmo-gtlv-dev libosmo-hnbap0 libosmo-hnbap-dbg libosmo-hnbap-dev libosmoisdn0 libosmoisdn-doc libosmo-iuh-dev libosmo-mgcp-client14 libosmo-mgcp-client14-dbgsym libosmo-mgcp-client-dev libosmo-mslookup1 libosmo-mslookup-dev libosmonetif11 libosmo-netif-dbg libosmo-netif-dev libosmo-netif-doc libosmo-octoi3 libosmo-octoi3-dbgsym libosmo-octoi-dev libosmo-pfcp libosmo-pfcp4 libosmo-pfcp-dbg libosmo-pfcp-dev libosmo-ranap7 libosmo-ranap-dbg libosmo-ranap-dev libosmo-rspro2 libosmo-rspro2-dbgsym libosmo-rspro-dev libosmo-rua0 libosmo-rua-dbg libosmo-rua-dev libosmo-sabp1 libosmo-sabp-dbg libosmo-sabp-dev libosmo-sbcap2 libosmo-sbcap-dev libosmo-sigtran11 libosmo-sigtran-dbg libosmo-sigtran-dev libosmo-sigtran-doc libosmosim2 libosmosim-doc libosmo-simtrace2-1 libosmo-simtrace2-1-dbgsym libosmo-simtrace2-dev libosmotrau11 libosmousb0 libosmousb-doc libosmovty13 libosmovty-doc librtlsdr0 librtlsdr-dev libsmpp1 libsmpp34-dbg libsmpp34-dev libsmpp34-utils libusrp1 libusrp1-dbgsym libusrp-dev libusrp-doc libusrp-firmware libusrp-utils libusrp-utils-dbgsym neocon neocon-dbgsym nftables nftables-dbgsym osmo-bsc osmo-bsc-bs11-utils osmo-bsc-dbg osmo-bsc-doc osmo-bsc-ipaccess-utils osmo-bsc-meas-utils osmo-bsc-nat osmo-bsc-nat-dbg osmo-bsc-nat-doc osmo-bts osmo-bts-doc osmo-bts-trx osmo-bts-trx-dbg osmo-bts-virtual osmo-bts-virtual-dbg osmo-cbc osmo-cbc-dbg osmo-cbc-doc osmo-cbc-utils osmocom-keyring osmocom-nightly osmo-diameter2gsup osmo-e1d osmo-e1d-dbgsym osmo-fl2k osmo-fl2k-dbgsym osmo-gbproxy osmo-gbproxy-dbg osmo-gbproxy-doc osmo-ggsn osmo-ggsn-dbg osmo-ggsn-doc osmo-gsm-manuals-dev osmo-gtphub osmo-gtphub-dbg osmo-hlr osmo-hlr-dbg osmo-hlr-doc osmo-hnbgw osmo-hnbgw-dbg osmo-hnbgw-doc osmo-hnodeb osmo-hnodeb-dbg osmo-hnodeb-doc osmo-mgw osmo-mgw-dbgsym osmo-mgw-doc osmo-msc osmo-msc-dbg osmo-msc-doc osmo-mslookup-utils osmo-pcap-client osmo-pcap-client-dbg osmo-pcap-server osmo-pcap-server-dbg osmo-pcu osmo-pcu-dbg osmo-pcu-doc osmo-remsim-apitool osmo-remsim-bankd osmo-remsim-bankd-dbgsym osmo-remsim-client-shell osmo-remsim-client-shell-dbgsym osmo-remsim-client-st2 osmo-remsim-client-st2-dbgsym osmo-remsim-doc osmo-remsim-server osmo-remsim-server-dbgsym osmo-sgsn osmo-sgsn-dbg osmo-sgsn-doc osmo-sip-connector osmo-sip-connector-dbg osmo-sip-connector-doc osmo-smlc osmo-smlc-dbg osmo-smlc-doc osmo-stp osmo-stp-dbg osmo-stp-doc osmo-sysmon osmo-sysmon-dbg osmo-trx osmo-trx-dbg osmo-trx-doc osmo-trx-ipc osmo-trx-lms osmo-trx-ms-blade osmo-trx-uhd osmo-trx-usrp1 osmo-uecups osmo-uecups-dbgsym osmo-upf osmo-upf-dbg osmo-upf-doc python3-osmopy-libs python3-osmopy-utils rebar3 rtl-sdr simtrace2-firmware simtrace2-utils simtrace2-utils-dbgsym uwsc uwsc-dbgsym Reading package lists... Building dependency tree... Reading state information... libosmocodec4 is already the newest version (1.11.0.32.33cb4.202508232026). libosmocodec4 set to manually installed. libosmocoding0 is already the newest version (1.11.0.32.33cb4.202508232026). libosmocoding0 set to manually installed. libosmocore is already the newest version (1.11.0.32.33cb4.202508232026). libosmocore22 is already the newest version (1.11.0.32.33cb4.202508232026). libosmocore22 set to manually installed. libosmoctrl0 is already the newest version (1.11.0.32.33cb4.202508232026). libosmoctrl0 set to manually installed. libosmogb14 is already the newest version (1.11.0.32.33cb4.202508232026). libosmogb14 set to manually installed. libosmogsm20 is already the newest version (1.11.0.32.33cb4.202508232026). libosmogsm20 set to manually installed. libosmoisdn0 is already the newest version (1.11.0.32.33cb4.202508232026). libosmoisdn0 set to manually installed. libosmosim2 is already the newest version (1.11.0.32.33cb4.202508232026). libosmosim2 set to manually installed. libosmousb0 is already the newest version (1.11.0.32.33cb4.202508232026). libosmousb0 set to manually installed. libosmovty13 is already the newest version (1.11.0.32.33cb4.202508232026). libosmovty13 set to manually installed. osmocom-keyring is already the newest version (1.0.2.5.fc66.202508232026). osmocom-keyring set to manually installed. osmocom-nightly is already the newest version (202508232026). osmocom-nightly set to manually installed. Some packages could not be installed. This may mean that you have requested an impossible situation or if you are using the unstable distribution that some required packages have not yet been created or been moved out of Incoming. The following information may help to resolve the situation: The following packages have unmet dependencies: osmo-diameter2gsup : Depends: osmocom-nightly (= 202508222026) but 202508232026 is to be installed E: Unable to correct problems, you have held broken packages. + clean_up_trap + [ -n ] + set +x ### Clean up ### + trap - EXIT INT TERM 0 + clean_up + [ -n ] + [ -e _repo_install_test_data/qemu.pid ] + cat _repo_install_test_data/qemu.pid + kill 3270240 + rm -f _repo_install_test_data/temp.qcow2 Build step 'Execute shell' marked build as failure
3 days, 13 hours
1
2
0
0
Build failed in Jenkins: Osmocom-repo-install-debian12 » nightly,qemu #779
by jenkins@lists.osmocom.org
See <
https://jenkins.osmocom.org/jenkins/job/Osmocom-repo-install-debian12/feed=…
> Changes: ------------------------------------------ [...truncated 54.13 KiB...] libosmo-iuh-dev libosmo-mgcp-client14 libosmo-mgcp-client14-dbgsym libosmo-mgcp-client-dev libosmo-mslookup1 libosmo-mslookup-dev libosmonetif11 libosmo-netif-dbg libosmo-netif-dev libosmo-netif-doc libosmo-octoi3 libosmo-octoi3-dbgsym libosmo-octoi-dev libosmo-pfcp libosmo-pfcp4 libosmo-pfcp-dbg libosmo-pfcp-dev libosmo-ranap7 libosmo-ranap-dbg libosmo-ranap-dev libosmo-rspro2 libosmo-rspro2-dbgsym libosmo-rspro-dev libosmo-rua0 libosmo-rua-dbg libosmo-rua-dev libosmo-sabp1 libosmo-sabp-dbg libosmo-sabp-dev libosmo-sbcap2 libosmo-sbcap-dev libosmo-sigtran11 libosmo-sigtran-dbg libosmo-sigtran-dev libosmo-sigtran-doc libosmosim2 libosmosim-doc libosmo-simtrace2-1 libosmo-simtrace2-1-dbgsym libosmo-simtrace2-dev libosmotrau11 libosmousb0 libosmousb-doc libosmovty13 libosmovty-doc librtlsdr0 librtlsdr-dev libsmpp1 libsmpp34-dbg libsmpp34-dev libsmpp34-utils libstrongswan libstrongswan-dbgsym libstrongswan-extra-plugins libstrongswan-extra-plugins-dbgsym libstrongswan-standard-plugins libstrongswan-standard-plugins-dbgsym libusrp1 libusrp1-dbgsym libusrp-dev libusrp-doc libusrp-firmware libusrp-utils libusrp-utils-dbgsym neocon neocon-dbgsym nftables nftables-dbgsym osmo-bsc osmo-bsc-bs11-utils osmo-bsc-dbg osmo-bsc-doc osmo-bsc-ipaccess-utils osmo-bsc-meas-utils osmo-bsc-nat osmo-bsc-nat-dbg osmo-bsc-nat-doc osmo-bts osmo-bts-doc osmo-bts-trx osmo-bts-trx-dbg osmo-bts-virtual osmo-bts-virtual-dbg osmo-cbc osmo-cbc-dbg osmo-cbc-doc osmo-cbc-utils osmocom-bb-layer23 osmocom-bb-layer23-dbgsym osmocom-bb-trxcon osmocom-bb-trxcon-dbgsym osmocom-bb-trx-toolkit osmocom-bb-virtphy osmocom-bb-virtphy-dbgsym osmocom-keyring osmocom-nightly osmo-diameter2gsup osmo-e1d osmo-e1d-dbgsym osmo-epdg osmo-epdg-dbgsym osmo-epdg-doc osmo-fl2k osmo-fl2k-dbgsym osmo-gbproxy osmo-gbproxy-dbg osmo-gbproxy-doc osmo-ggsn osmo-ggsn-dbg osmo-ggsn-doc osmo-gsm-manuals-dev osmo-gtphub osmo-gtphub-dbg osmo-hlr osmo-hlr-dbg osmo-hlr-doc osmo-hnbgw osmo-hnbgw-dbg osmo-hnbgw-doc osmo-hnodeb osmo-hnodeb-dbg osmo-hnodeb-doc osmo-mgw osmo-mgw-dbgsym osmo-mgw-doc osmo-msc osmo-msc-dbg osmo-msc-doc osmo-mslookup-utils osmo-pcap-client osmo-pcap-client-dbg osmo-pcap-server osmo-pcap-server-dbg osmo-pcu osmo-pcu-dbg osmo-pcu-doc osmo-remsim-apitool osmo-remsim-bankd osmo-remsim-bankd-dbgsym osmo-remsim-client-shell osmo-remsim-client-shell-dbgsym osmo-remsim-client-st2 osmo-remsim-client-st2-dbgsym osmo-remsim-doc osmo-remsim-server osmo-remsim-server-dbgsym osmo-s1gw osmo-s1gw-dbgsym osmo-sgsn osmo-sgsn-dbg osmo-sgsn-doc osmo-sip-connector osmo-sip-connector-dbg osmo-sip-connector-doc osmo-smlc osmo-smlc-dbg osmo-smlc-doc osmo-stp osmo-stp-dbg osmo-stp-doc osmo-sysmon osmo-sysmon-dbg osmo-trx osmo-trx-dbg osmo-trx-doc osmo-trx-ipc osmo-trx-lms osmo-trx-ms-blade osmo-trx-uhd osmo-trx-usrp1 osmo-uecups osmo-uecups-dbgsym osmo-upf osmo-upf-dbg osmo-upf-doc python3-osmopy-libs python3-osmopy-utils python3-pyosmocom python3-pyosmocom-doc rebar3 rtl-sdr simtrace2-firmware simtrace2-utils simtrace2-utils-dbgsym strongswan strongswan-charon strongswan-charon-dbgsym strongswan-libcharon strongswan-libcharon-dbgsym strongswan-nm strongswan-nm-dbgsym strongswan-pki strongswan-pki-dbgsym strongswan-starter strongswan-starter-dbgsym strongswan-swanctl strongswan-swanctl-dbgsym + apt-get install -y --no-install-recommends -- abisip-find charon-cmd charon-cmd-dbgsym charon-systemd charon-systemd-dbgsym eclipse-titan eclipse-titan-dbgsym gapk gapk-dbgsym gtp-echo-responder gtp-echo-responder-dbg libasn1c1 libasn1c-dbg libasn1c-dev libcharon-extauth-plugins libcharon-extauth-plugins-dbgsym libcharon-extra-plugins libcharon-extra-plugins-dbgsym libgtp11 libgtp-dbg libgtp-dev libgtpnl0 libgtpnl-dbg libgtpnl-dev libgtpnl-tools libifd-osmo-remsim-client0 libifd-osmo-remsim-client0-dbgsym libnftables1 libnftables1-dbgsym libnftables-dev libosmo-abis libosmoabis15 libosmo-abis-dbg libosmo-abis-dev libosmocodec4 libosmocodec-doc libosmocoding0 libosmocoding-doc libosmocore libosmocore22 libosmocore-dbg libosmocore-dev libosmocore-doc libosmocore-utils libosmo-csn1-1 libosmo-csn1-1-dbgsym libosmo-csn1-dbg libosmo-csn1-dev libosmoctrl0 libosmoctrl-doc libosmodsp0 libosmodsp-dbg libosmodsp-dev libosmodsp-doc libosmo-e1d3 libosmo-e1d3-dbgsym libosmo-e1d-dev libosmo-fl2k0 libosmo-fl2k0-dbgsym libosmo-fl2k-dev libosmogapk0 libosmogapk0-dbgsym libosmogapk-dev libosmogb14 libosmogb-doc libosmo-gprs-gmm1 libosmo-gprs-gmm1-dbgsym libosmo-gprs-gmm-dbg libosmo-gprs-gmm-dev libosmo-gprs-llc1 libosmo-gprs-llc1-dbgsym libosmo-gprs-llc-dbg libosmo-gprs-llc-dev libosmo-gprs-rlcmac1 libosmo-gprs-rlcmac1-dbgsym libosmo-gprs-rlcmac-dbg libosmo-gprs-rlcmac-dev libosmo-gprs-sm1 libosmo-gprs-sm1-dbgsym libosmo-gprs-sm-dbg libosmo-gprs-sm-dev libosmo-gprs-sndcp1 libosmo-gprs-sndcp1-dbgsym libosmo-gprs-sndcp-dbg libosmo-gprs-sndcp-dev libosmogsm20 libosmogsm-doc libosmo-gsup-client0 libosmo-gsup-client-dev libosmo-gtlv1 libosmo-gtlv-dbg libosmo-gtlv-dev libosmo-hnbap0 libosmo-hnbap-dbg libosmo-hnbap-dev libosmoisdn0 libosmoisdn-doc libosmo-iuh-dev libosmo-mgcp-client14 libosmo-mgcp-client14-dbgsym libosmo-mgcp-client-dev libosmo-mslookup1 libosmo-mslookup-dev libosmonetif11 libosmo-netif-dbg libosmo-netif-dev libosmo-netif-doc libosmo-octoi3 libosmo-octoi3-dbgsym libosmo-octoi-dev libosmo-pfcp libosmo-pfcp4 libosmo-pfcp-dbg libosmo-pfcp-dev libosmo-ranap7 libosmo-ranap-dbg libosmo-ranap-dev libosmo-rspro2 libosmo-rspro2-dbgsym libosmo-rspro-dev libosmo-rua0 libosmo-rua-dbg libosmo-rua-dev libosmo-sabp1 libosmo-sabp-dbg libosmo-sabp-dev libosmo-sbcap2 libosmo-sbcap-dev libosmo-sigtran11 libosmo-sigtran-dbg libosmo-sigtran-dev libosmo-sigtran-doc libosmosim2 libosmosim-doc libosmo-simtrace2-1 libosmo-simtrace2-1-dbgsym libosmo-simtrace2-dev libosmotrau11 libosmousb0 libosmousb-doc libosmovty13 libosmovty-doc librtlsdr0 librtlsdr-dev libsmpp1 libsmpp34-dbg libsmpp34-dev libsmpp34-utils libstrongswan libstrongswan-dbgsym libstrongswan-extra-plugins libstrongswan-extra-plugins-dbgsym libstrongswan-standard-plugins libstrongswan-standard-plugins-dbgsym libusrp1 libusrp1-dbgsym libusrp-dev libusrp-doc libusrp-firmware libusrp-utils libusrp-utils-dbgsym neocon neocon-dbgsym nftables nftables-dbgsym osmo-bsc osmo-bsc-bs11-utils osmo-bsc-dbg osmo-bsc-doc osmo-bsc-ipaccess-utils osmo-bsc-meas-utils osmo-bsc-nat osmo-bsc-nat-dbg osmo-bsc-nat-doc osmo-bts osmo-bts-doc osmo-bts-trx osmo-bts-trx-dbg osmo-bts-virtual osmo-bts-virtual-dbg osmo-cbc osmo-cbc-dbg osmo-cbc-doc osmo-cbc-utils osmocom-bb-layer23 osmocom-bb-layer23-dbgsym osmocom-bb-trxcon osmocom-bb-trxcon-dbgsym osmocom-bb-trx-toolkit osmocom-bb-virtphy osmocom-bb-virtphy-dbgsym osmocom-keyring osmocom-nightly osmo-diameter2gsup osmo-e1d osmo-e1d-dbgsym osmo-epdg osmo-epdg-dbgsym osmo-epdg-doc osmo-fl2k osmo-fl2k-dbgsym osmo-gbproxy osmo-gbproxy-dbg osmo-gbproxy-doc osmo-ggsn osmo-ggsn-dbg osmo-ggsn-doc osmo-gsm-manuals-dev osmo-gtphub osmo-gtphub-dbg osmo-hlr osmo-hlr-dbg osmo-hlr-doc osmo-hnbgw osmo-hnbgw-dbg osmo-hnbgw-doc osmo-hnodeb osmo-hnodeb-dbg osmo-hnodeb-doc osmo-mgw osmo-mgw-dbgsym osmo-mgw-doc osmo-msc osmo-msc-dbg osmo-msc-doc osmo-mslookup-utils osmo-pcap-client osmo-pcap-client-dbg osmo-pcap-server osmo-pcap-server-dbg osmo-pcu osmo-pcu-dbg osmo-pcu-doc osmo-remsim-apitool osmo-remsim-bankd osmo-remsim-bankd-dbgsym osmo-remsim-client-shell osmo-remsim-client-shell-dbgsym osmo-remsim-client-st2 osmo-remsim-client-st2-dbgsym osmo-remsim-doc osmo-remsim-server osmo-remsim-server-dbgsym osmo-s1gw osmo-s1gw-dbgsym osmo-sgsn osmo-sgsn-dbg osmo-sgsn-doc osmo-sip-connector osmo-sip-connector-dbg osmo-sip-connector-doc osmo-smlc osmo-smlc-dbg osmo-smlc-doc osmo-stp osmo-stp-dbg osmo-stp-doc osmo-sysmon osmo-sysmon-dbg osmo-trx osmo-trx-dbg osmo-trx-doc osmo-trx-ipc osmo-trx-lms osmo-trx-ms-blade osmo-trx-uhd osmo-trx-usrp1 osmo-uecups osmo-uecups-dbgsym osmo-upf osmo-upf-dbg osmo-upf-doc python3-osmopy-libs python3-osmopy-utils python3-pyosmocom python3-pyosmocom-doc rebar3 rtl-sdr simtrace2-firmware simtrace2-utils simtrace2-utils-dbgsym strongswan strongswan-charon strongswan-charon-dbgsym strongswan-libcharon strongswan-libcharon-dbgsym strongswan-nm strongswan-nm-dbgsym strongswan-pki strongswan-pki-dbgsym strongswan-starter strongswan-starter-dbgsym strongswan-swanctl strongswan-swanctl-dbgsym Reading package lists... Building dependency tree... Reading state information... libosmocodec4 is already the newest version (1.11.0.32.33cb4.202508232026). libosmocodec4 set to manually installed. libosmocoding0 is already the newest version (1.11.0.32.33cb4.202508232026). libosmocoding0 set to manually installed. libosmocore is already the newest version (1.11.0.32.33cb4.202508232026). libosmocore22 is already the newest version (1.11.0.32.33cb4.202508232026). libosmocore22 set to manually installed. libosmoctrl0 is already the newest version (1.11.0.32.33cb4.202508232026). libosmoctrl0 set to manually installed. libosmogb14 is already the newest version (1.11.0.32.33cb4.202508232026). libosmogb14 set to manually installed. libosmogsm20 is already the newest version (1.11.0.32.33cb4.202508232026). libosmogsm20 set to manually installed. libosmoisdn0 is already the newest version (1.11.0.32.33cb4.202508232026). libosmoisdn0 set to manually installed. libosmosim2 is already the newest version (1.11.0.32.33cb4.202508232026). libosmosim2 set to manually installed. libosmousb0 is already the newest version (1.11.0.32.33cb4.202508232026). libosmousb0 set to manually installed. libosmovty13 is already the newest version (1.11.0.32.33cb4.202508232026). libosmovty13 set to manually installed. osmocom-keyring is already the newest version (1.0.2.5.fc66.202508232026). osmocom-keyring set to manually installed. osmocom-nightly is already the newest version (202508232026). osmocom-nightly set to manually installed. Some packages could not be installed. This may mean that you have requested an impossible situation or if you are using the unstable distribution that some required packages have not yet been created or been moved out of Incoming. The following information may help to resolve the situation: The following packages have unmet dependencies: osmo-diameter2gsup : Depends: osmocom-nightly (= 202508222026) but 202508232026 is to be installed E: Unable to correct problems, you have held broken packages. + clean_up_trap + [ -n ] + set +x ### Clean up ### + trap - EXIT INT TERM 0 + clean_up + [ -n ] + [ -e _repo_install_test_data/qemu.pid ] + cat _repo_install_test_data/qemu.pid + kill 3254805 + rm -f _repo_install_test_data/temp.qcow2 Build step 'Execute shell' marked build as failure
3 days, 14 hours
1
2
0
0
Build failed in Jenkins: Osmocom_OBS_sync #755
by jenkins@lists.osmocom.org
See <
https://jenkins.osmocom.org/jenkins/job/Osmocom_OBS_sync/755/display/redire…
> Changes: [Oliver Smith] jenkins-gerrit: print the URLs this script reads [Oliver Smith] jenkins-gerrit: binpkgs: ignore decode errors [Vadim Yanitskiy] jobs/gerrit-verifications: osmo-ttcn3-hacks: do make clean ------------------------------------------ Started by timer Running as SYSTEM Building remotely on build4-deb12build-ansible (registry-build-amd64 ttcn3 obs osmo-gsm-tester-build ttcn3_with_linux_6.1_or_higher qemu io_uring osmocom-gerrit coverity osmocom-master) in workspace <
https://jenkins.osmocom.org/jenkins/job/Osmocom_OBS_sync/ws/
> The recommended git tool is: NONE No credentials specified Wiping out workspace first. Cloning the remote Git repository Cloning repository
https://gerrit.osmocom.org/osmo-ci
> git init <
https://jenkins.osmocom.org/jenkins/job/Osmocom_OBS_sync/ws/
> # timeout=10 Fetching upstream changes from
https://gerrit.osmocom.org/osmo-ci
> git --version # timeout=10 > git --version # 'git version 2.39.5' > git fetch --tags --force --progress --
https://gerrit.osmocom.org/osmo-ci
+refs/heads/*:refs/remotes/origin/* # timeout=10 > git config remote.origin.url
https://gerrit.osmocom.org/osmo-ci
# timeout=10 > git config --add remote.origin.fetch +refs/heads/*:refs/remotes/origin/* # timeout=10 Avoid second fetch > git rev-parse origin/master^{commit} # timeout=10 Checking out Revision cf88fab8cda55362233afbbd54aba0b99a263d44 (origin/master) > git config core.sparsecheckout # timeout=10 > git checkout -f cf88fab8cda55362233afbbd54aba0b99a263d44 # timeout=10 Commit message: "jobs/gerrit-verifications: osmo-ttcn3-hacks: do make clean" > git rev-list --no-walk 3b70b66f32a63b29281f3d2840a25e682785b60b # timeout=10 [Osmocom_OBS_sync] $ /bin/sh -xe /tmp/jenkins17746579200455488076.sh + export PYTHONUNBUFFERED=1 + export DISTROS= Debian:10 Debian:11 Debian:12 Debian:13 Debian:Next Raspbian:10 Raspbian:11 Raspbian:12 Ubuntu:22.04 Ubuntu:24.04 Ubuntu:24.10 Ubuntu:25.04 + ./scripts/obs/sync_obs_projects.py --docker Debian:10 Debian:11 Debian:12 Debian:13 Debian:Next Raspbian:10 Raspbian:11 Raspbian:12 Ubuntu:22.04 Ubuntu:24.04 Ubuntu:24.10 Ubuntu:25.04 docker: building image debian-12-osmocom-obs-build-srcpkg + run_in_docker_and_exit(): ['docker', 'build', '--build-arg', 'DISTRO=debian:12', '--build-arg', 'DISTRO_FROM=debian:12', '--build-arg', 'UID=1000', '-t', 'debian-12-osmocom-obs-build-srcpkg', '-f', '<
https://jenkins.osmocom.org/jenkins/job/Osmocom_OBS_sync/ws/scripts/obs/dat…
',> '<
https://jenkins.osmocom.org/jenkins/job/Osmocom_OBS_sync/ws/scripts/obs/data
']> #0 building with "default" instance using docker driver #1 [internal] load build definition from build_srcpkg.Dockerfile #1 transferring dockerfile: 579B done #1 WARN: InvalidDefaultArgInFrom: Default value for ARG ${DISTRO_FROM} results in empty or invalid base image name (line 3) #1 DONE 0.1s #2 [internal] load metadata for docker.io/library/debian:12 #2 DONE 1.0s #3 [internal] load .dockerignore #3 transferring context: 2B done #3 DONE 0.1s #4 [1/3] FROM docker.io/library/debian:12@sha256:731dd1380d6a8d170a695dbeb17fe0eade0e1c29f654cf0a3a07f372191c3f4b #4 DONE 0.0s #5 [2/3] RUN APT-GET update && apt-get upgrade -y && apt-get install -y --no-install-recommends ca-certificates colordiff debhelper dh-python dpkg-dev fakeroot git git-review gnupg2 libxml2-utils lsb-release meson osc python3-packaging python3-setuptools quilt rebar3 sed sphinx-common && apt-get clean #5 CACHED #6 [3/3] RUN USERADD --uid=1000 -m user #6 CACHED #7 exporting to image #7 exporting layers done #7 writing image sha256:657274af6355552323175804eadb44419c10d349d1a6088a0d281284c7e16045 done #7 naming to docker.io/library/debian-12-osmocom-obs-build-srcpkg #7 naming to docker.io/library/debian-12-osmocom-obs-build-srcpkg done #7 DONE 0.0s [33m1 warning found (use docker --debug to expand): [0m - InvalidDefaultArgInFrom: Default value for ARG ${DISTRO_FROM} results in empty or invalid base image name (line 3) docker: running: sync_obs_projects.py inside docker OBS: getting list of projects (
https://obs.osmocom.org
) Debian:10: getting prjconf Debian:10: getting meta openSUSE.org-mirror:Debian:10: getting prjconf openSUSE.org-mirror:Debian:10: is up-to-date Debian:11: getting prjconf Debian:11: getting meta openSUSE.org-mirror:Debian:11: getting prjconf openSUSE.org-mirror:Debian:11: is up-to-date Debian:12: getting prjconf Debian:12: getting meta openSUSE.org-mirror:Debian:12: getting prjconf openSUSE.org-mirror:Debian:12: is up-to-date Debian:13: getting prjconf Debian:13: getting meta openSUSE.org-mirror:Debian:13: getting prjconf openSUSE.org-mirror:Debian:13: is up-to-date Debian:Next: getting prjconf Debian:Next: getting meta openSUSE.org-mirror:Debian:Next: getting prjconf openSUSE.org-mirror:Debian:Next: is up-to-date Raspbian:10: getting prjconf Traceback (most recent call last): File "/obs/sync_obs_projects.py", line 370, in <module> ERROR: command failed unexpectedly *** command *** ['osc', '-A', '
https://api.opensuse.org
', 'meta', 'prjconf', 'Raspbian:10'] *** returncode *** 1 *** output *** Server returned an error: HTTP Error 503: Service Unavailable Request:
https://api.opensuse.org/source/Raspbian:10/_config
Headers: content-length: 107 cache-control: no-cache content-type: text/html connection: close *** python trace *** main() File "/obs/sync_obs_projects.py", line 346, in main lib.osc.get_prjconf(temp_source_prjconf) File "/obs/lib/osc.py", line 180, in get_prjconf prjconf = lib.osc.run_osc(["meta", "prjconf", proj]).output ^^^^^^^^^^^^^^^^^^^^^^^^^^^^^^^^^^^^^^^^^^ File "/obs/lib/osc.py", line 58, in run_osc return lib.run_cmd(cmd, *args, **kwargs) ^^^^^^^^^^^^^^^^^^^^^^^^^^^^^^^^^ File "/obs/lib/__init__.py", line 200, in run_cmd exit_error_cmd(p, "command failed unexpectedly") File "/obs/lib/__init__.py", line 161, in exit_error_cmd raise RuntimeError("shell command related error, find details right above" RuntimeError: shell command related error, find details right above this python trace Build step 'Execute shell' marked build as failure
3 days, 14 hours
1
1
0
0
Build failed in Jenkins: Osmocom_OBS_nightly #874
by jenkins@lists.osmocom.org
See <
https://jenkins.osmocom.org/jenkins/job/Osmocom_OBS_nightly/874/display/red…
> Changes: ------------------------------------------ [...truncated 22.08 KiB...] osmo-pcap: 'git reset --hard origin/master' osmo-pcap: 'git submodule update --init' osmo-pcap: building source package 0.8.0.202508232026 osmo-pcap: adding debian/changelog entry (0.8.0 => 0.8.0.202508232026) osmo-pcap: building debian source package osmo-pcap: generating rpm spec file osmo-pcu: building source package (feed is nightly) osmo-pcu: cloning
https://gerrit.osmocom.org/osmo-pcu
osmo-pcu: 'git clean -ffxd' osmo-pcu: 'git checkout -f origin/master' osmo-pcu: 'git reset --hard origin/master' osmo-pcu: 'git submodule update --init' osmo-pcu: building source package 1.5.1.12-0273.202508232026 osmo-pcu: adding debian/changelog entry (1.5.1 => 1.5.1.12.0273.202508232026) osmo-pcu: building debian source package osmo-remsim: building source package (feed is nightly) osmo-remsim: cloning
https://gerrit.osmocom.org/osmo-remsim
osmo-remsim: 'git clean -ffxd' osmo-remsim: 'git checkout -f origin/master' osmo-remsim: 'git reset --hard origin/master' osmo-remsim: 'git submodule update --init' osmo-remsim: building source package 1.1.1.4-9a97.202508232026 osmo-remsim: adding debian/changelog entry (1.1.1 => 1.1.1.4.9a97.202508232026) osmo-remsim: building debian source package osmo-sgsn: building source package (feed is nightly) osmo-sgsn: cloning
https://gerrit.osmocom.org/osmo-sgsn
osmo-sgsn: 'git clean -ffxd' osmo-sgsn: 'git checkout -f origin/master' osmo-sgsn: 'git reset --hard origin/master' osmo-sgsn: 'git submodule update --init' osmo-sgsn: building source package 1.12.0.51-4ba66.202508232026 osmo-sgsn: adding debian/changelog entry (1.12.0 => 1.12.0.51.4ba66.202508232026) osmo-sgsn: building debian source package osmo-sip-connector: building source package (feed is nightly) osmo-sip-connector: cloning
https://gerrit.osmocom.org/osmo-sip-connector
osmo-sip-connector: 'git clean -ffxd' osmo-sip-connector: 'git checkout -f origin/master' osmo-sip-connector: 'git reset --hard origin/master' osmo-sip-connector: 'git submodule update --init' osmo-sip-connector: building source package 1.7.1.1-6f55.202508232026 osmo-sip-connector: adding debian/changelog entry (1.7.1 => 1.7.1.1.6f55.202508232026) osmo-sip-connector: building debian source package osmo-smlc: building source package (feed is nightly) osmo-smlc: cloning
https://gerrit.osmocom.org/osmo-smlc
osmo-smlc: 'git clean -ffxd' osmo-smlc: 'git checkout -f origin/master' osmo-smlc: 'git reset --hard origin/master' osmo-smlc: 'git submodule update --init' osmo-smlc: building source package 0.3.2.8-c45a.202508232026 osmo-smlc: adding debian/changelog entry (0.3.2 => 0.3.2.8.c45a.202508232026) osmo-smlc: building debian source package osmo-sysmon: building source package (feed is nightly) osmo-sysmon: cloning
https://gerrit.osmocom.org/osmo-sysmon
osmo-sysmon: 'git clean -ffxd' osmo-sysmon: 'git checkout -f origin/master' osmo-sysmon: 'git reset --hard origin/master' osmo-sysmon: 'git submodule update --init' osmo-sysmon: building source package 0.3.2.6-692b.202508232026 osmo-sysmon: adding debian/changelog entry (0.3.2 => 0.3.2.6.692b.202508232026) osmo-sysmon: building debian source package osmo-trx: building source package (feed is nightly) osmo-trx: cloning
https://gerrit.osmocom.org/osmo-trx
osmo-trx: 'git clean -ffxd' osmo-trx: 'git checkout -f origin/master' osmo-trx: 'git reset --hard origin/master' osmo-trx: 'git submodule update --init' osmo-trx: building source package 1.7.1.2-1d41.202508232026 osmo-trx: adding debian/changelog entry (1.7.1 => 1.7.1.2.1d41.202508232026) osmo-trx: building debian source package osmo-uecups: building source package (feed is nightly) osmo-uecups: cloning
https://gerrit.osmocom.org/osmo-uecups
osmo-uecups: 'git clean -ffxd' osmo-uecups: 'git checkout -f origin/master' osmo-uecups: 'git reset --hard origin/master' osmo-uecups: 'git submodule update --init' osmo-uecups: building source package 0.2.2.19-745d.202508232026 osmo-uecups: adding debian/changelog entry (0.2.2 => 0.2.2.19.745d.202508232026) osmo-uecups: building debian source package osmo-upf: building source package (feed is nightly) osmo-upf: cloning
https://gerrit.osmocom.org/osmo-upf
osmo-upf: 'git clean -ffxd' osmo-upf: 'git checkout -f origin/master' osmo-upf: 'git reset --hard origin/master' osmo-upf: 'git submodule update --init' osmo-upf: building source package 0.3.0.9-9494.202508232026 osmo-upf: adding debian/changelog entry (0.3.0 => 0.3.0.9.9494.202508232026) osmo-upf: building debian source package osmocom-bb: building source package (feed is nightly) osmocom-bb: cloning
https://gerrit.osmocom.org/osmocom-bb
osmocom-bb: 'git clean -ffxd' osmocom-bb: 'git checkout -f origin/master' osmocom-bb: 'git reset --hard origin/master' osmocom-bb: 'git submodule update --init' osmocom-bb: has no git tags osmocom-bb: getting version from debian/changelog osmocom-bb: building source package 0.2.0.3654-54a0.202508232026 osmocom-bb: adding debian/changelog entry (0.2.0 => 0.2.0.3654.54a0.202508232026) osmocom-bb: building debian source package python/osmo-python-tests: building source package (feed is nightly) python/osmo-python-tests: cloning
https://gerrit.osmocom.org/python/osmo-python-tests
python/osmo-python-tests: 'git clean -ffxd' python/osmo-python-tests: 'git checkout -f origin/master' python/osmo-python-tests: 'git reset --hard origin/master' python/osmo-python-tests: 'git submodule update --init' python/osmo-python-tests: has no git tags python/osmo-python-tests: getting version from debian/changelog python/osmo-python-tests: building source package 0.3.0.161-fc78.202508232026 python/osmo-python-tests: adding debian/changelog entry (0.3.0 => 0.3.0.161.fc78.202508232026) python/osmo-python-tests: building debian source package python/pyosmocom: building source package (feed is nightly) python/pyosmocom: cloning
https://gerrit.osmocom.org/python/pyosmocom
python/pyosmocom: 'git clean -ffxd' python/pyosmocom: 'git checkout -f origin/master' python/pyosmocom: 'git reset --hard origin/master' python/pyosmocom: 'git submodule update --init' python/pyosmocom: has no git tags python/pyosmocom: getting version from debian/changelog python/pyosmocom: building source package 0.0.9.218-0171.202508232026 python/pyosmocom: adding debian/changelog entry (0.0.9 => 0.0.9.218.0171.202508232026) python/pyosmocom: building debian source package rtl-sdr: building source package (feed is nightly) rtl-sdr: cloning
https://gitea.osmocom.org/sdr/rtl-sdr
rtl-sdr: 'git clean -ffxd' rtl-sdr: 'git checkout -f origin/master' rtl-sdr: 'git reset --hard origin/master' rtl-sdr: 'git submodule update --init' rtl-sdr: building source package 2.0.2.202508232026 rtl-sdr: adding debian/changelog entry (2.0.2 => 2.0.2.202508232026) rtl-sdr: building debian source package simtrace2: building source package (feed is nightly) simtrace2: cloning
https://gerrit.osmocom.org/simtrace2
simtrace2: 'git clean -ffxd' simtrace2: 'git checkout -f origin/master' simtrace2: 'git reset --hard origin/master' simtrace2: 'git submodule update --init' simtrace2: building source package 0.9.0.1-d0ad.202508232026 simtrace2: adding debian/changelog entry (0.9.0 => 0.9.0.1.d0ad.202508232026) simtrace2: building debian source package strongswan-epdg: building source package (feed is nightly) strongswan-epdg: cloning
https://gitea.osmocom.org/ims-volte-vowifi/strongswan-epdg
strongswan-epdg: 'git clean -ffxd' strongswan-epdg: 'git checkout -f origin/master' strongswan-epdg: 'git reset --hard origin/master' strongswan-epdg: 'git submodule update --init' strongswan-epdg: building source package 2:0.1.2-osmo-epdg.202508232026 strongswan-epdg: adding debian/changelog entry (2:0.1.2-osmo-epdg => 2:0.1.2.osmo.epdg.202508232026) strongswan-epdg: building debian source package limesuite: building source package (feed is nightly) limesuite: cloning
https://github.com/myriadrf/LimeSuite
limesuite: 'git clean -ffxd' limesuite: 'git checkout -f origin/master' limesuite: 'git reset --hard origin/master' limesuite: 'git submodule update --init' limesuite: has no git tags limesuite: getting version from debian/changelog limesuite: building source package 23.11.0-1.2156-524c.202508232026 limesuite: adding debian/changelog entry (23.11.0-1 => 23.11.0.1.2156.524c.202508232026) limesuite: running prepare_project_limesuite limesuite: fixing debian/source/format (3.0 (quilt) => 3.0 (native)) limesuite: building debian source package neocon: building source package (feed is nightly) neocon: cloning
https://github.com/laf0rge/neocon
neocon: 'git clean -ffxd' neocon: 'git checkout -f origin/master' neocon: 'git reset --hard origin/master' neocon: 'git submodule update --init' neocon: has no git tags neocon: getting version from debian/changelog neocon: building source package 1.0.2.12-36dc.202508232026 neocon: adding debian/changelog entry (1.0.2 => 1.0.2.12.36dc.202508232026) neocon: building debian source package neocon: generating rpm spec file open5gs: building source package (feed is nightly) open5gs: cloning
https://github.com/open5gs/open5gs
open5gs: 'git clean -ffxd' open5gs: 'git checkout -f origin/main' open5gs: 'git reset --hard origin/main' open5gs: 'git submodule update --init' open5gs: has no git tags open5gs: getting version from debian/changelog open5gs: building source package 2.7.6.4747-da27.202508232026 open5gs: adding debian/changelog entry (2.7.6 => 2.7.6.4747.da27.202508232026) open5gs: running prepare_project_open5gs open5gs: building debian source package ### Uploading built packages ### osmocom-nightly: updating OBS package osmocom-keyring: updating OBS package erlang/osmo-epdg: updating OBS package erlang/osmo-s1gw: updating OBS package gapk: updating OBS package libasn1c: updating OBS package libgtpnl: updating OBS package libosmo-abis: updating OBS package libosmo-dsp: updating OBS package libosmo-gprs: updating OBS package libosmo-netif: updating OBS package libosmo-pfcp: updating OBS package libosmo-sigtran: updating OBS package libosmocore: updating OBS package libsmpp34: updating OBS package libusrp: updating OBS package osmo-bsc: updating OBS package osmo-bsc-nat: updating OBS package osmo-bts: updating OBS package osmo-cbc: updating OBS package osmo-e1d: updating OBS package osmo-fl2k: updating OBS package osmo-gbproxy: updating OBS package osmo-ggsn: updating OBS package osmo-gsm-manuals: updating OBS package osmo-hlr: updating OBS package osmo-hnbgw: updating OBS package osmo-hnodeb: updating OBS package osmo-iuh: updating OBS package osmo-mgw: updating OBS package osmo-msc: updating OBS package osmo-pcap: updating OBS package osmo-pcu: updating OBS package osmo-remsim: updating OBS package osmo-sgsn: updating OBS package osmo-sip-connector: updating OBS package osmo-smlc: updating OBS package osmo-sysmon: updating OBS package osmo-trx: updating OBS package osmo-uecups: updating OBS package osmo-upf: updating OBS package osmocom-bb: updating OBS package python/osmo-python-tests: updating OBS package python/pyosmocom: updating OBS package rtl-sdr: updating OBS package simtrace2: updating OBS package strongswan-epdg: updating OBS package limesuite: updating OBS package neocon: updating OBS package open5gs: updating OBS package ### Summary ### Updated: 50 Skipped: 0 Failed (srcpkg build): 1 Failed (srcpkg upload): 0 Deleted: 0 List of failed packages: * erlang/osmo_dia2gsup (srcpkg build) Build step 'Execute shell' marked build as failure
4 days
1
2
0
0
← Newer
1
2
3
4
5
Older →
Jump to page:
1
2
3
4
5
Results per page:
10
25
50
100
200