See <https://jenkins.osmocom.org/jenkins/job/master-osmocom-bb/a1=default,a2=def…>
Changes:
------------------------------------------
[...truncated 500.68 KiB...]
SIZE board/compal_e99/compal_dsp_dump.compalram.size
text data bss dec hex filename
22999 376 24128 47503 b98f board/compal_e99/compal_dsp_dump.compalram.elf
SIZE board/compal_e99/compal_dsp_dump.highram.size
text data bss dec hex filename
23003 376 24096 47475 b973 board/compal_e99/compal_dsp_dump.highram.elf
SIZE board/se_j100/compal_dsp_dump.highram.size
text data bss dec hex filename
22951 376 23676 47003 b79b board/se_j100/compal_dsp_dump.highram.elf
SIZE board/se_j100/compal_dsp_dump.compalram.size
text data bss dec hex filename
22947 376 23708 47031 b7b7 board/se_j100/compal_dsp_dump.compalram.elf
SIZE board/se_k2xx/compal_dsp_dump.highram.size
text data bss dec hex filename
23081 376 33940 57397 e035 board/se_k2xx/compal_dsp_dump.highram.elf
SIZE board/gta0x/compal_dsp_dump.highram.size
text data bss dec hex filename
16145 344 17556 34045 84fd board/gta0x/compal_dsp_dump.highram.elf
SIZE board/gtm900b/compal_dsp_dump.highram.size
text data bss dec hex filename
17213 344 17560 35117 892d board/gtm900b/compal_dsp_dump.highram.elf
SIZE board/fcdev3b/compal_dsp_dump.highram.size
text data bss dec hex filename
15793 344 17556 33693 839d board/fcdev3b/compal_dsp_dump.highram.elf
SIZE board/pirelli_dpl10/compal_dsp_dump.highram.size
text data bss dec hex filename
23349 376 33940 57665 e141 board/pirelli_dpl10/compal_dsp_dump.highram.elf
SIZE board/tr800/compal_dsp_dump.highram.size
text data bss dec hex filename
18041 344 17556 35941 8c65 board/tr800/compal_dsp_dump.highram.elf
SIZE board/compal_e88/layer1.highram.size
text data bss dec hex filename
59177 3946 27048 90171 1603b board/compal_e88/layer1.highram.elf
SIZE board/compal_e88/layer1.e88flash.size
text data bss dec hex filename
59281 3948 27247 90476 1616c board/compal_e88/layer1.e88flash.elf
SIZE board/compal_e88/layer1.e88loader.size
text data bss dec hex filename
58925 3948 35495 98368 18040 board/compal_e88/layer1.e88loader.elf
SIZE board/compal_e88/layer1.compalram.size
text data bss dec hex filename
59173 3946 27080 90199 16057 board/compal_e88/layer1.compalram.elf
SIZE board/compal_e86/layer1.compalram.size
text data bss dec hex filename
57077 3922 32316 93315 16c83 board/compal_e86/layer1.compalram.elf
SIZE board/compal_e86/layer1.highram.size
text data bss dec hex filename
57081 3922 32284 93287 16c67 board/compal_e86/layer1.highram.elf
SIZE board/compal_e99/layer1.highram.size
text data bss dec hex filename
56451 3922 32680 93053 16b7d board/compal_e99/layer1.highram.elf
SIZE board/compal_e99/layer1.compalram.size
text data bss dec hex filename
56447 3922 32712 93081 16b99 board/compal_e99/layer1.compalram.elf
SIZE board/se_j100/layer1.compalram.size
text data bss dec hex filename
56427 3922 32292 92641 169e1 board/se_j100/layer1.compalram.elf
SIZE board/se_j100/layer1.highram.size
text data bss dec hex filename
56431 3922 32260 92613 169c5 board/se_j100/layer1.highram.elf
SIZE board/se_k2xx/layer1.highram.size
text data bss dec hex filename
57777 3922 42524 104223 1971f board/se_k2xx/layer1.highram.elf
SIZE board/gta0x/layer1.highram.size
text data bss dec hex filename
50909 3890 26140 80939 13c2b board/gta0x/layer1.highram.elf
SIZE board/gtm900b/layer1.highram.size
text data bss dec hex filename
52069 3890 26148 82107 140bb board/gtm900b/layer1.highram.elf
SIZE board/fcdev3b/layer1.highram.size
text data bss dec hex filename
50629 3890 26140 80659 13b13 board/fcdev3b/layer1.highram.elf
SIZE board/pirelli_dpl10/layer1.highram.size
text data bss dec hex filename
56529 3922 42528 102979 19243 board/pirelli_dpl10/layer1.highram.elf
SIZE board/tr800/layer1.highram.size
text data bss dec hex filename
51321 3890 26140 81351 13dc7 board/tr800/layer1.highram.elf
SIZE board/compal_e88/loader.compalram.size
text data bss dec hex filename
27606 420 18564 46590 b5fe board/compal_e88/loader.compalram.elf
SIZE board/compal_e88/loader.highram.size
text data bss dec hex filename
27610 420 18532 46562 b5e2 board/compal_e88/loader.highram.elf
SIZE board/compal_e86/loader.highram.size
text data bss dec hex filename
25350 388 23768 49506 c162 board/compal_e86/loader.highram.elf
SIZE board/compal_e86/loader.compalram.size
text data bss dec hex filename
25346 388 23800 49534 c17e board/compal_e86/loader.compalram.elf
SIZE board/compal_e99/loader.highram.size
text data bss dec hex filename
24718 388 24164 49270 c076 board/compal_e99/loader.highram.elf
SIZE board/compal_e99/loader.compalram.size
text data bss dec hex filename
24714 388 24196 49298 c092 board/compal_e99/loader.compalram.elf
SIZE board/se_j100/loader.compalram.size
text data bss dec hex filename
24690 388 23776 48854 bed6 board/se_j100/loader.compalram.elf
SIZE board/se_j100/loader.highram.size
text data bss dec hex filename
24694 388 23744 48826 beba board/se_j100/loader.highram.elf
SIZE board/se_k2xx/loader.highram.size
text data bss dec hex filename
24792 388 34008 59188 e734 board/se_k2xx/loader.highram.elf
SIZE board/gta0x/loader.highram.size
text data bss dec hex filename
17854 356 17624 35834 8bfa board/gta0x/loader.highram.elf
SIZE board/gtm900b/loader.highram.size
text data bss dec hex filename
18142 356 17628 36126 8d1e board/gtm900b/loader.highram.elf
SIZE board/fcdev3b/loader.highram.size
text data bss dec hex filename
17512 356 17624 35492 8aa4 board/fcdev3b/loader.highram.elf
SIZE board/pirelli_dpl10/loader.highram.size
text data bss dec hex filename
25034 388 34008 59430 e826 board/pirelli_dpl10/loader.highram.elf
SIZE board/tr800/loader.highram.size
text data bss dec hex filename
19748 356 17624 37728 9360 board/tr800/loader.highram.elf
SIZE board/compal_e88/rssi.e88flash.size
text data bss dec hex filename
79442 4060 25251 108753 1a8d1 board/compal_e88/rssi.e88flash.elf
SIZE board/compal_e88/rssi.e88loader.size
text data bss dec hex filename
79118 4060 33499 116677 1c7c5 board/compal_e88/rssi.e88loader.elf
SIZE board/compal_e88/rssi.highram.size
text data bss dec hex filename
79338 4058 25052 108448 1a7a0 board/compal_e88/rssi.highram.elf
SIZE board/compal_e86/rssi.highram.size
text data bss dec hex filename
77242 4034 30308 111584 1b3e0 board/compal_e86/rssi.highram.elf
SIZE board/compal_e99/rssi.highram.size
text data bss dec hex filename
76640 4034 30708 111382 1b316 board/compal_e99/rssi.highram.elf
SIZE board/se_j100/rssi.highram.size
text data bss dec hex filename
76588 4034 30284 110906 1b13a board/se_j100/rssi.highram.elf
SIZE board/se_k2xx/rssi.highram.size
text data bss dec hex filename
77970 4034 40548 122552 1deb8 board/se_k2xx/rssi.highram.elf
SIZE board/gta0x/rssi.highram.size
text data bss dec hex filename
71098 4002 24164 99264 183c0 board/gta0x/rssi.highram.elf
SIZE board/gtm900b/rssi.highram.size
text data bss dec hex filename
72230 4002 24172 100404 18834 board/gtm900b/rssi.highram.elf
SIZE board/fcdev3b/rssi.highram.size
text data bss dec hex filename
70786 4002 24164 98952 18288 board/fcdev3b/rssi.highram.elf
SIZE board/pirelli_dpl10/rssi.highram.size
text data bss dec hex filename
76690 4034 40552 121276 1d9bc board/pirelli_dpl10/rssi.highram.elf
SIZE board/tr800/rssi.highram.size
text data bss dec hex filename
71510 4002 24164 99676 1855c board/tr800/rssi.highram.elf
SIZE board/compal_e88/menu.compalram.size
text data bss dec hex filename
25909 404 19280 45593 b219 board/compal_e88/menu.compalram.elf
SIZE board/compal_e88/menu.e88flash.size
text data bss dec hex filename
25985 404 19447 45836 b30c board/compal_e88/menu.e88flash.elf
SIZE board/compal_e88/menu.e88loader.size
text data bss dec hex filename
25917 404 27695 54016 d300 board/compal_e88/menu.e88loader.elf
SIZE board/compal_e86/menu.compalram.size
text data bss dec hex filename
23649 380 24516 48545 bda1 board/compal_e86/menu.compalram.elf
SIZE board/compal_e99/menu.compalram.size
text data bss dec hex filename
23065 380 24912 48357 bce5 board/compal_e99/menu.compalram.elf
SIZE board/se_j100/menu.compalram.size
text data bss dec hex filename
23045 380 24492 47917 bb2d board/se_j100/menu.compalram.elf
make[1]: Leaving directory '/build/src/target/firmware'
+ cd /build/src/target/trx_toolkit
+ python3 -m unittest discover -v
test_no_timing_error_accumulated (test_clck_gen.CLCKGen_Test.test_no_timing_error_accumulated) ... WARNING:root:CLCKGen: time overrun by -9612us; resetting the clock
FAIL
test_period_is_gsm_frame (test_clck_gen.CLCKGen_Test.test_period_is_gsm_frame) ... ok
test_from_bytes (test_codec.BitFieldSet.test_from_bytes) ... ok
test_from_bytes_spare (test_codec.BitFieldSet.test_from_bytes_spare) ... ok
test_from_bytes_val (test_codec.BitFieldSet.test_from_bytes_val) ... ok
test_len_auto (test_codec.BitFieldSet.test_len_auto) ... ok
test_offset_mask (test_codec.BitFieldSet.test_offset_mask) ... ok
test_overflow (test_codec.BitFieldSet.test_overflow) ... ok
test_to_bytes (test_codec.BitFieldSet.test_to_bytes) ... ok
test_to_bytes_spare (test_codec.BitFieldSet.test_to_bytes_spare) ... ok
test_to_bytes_val (test_codec.BitFieldSet.test_to_bytes_val) ... ok
test_from_bytes (test_codec.Buf.test_from_bytes) ... ok
test_to_bytes (test_codec.Buf.test_to_bytes) ... ok
test_field_raises (test_codec.Envelope.test_field_raises) ... ok
test_from_bytes (test_codec.Envelope.test_from_bytes) ... ok
test_from_bytes_check (test_codec.Envelope.test_from_bytes_check) ... ok
test_rest_octets (test_codec.Envelope.test_rest_octets) ... ok
test_to_bytes (test_codec.Envelope.test_to_bytes) ... ok
test_to_bytes_check (test_codec.Envelope.test_to_bytes_check) ... ok
test_from_bytes (test_codec.Field.test_from_bytes) ... ok
test_get_len (test_codec.Field.test_get_len) ... ok
test_get_pres (test_codec.Field.test_get_pres) ... ok
test_get_val (test_codec.Field.test_get_val) ... ok
test_to_bytes (test_codec.Field.test_to_bytes) ... ok
test_from_bytes (test_codec.Sequence.test_from_bytes) ... ok
test_to_bytes (test_codec.Sequence.test_to_bytes) ... ok
test_from_bytes (test_codec.Spare.test_from_bytes) ... ok
test_to_bytes (test_codec.Spare.test_to_bytes) ... ok
test_int16 (test_codec.Uint.test_int16) ... ok
test_int32 (test_codec.Uint.test_int32) ... ok
test_int8 (test_codec.Uint.test_int8) ... ok
test_offset_mult (test_codec.Uint.test_offset_mult) ... ok
test_uint16 (test_codec.Uint.test_uint16) ... ok
test_uint32 (test_codec.Uint.test_uint32) ... ok
test_uint8 (test_codec.Uint.test_uint8) ... ok
test_parse_all_empty (test_data_dump.DATADump_Test.test_parse_all_empty) ... ok
test_parse_empty (test_data_dump.DATADump_Test.test_parse_empty) ... ok
test_parse_len_overflow (test_data_dump.DATADump_Test.test_parse_len_overflow) ... ok
test_parse_msg_idx (test_data_dump.DATADump_Test.test_parse_msg_idx) ... ok
test_parse_unknown_tag (test_data_dump.DATADump_Test.test_parse_unknown_tag) ... ok
test_store_and_parse_all (test_data_dump.DATADump_Test.test_store_and_parse_all) ... ok
test_store_and_parse_rx_msg (test_data_dump.DATADump_Test.test_store_and_parse_rx_msg) ... ok
test_store_and_parse_tx_msg (test_data_dump.DATADump_Test.test_store_and_parse_tx_msg) ... ok
test_bit_conv (test_data_msg.Msg_Test.test_bit_conv) ... ok
test_enc_dec (test_data_msg.Msg_Test.test_enc_dec) ... ok
test_rand_hdr_burst (test_data_msg.Msg_Test.test_rand_hdr_burst) ... ok
test_transform (test_data_msg.Msg_Test.test_transform) ... ok
test_validate (test_data_msg.Msg_Test.test_validate) ... ok
======================================================================
FAIL: test_no_timing_error_accumulated (test_clck_gen.CLCKGen_Test.test_no_timing_error_accumulated)
----------------------------------------------------------------------
Traceback (most recent call last):
File "/build/src/target/trx_toolkit/test_clck_gen.py", line 60, in test_no_timing_error_accumulated
self.assertTrue((ntick+1)*clck.ctr_interval > dT, "tick #%d: time overrun by %dus total" %
~~~~~~~~~~~~~~~^^^^^^^^^^^^^^^^^^^^^^^^^^^^^^^^^^^^^^^^^^^^^^^^^^^^^^^^^^^^^^^^^^^^^^^^^^^^
(ntick, dTerr // 1e-6))
^^^^^^^^^^^^^^^^^^^^^^^
AssertionError: False is not true : tick #200: time overrun by 9759us total
----------------------------------------------------------------------
Ran 48 tests in 0.966s
FAILED (failures=1)
Build step 'Execute shell' marked build as failure
$ ssh-agent -k
unset SSH_AUTH_SOCK;
unset SSH_AGENT_PID;
echo Agent pid 3985885 killed;
[ssh-agent] Stopped.
Archiving artifacts
See <https://jenkins.osmocom.org/jenkins/job/Osmocom_OBS_master/119803/display/r…>
Changes:
------------------------------------------
[...truncated 656 B...]
Running as SYSTEM
Building remotely on build4-deb12build-ansible (registry-build-amd64 ttcn3 obs osmo-gsm-tester-build ttcn3_with_linux_6.1_or_higher qemu io_uring osmocom-gerrit coverity osmocom-master) in workspace <https://jenkins.osmocom.org/jenkins/job/Osmocom_OBS_master/ws/>
The recommended git tool is: NONE
No credentials specified
Wiping out workspace first.
Cloning the remote Git repository
Cloning repository https://gerrit.osmocom.org/osmo-ci
> git init <https://jenkins.osmocom.org/jenkins/job/Osmocom_OBS_master/ws/> # timeout=10
Fetching upstream changes from https://gerrit.osmocom.org/osmo-ci
> git --version # timeout=10
> git --version # 'git version 2.39.5'
> git fetch --tags --force --progress -- https://gerrit.osmocom.org/osmo-ci +refs/heads/*:refs/remotes/origin/* # timeout=10
> git config remote.origin.url https://gerrit.osmocom.org/osmo-ci # timeout=10
> git config --add remote.origin.fetch +refs/heads/*:refs/remotes/origin/* # timeout=10
Avoid second fetch
> git rev-parse origin/master^{commit} # timeout=10
Checking out Revision 98b6e81b3e0e08d6e403b048056390edf1dc779b (origin/master)
> git config core.sparsecheckout # timeout=10
> git checkout -f 98b6e81b3e0e08d6e403b048056390edf1dc779b # timeout=10
Commit message: "jobs/ttcn3: adjust to testenv config rename"
> git rev-list --no-walk 98b6e81b3e0e08d6e403b048056390edf1dc779b # timeout=10
[Osmocom_OBS_master] $ /bin/sh -xe /tmp/jenkins9465627651506222459.sh
+ export PYTHONUNBUFFERED=1
+ ./scripts/obs/update_obs_project.py --apiurl https://obs.osmocom.org --conflict-version --docker --feed master --meta osmocom:master
docker: building image debian-13-osmocom-obs-build-srcpkg
+ run_in_docker_and_exit(): ['docker', 'build', '--build-arg', 'DISTRO=debian:13', '--build-arg', 'DISTRO_FROM=debian:trixie', '--build-arg', 'UID=1000', '-t', 'debian-13-osmocom-obs-build-srcpkg', '-f', '<https://jenkins.osmocom.org/jenkins/job/Osmocom_OBS_master/ws/scripts/obs/d…',> '<https://jenkins.osmocom.org/jenkins/job/Osmocom_OBS_master/ws/scripts/obs/d…']>
#0 building with "default" instance using docker driver
#1 [internal] load build definition from build_srcpkg.Dockerfile
#1 transferring dockerfile: 1.45kB done
#1 DONE 0.1s
#2 [internal] load metadata for docker.io/library/debian:trixie
#2 DONE 0.0s
#3 [internal] load .dockerignore
#3 transferring context: 2B done
#3 DONE 0.1s
#4 [1/4] FROM docker.io/library/debian:trixie
#4 DONE 0.0s
#5 [2/4] RUN APT-GET update && apt-get upgrade -y && apt-get install -y --no-install-recommends ca-certificates colordiff debhelper default-libmysqlclient-dev dh-python dh-virtualenv dpkg-dev erlang-nox fakeroot git git-review gnupg2 libxml2-utils lsb-release meson osc pkgconf python3-packaging python3-pip python3-setuptools quilt sed sphinx-common wget && apt-get clean
#5 CACHED
#6 [3/4] RUN WGET https://github.com/erlang/rebar3/releases/download/3.24.0/rebar3 -O /usr/bin/rebar3 && echo "d2d31cfb98904b8e4917300a75f870de12cb5167cd6214d1043e973a56668a54 /usr/bin/rebar3" | sha256sum -c && chmod +x /usr/bin/rebar3 && rebar3 --version
#6 CACHED
#7 [4/4] RUN USERADD --uid=1000 -m user
#7 CACHED
#8 exporting to image
#8 exporting layers done
#8 writing image sha256:a4ad70ee42133719cb6f4e0beaff5f10d2f326ccbf8094506b7e06e0cdde1dbf 0.0s done
#8 naming to docker.io/library/debian-13-osmocom-obs-build-srcpkg 0.0s done
#8 DONE 0.1s
[33m1 warning found (use docker --debug to expand):
[0m - InvalidDefaultArgInFrom: Default value for ARG ${DISTRO_FROM} results in empty or invalid base image name (line 3)
docker: running: update_obs_project.py inside docker
/obs/lib/debian.py:183: SyntaxWarning: invalid escape sequence '\/'
lib.run_cmd(["sed", "-i", "s/$(MAKE) -C doc\/manuals//g", f"{debian}/rules"])
OBS: getting packages in osmocom:master
### Building source packages ###
osmocom-master: getting OBS version
osmocom-master: skipping (1.1.0 is up-to-date)
osmocom-keyring: getting head from git remote for master
osmocom-keyring: getting OBS version
osmocom-keyring: skipping (7873756ddb89fc91d8035b1de9d8f7294aa7957d is up-to-date)
erlang/osmo_dia2gsup: getting head from git remote for master
erlang/osmo_dia2gsup: getting OBS version
erlang/osmo_dia2gsup: skipping (bc38313e934ff532c9f4c967dd7fb7e63d296175 is up-to-date)
erlang/osmo-epdg: getting head from git remote for master
erlang/osmo-epdg: getting OBS version
erlang/osmo-epdg: skipping (35afe13b4405d4efe3830fca30e0de4e972c75e6 is up-to-date)
erlang/osmo-s1gw: getting head from git remote for master
erlang/osmo-s1gw: getting OBS version
erlang/osmo-s1gw: skipping (137858b7af24e2fa34c9f36afd489d8b2a811e79 is up-to-date)
gapk: getting head from git remote for master
gapk: getting OBS version
gapk: skipping (0fe672e68d5c45ce866743348e37b55622b4f286 is up-to-date)
libasn1c: getting head from git remote for master
libasn1c: getting OBS version
libasn1c: skipping (984b3db58c352f4486d0abcba53d6a84fc72fbb5 is up-to-date)
libgtpnl: getting head from git remote for master
libgtpnl: getting OBS version
libgtpnl: skipping (a8e0c6a31d92ad093d4bc99ecdc45d9e448d1e2d is up-to-date)
libosmo-abis: getting head from git remote for master
libosmo-abis: getting OBS version
libosmo-abis: skipping (df2ab7096241dc3ca9266b70af4342eafc8bc27f is up-to-date)
libosmo-dsp: getting head from git remote for master
libosmo-dsp: getting OBS version
libosmo-dsp: skipping (f6f4d4a47a30cc50b5a27615ab9eec2c58ebbd29 is up-to-date)
libosmo-gprs: getting head from git remote for master
libosmo-gprs: getting OBS version
libosmo-gprs: skipping (8d844c5a54488ff9bdb3bd0b47a6a947118c80f7 is up-to-date)
libosmo-netif: getting head from git remote for master
libosmo-netif: getting OBS version
libosmo-netif: skipping (d62e4b703c58a6d765cdaad2262db60e627d83e9 is up-to-date)
libosmo-pfcp: getting head from git remote for master
libosmo-pfcp: getting OBS version
libosmo-pfcp: skipping (5a60947bd81eeb6d27e6342b848c005c8f1c9d3f is up-to-date)
libosmo-asn1-tcap: getting head from git remote for master
libosmo-asn1-tcap: getting OBS version
libosmo-asn1-tcap: skipping (e08c4af00aae12158d6f35b2dbbc291799a9c2fd is up-to-date)
libosmo-sigtran: getting head from git remote for master
libosmo-sigtran: getting OBS version
libosmo-sigtran: skipping (f95eb5d034bf76565811841f1fd09445c5b8b747 is up-to-date)
libosmocore: getting head from git remote for master
libosmocore: getting OBS version
libosmocore: skipping (cda92ed69099814497698919170d85f523e71950 is up-to-date)
libsmpp34: getting head from git remote for master
libsmpp34: getting OBS version
libsmpp34: skipping (567463e330f49784af19b0e39690a4863fcadfd7 is up-to-date)
libusrp: getting head from git remote for master
libusrp: getting OBS version
libusrp: skipping (a1eaf5c4b77ac86440ada1bf21ee22ed4e691571 is up-to-date)
osmo-bsc: getting head from git remote for master
osmo-bsc: getting OBS version
osmo-bsc: skipping (cf87ca1c90344d316e04d67336e0b38dc34391ca is up-to-date)
osmo-bsc-nat: getting head from git remote for master
osmo-bsc-nat: getting OBS version
osmo-bsc-nat: skipping (4db9d759db3858796e1589afff7455ee0c2703f4 is up-to-date)
osmo-bts: getting head from git remote for master
osmo-bts: getting OBS version
osmo-bts: skipping (7db79cc39a265a6838206df836d1bee28be1acee is up-to-date)
osmo-cbc: getting head from git remote for master
osmo-cbc: getting OBS version
osmo-cbc: skipping (91ea92868a2a197bc6009b0745e94ba9a87cbdb7 is up-to-date)
osmo-e1d: getting head from git remote for master
osmo-e1d: getting OBS version
osmo-e1d: skipping (f7dc5864f021ff2caf1a902db571830b3623a82f is up-to-date)
osmo-fl2k: getting head from git remote for master
osmo-fl2k: getting OBS version
osmo-fl2k: skipping (62ebc51cc4c5b3bba74f1d05a171e4937a9f93a6 is up-to-date)
osmo-gbproxy: getting head from git remote for master
osmo-gbproxy: getting OBS version
osmo-gbproxy: skipping (0aee821e141916c386c013b70c60a3609ec2b9e7 is up-to-date)
osmo-ggsn: getting head from git remote for master
osmo-ggsn: getting OBS version
osmo-ggsn: skipping (88d65840aa2aa6b9b340a98da772ffe552166a79 is up-to-date)
osmo-gsm-manuals: getting head from git remote for master
osmo-gsm-manuals: getting OBS version
osmo-gsm-manuals: skipping (d24f7186f6dff58940ee57b97f9d278cc07f245e is up-to-date)
osmo-hlr: getting head from git remote for master
osmo-hlr: getting OBS version
osmo-hlr: skipping (d4b4548589f929d7c888ad213bd601ab2a421d8a is up-to-date)
osmo-hnbgw: getting head from git remote for master
osmo-hnbgw: getting OBS version
osmo-hnbgw: skipping (2235062eb1ee684e60da5ec70acadb071c3af17f is up-to-date)
osmo-hnodeb: getting head from git remote for master
osmo-hnodeb: getting OBS version
osmo-hnodeb: skipping (39bf4efd6c835e2c6fe872a118c1250a79bdaf78 is up-to-date)
osmo-iuh: getting head from git remote for master
osmo-iuh: getting OBS version
osmo-iuh: skipping (3764c5efeaf615e3d6b91d2bfe7baee9ad74a262 is up-to-date)
osmo-mgw: getting head from git remote for master
osmo-mgw: getting OBS version
osmo-mgw: skipping (7d236cca56116642365ff87d4e3a961bfe38fe4d is up-to-date)
osmo-msc: getting head from git remote for master
osmo-msc: getting OBS version
osmo-msc: skipping (c74d06785699a89a8cc94f7eda8c0115bfea3348 is up-to-date)
osmo-pcap: getting head from git remote for master
osmo-pcap: getting OBS version
osmo-pcap: skipping (69780698c26386a9f8b0fdb2ad1a4d96ca77a78f is up-to-date)
osmo-pcu: getting head from git remote for master
osmo-pcu: getting OBS version
osmo-pcu: skipping (1e1c397a02c4220ffa896e8d57855d48426aeaa4 is up-to-date)
osmo-remsim: getting head from git remote for master
osmo-remsim: getting OBS version
osmo-remsim: skipping (0916f85971ff173c9a26c7ffdef2315ba5190323 is up-to-date)
osmo-sgsn: getting head from git remote for master
osmo-sgsn: getting OBS version
osmo-sgsn: skipping (1fd205f0b838392625303671b240aaaf7c9c4dac is up-to-date)
osmo-sip-connector: getting head from git remote for master
osmo-sip-connector: getting OBS version
osmo-sip-connector: skipping (6f5534bd5f1107c8bd842d4d349a2837981d5845 is up-to-date)
osmo-smlc: getting head from git remote for master
osmo-smlc: getting OBS version
osmo-smlc: skipping (c45aa8f5716ac8059b6dce69f5679a3c7773223c is up-to-date)
osmo-sysmon: getting head from git remote for master
osmo-sysmon: getting OBS version
osmo-sysmon: skipping (692b917823c924028b3e5bcab29861c6243630ac is up-to-date)
osmo-trx: getting head from git remote for master
osmo-trx: getting OBS version
osmo-trx: skipping (33445944ded055c704d4a660bd5f3b628c6a3b5f is up-to-date)
osmo-uecups: getting head from git remote for master
osmo-uecups: getting OBS version
osmo-uecups: skipping (745d44e77b836a8d22f65e7b382ba38ea9e66db8 is up-to-date)
osmo-upf: getting head from git remote for master
osmo-upf: getting OBS version
osmo-upf: skipping (9494bd12af242c85cee9d9628bfcdcf2902bd07c is up-to-date)
osmocom-bb: getting head from git remote for master
osmocom-bb: getting OBS version
osmocom-bb: skipping (97ae9d8e02cfae60ad72214108e10e19311867f5 is up-to-date)
python/osmo-python-tests: getting head from git remote for master
python/osmo-python-tests: getting OBS version
python/osmo-python-tests: skipping (5d0fac9dc330225bb49511516d1b0c9c408cb867 is up-to-date)
python/pyosmocom: getting head from git remote for master
python/pyosmocom: getting OBS version
python/pyosmocom: skipping (35c5fe29807a45d8cd75e85846d4caccdd96f6d6 is up-to-date)
rtl-sdr: getting head from git remote for master
rtl-sdr: getting OBS version
rtl-sdr: skipping (ae0dd6d4f09088d13500a854091b45ad281ca4f0 is up-to-date)
simtrace2: getting head from git remote for master
simtrace2: getting OBS version
simtrace2: skipping (d0ad985eb0aa6ae5067f2b3fbfc4853e19e7d947 is up-to-date)
strongswan-epdg: getting head from git remote for master
strongswan-epdg: getting OBS version
strongswan-epdg: skipping (961bace455bb7fc3615a8ed4ddf6434e2d54820d is up-to-date)
neocon: getting head from git remote for master
ERROR: command failed unexpectedly
*** command ***
['git', 'ls-remote', 'https://github.com/laf0rge/neocon', 'heads/master']
*** returncode ***
128
*** output ***
fatal: unable to access 'https://github.com/laf0rge/neocon/': The requested URL returned error: 502
*** python trace ***
Traceback (most recent call last):
File "/obs/update_obs_project.py", line 265, in <module>
main()
~~~~^^
File "/obs/update_obs_project.py", line 259, in main
build_srcpkgs(pkgs_remote, packages)
~~~~~~~~~~~~~^^^^^^^^^^^^^^^^^^^^^^^
File "/obs/update_obs_project.py", line 151, in build_srcpkgs
build_srcpkg_if_needed(pkgs_remote, package, False)
~~~~~~~~~~~~~~~~~~~~~~^^^^^^^^^^^^^^^^^^^^^^^^^^^^^
File "/obs/update_obs_project.py", line 97, in build_srcpkg_if_needed
latest_version = lib.git.get_head_remote(package, branch,
branch_missing_ok=delete)
File "/obs/lib/git.py", line 99, in get_head_remote
ls_remote = lib.run_cmd(["git", "ls-remote", repo_url, f"heads/{branch}"])
File "/obs/lib/__init__.py", line 202, in run_cmd
exit_error_cmd(p, "command failed unexpectedly")
~~~~~~~~~~~~~~^^^^^^^^^^^^^^^^^^^^^^^^^^^^^^^^^^
File "/obs/lib/__init__.py", line 163, in exit_error_cmd
raise RuntimeError("shell command related error, find details right above"
" this python trace")
RuntimeError: shell command related error, find details right above this python trace
Build step 'Execute shell' marked build as failure