------------------------------------------ [...truncated 368.62 KB...] XRef to nonexistent id: bsc_interbsc_ho_out:stopped Error: no ID for constraint linkend: bsc_interbsc_ho_out:timeout. XRef to nonexistent id: bsc_interbsc_ho_out:timeout Error: no ID for constraint linkend: bsc_interbsc_ho_out:error. XRef to nonexistent id: bsc_interbsc_ho_out:error Error: no ID for constraint linkend: bsc_interbsc_ho_in:attempted. XRef to nonexistent id: bsc_interbsc_ho_in:attempted Error: no ID for constraint linkend: bsc_interbsc_ho_in:completed. XRef to nonexistent id: bsc_interbsc_ho_in:completed Error: no ID for constraint linkend: bsc_interbsc_ho_in:stopped. XRef to nonexistent id: bsc_interbsc_ho_in:stopped Error: no ID for constraint linkend: bsc_interbsc_ho_in:no_channel. XRef to nonexistent id: bsc_interbsc_ho_in:no_channel Error: no ID for constraint linkend: bsc_interbsc_ho_in:failed. XRef to nonexistent id: bsc_interbsc_ho_in:failed Error: no ID for constraint linkend: bsc_interbsc_ho_in:timeout. XRef to nonexistent id: bsc_interbsc_ho_in:timeout Error: no ID for constraint linkend: bsc_interbsc_ho_in:error. XRef to nonexistent id: bsc_interbsc_ho_in:error Error: no ID for constraint linkend: bsc_paging:attempted. XRef to nonexistent id: bsc_paging:attempted Error: no ID for constraint linkend: bsc_paging:detached. XRef to nonexistent id: bsc_paging:detached Error: no ID for constraint linkend: bsc_paging:responded. XRef to nonexistent id: bsc_paging:responded Error: no ID for constraint linkend: bsc_abis:unknown_unit_id. XRef to nonexistent id: bsc_abis:unknown_unit_id Error: no ID for constraint linkend: bts_chanloadavg. XRef to nonexistent id: bts_chanloadavg Error: no ID for constraint linkend: bts_T3122. XRef to nonexistent id: bts_T3122 Error: no ID for constraint linkend: bts_rach_busy. XRef to nonexistent id: bts_rach_busy Error: no ID for constraint linkend: bts_rach_access. XRef to nonexistent id: bts_rach_access Error: no ID for constraint linkend: bts_chanloadavg. XRef to nonexistent id: bts_chanloadavg Error: no ID for constraint linkend: bts_T3122. XRef to nonexistent id: bts_T3122 Error: no ID for constraint linkend: bts_rach_busy. XRef to nonexistent id: bts_rach_busy Error: no ID for constraint linkend: bts_rach_access. XRef to nonexistent id: bts_rach_access Error: no ID for constraint linkend: bts_chanloadavg. XRef to nonexistent id: bts_chanloadavg Error: no ID for constraint linkend: bts_T3122. XRef to nonexistent id: bts_T3122 Error: no ID for constraint linkend: bts_rach_busy. XRef to nonexistent id: bts_rach_busy Error: no ID for constraint linkend: bts_rach_access. XRef to nonexistent id: bts_rach_access Error: no ID for constraint linkend: ctrl_common_var. XRef to nonexistent id: ctrl_common_var Error: no ID for constraint linkend: ietf-rfc791. XRef to nonexistent id: ietf-rfc791 Section level > 6 not well supported for bibliodiv Error: no ID for constraint linkend: modified-vesion. XRef to nonexistent id: modified-vesion Image 'dblatex' not found Cannot convert 'osmobsc-usermanual__1.png' to pdf Cannot convert 'osmobsc-usermanual__2.png' to pdf Cannot convert './common/images/wireshark-gsmtap-log.png' to pdf Cannot convert 'osmobsc-usermanual__3.png' to pdf Cannot convert 'osmobsc-usermanual__4.png' to pdf Cannot convert 'osmobsc-usermanual__5.png' to pdf Cannot convert 'osmobsc-usermanual__6.png' to pdf Cannot convert 'osmobsc-usermanual__7.png' to pdf Cannot convert 'osmobsc-usermanual__8.png' to pdf Cannot convert 'osmobsc-usermanual__9.png' to pdf Cannot convert 'osmobsc-usermanual__10.png' to pdf Cannot convert 'osmobsc-usermanual__11.png' to pdf Cannot convert 'osmobsc-usermanual__12.png' to pdf Cannot convert 'osmobsc-usermanual__13.png' to pdf Cannot convert 'osmobsc-usermanual__14.png' to pdf Cannot convert 'osmobsc-usermanual__15.png' to pdf Cannot convert 'osmobsc-usermanual__16.png' to pdf Cannot convert 'osmobsc-usermanual__17.png' to pdf Build osmobsc-usermanual.pdf built-in module pdftex registered no support found for ifthen no support found for ifxetex no support found for fontspec no support found for xltxtra no support found for fontenc no support found for inputenc no support found for fancybox built-in module makeidx registered no support found for custom-dblatex built-in module bibtopic registered building additional files... checking if compiling is necessary... the output file doesn't exist pdflatex -interaction=batchmode osmobsc-usermanual.tex running post-compilation scripts... [index] the index file /tmp/tmpwIdoHb/osmobsc-usermanual.idx is empty osmobsc-usermanual.aux MD5 checksum changed osmobsc-usermanual.toc MD5 checksum changed the /tmp/tmpwIdoHb/osmobsc-usermanual.aux file has changed pdflatex -interaction=batchmode osmobsc-usermanual.tex running post-compilation scripts... [index] the index file /tmp/tmpwIdoHb/osmobsc-usermanual.idx is empty no new compilation is needed running last-compilation scripts... 'osmobsc-usermanual.pdf' successfully built
a2x: deleting /build/doc/manuals/osmobsc-usermanual.xml Build osmobsc-vty-reference.pdf 'osmobsc-vty-reference.pdf' successfully built make[3]: Leaving directory '/build/doc/manuals' make[3]: Entering directory '/build/doc' make[3]: Nothing to be done for 'all-am'. make[3]: Leaving directory '/build/doc' make[2]: Leaving directory '/build/doc' Making all in include make[2]: Entering directory '/build/include' Making all in osmocom make[3]: Entering directory '/build/include/osmocom' Making all in bsc make[4]: Entering directory '/build/include/osmocom/bsc' make[4]: Nothing to be done for 'all'. make[4]: Leaving directory '/build/include/osmocom/bsc' make[4]: Entering directory '/build/include/osmocom' make[4]: Nothing to be done for 'all-am'. make[4]: Leaving directory '/build/include/osmocom' make[3]: Leaving directory '/build/include/osmocom' make[3]: Entering directory '/build/include' make[3]: Nothing to be done for 'all-am'. make[3]: Leaving directory '/build/include' make[2]: Leaving directory '/build/include' Making all in src make[2]: Entering directory '/build/src' Making all in libfilter make[3]: Entering directory '/build/src/libfilter' CC bsc_msg_acc.o CC bsc_msg_vty.o CC bsc_msg_filter.o AR libfilter.a ar: `u' modifier ignored since `D' is the default (see `U') make[3]: Leaving directory '/build/src/libfilter' Making all in osmo-bsc make[3]: Entering directory '/build/src/osmo-bsc' CC a_reset.o CC abis_nm_vty.o CC abis_om2000_vty.o CC abis_nm.o CC abis_rsl.o CC abis_om2000.o CC arfcn_range_encode.o CC acc_ramp.o CC assignment_fsm.o CC bsc_ctrl_commands.o CC bsc_ctrl_lookup.o CC bsc_init.o CC bsc_rf_ctrl.o CC bsc_rll.o CC bsc_subscr_conn_fsm.o CC bsc_subscriber.o CC bsc_vty.o CC bts_ericsson_rbs2000.o CC bts_init.o CC bts_ipaccess_nanobts.o CC bts_ipaccess_nanobts_omlattr.o CC bts_nokia_site.o CC bts_siemens_bs11.o CC bts_sysmobts.o CC bts_unknown.o CC chan_alloc.o CC codec_pref.o CC e1_config.o CC gsm_04_08_rr.o CC gsm_04_80_utils.o gsm_04_80_utils.c: In function ‘bsc_send_ussd_release_complete’: gsm_04_80_utils.c:37:9: warning: ‘gsm0480_create_ussd_release_complete’ is deprecated: Use gsm0480_create_release_complete() instead. [-Wdeprecated-declarations] struct msgb *msg = gsm0480_create_ussd_release_complete(); ^~~~ In file included from gsm_04_80_utils.c:22:0: /build/deps/install/stow/libosmocore/include/osmocom/gsm/gsm0480.h:120:14: note: declared here struct msgb *gsm0480_create_ussd_release_complete(void) ^~~~~~~~~~~~~~~~~~~~~~~~~~~~~~~~~~~~ CC gsm_data.o CC handover_cfg.o CC handover_decision.o CC handover_decision_2.o CC handover_fsm.o CC handover_logic.o CC handover_vty.o CC lchan_fsm.o CC lchan_rtp_fsm.o CC lchan_select.o CC meas_feed.o CC meas_rep.o CC neighbor_ident.o CC neighbor_ident_vty.o CC net_init.o CC gsm_08_08.o CC osmo_bsc_bssap.o CC osmo_bsc_ctrl.o CC osmo_bsc_grace.o CC osmo_bsc_filter.o CC osmo_bsc_lcls.o CC osmo_bsc_main.o CC osmo_bsc_mgcp.o CC osmo_bsc_msc.o CC osmo_bsc_sigtran.o CC osmo_bsc_vty.o CC paging.o CC pcu_sock.o CC penalty_timers.o pcu_sock.c: In function ‘pcu_tx_info_ind’: pcu_sock.c:182:2: warning: #warning "isn't dl_tbf_ext wrong?: * 10 and no ntohs" [-Wcpp] #warning "isn't dl_tbf_ext wrong?: * 10 and no ntohs" ^~~~~~~ pcu_sock.c:184:2: warning: #warning "isn't ul_tbf_ext wrong?: * 10 and no ntohs" [-Wcpp] #warning "isn't ul_tbf_ext wrong?: * 10 and no ntohs" ^~~~~~~ CC rest_octets.o CC system_information.o CC timeslot_fsm.o CC smscb.o CC cbch_scheduler.o CC cbsp_link.o CCLD osmo-bsc make[3]: Leaving directory '/build/src/osmo-bsc' Making all in utils make[3]: Entering directory '/build/src/utils' CC bs11_config.o CC osmo_meas_udp2db-meas_udp2db.o CC osmo_meas_pcap2db-meas_pcap2db.o CC osmo_meas_pcap2db-meas_db.o CC osmo_meas_udp2db-meas_db.o CC isdnsync.o CC meas_json-meas_json.o CCLD isdnsync CCLD meas_json CCLD osmo-meas-udp2db Makefile:608: recipe for target 'osmo-meas-udp2db' failed make[3]: *** [osmo-meas-udp2db] Illegal instruction (core dumped) make[3]: *** Waiting for unfinished jobs.... make[3]: Leaving directory '/build/src/utils' Makefile:405: recipe for target 'all-recursive' failed make[2]: *** [all-recursive] Error 1 make[2]: Leaving directory '/build/src' Makefile:448: recipe for target 'all-recursive' failed make[1]: *** [all-recursive] Error 1 make[1]: Leaving directory '/build' Makefile:380: recipe for target 'all' failed make: *** [all] Error 2 Build step 'Execute shell' marked build as failure [WARNINGS]Skipping publisher since build result is FAILURE
------------------------------------------ [...truncated 42.67 KB...] config.status: creating libosmocodec.pc config.status: creating libosmocoding.pc config.status: creating libosmovty.pc config.status: creating libosmogsm.pc config.status: creating libosmogb.pc config.status: creating libosmoctrl.pc config.status: creating libosmosim.pc config.status: creating include/Makefile config.status: creating src/Makefile config.status: creating src/vty/Makefile config.status: creating src/codec/Makefile config.status: creating src/coding/Makefile config.status: creating src/sim/Makefile config.status: creating src/gsm/Makefile config.status: creating src/gb/Makefile config.status: creating src/ctrl/Makefile config.status: creating src/pseudotalloc/Makefile config.status: creating tests/Makefile config.status: creating tests/atlocal config.status: creating utils/Makefile config.status: creating Doxyfile.core config.status: creating Doxyfile.gsm config.status: creating Doxyfile.vty config.status: creating Doxyfile.codec config.status: creating Doxyfile.coding config.status: creating Doxyfile.gb config.status: creating Doxyfile.ctrl config.status: creating Makefile config.status: creating config.h config.status: executing tests/atconfig commands config.status: executing depfiles commands config.status: executing libtool commands configure: WARNING: unrecognized options: --with-systemdsystemunitdir + [ -n ] + make -j 8 install echo 1.2.0.48-80c8a > .version-t && mv .version-t .version make install-recursive make[1]: Entering directory '/build/deps/libosmocore' Making install in include make[2]: Entering directory '/build/deps/libosmocore/include' GEN osmocom/gsm/gsm0503.h Generating header file... Generate 'xcch' declaration Generate 'rach' declaration Generate 'rach_ext' declaration Generate 'sch' declaration Generate 'cs2' declaration Generate 'cs3' declaration Generate 'cs2_np' declaration Generate 'cs3_np' declaration Generate 'tch_afs_12_2' declaration Generate 'tch_afs_10_2' declaration Generate 'tch_afs_7_95' declaration Generate 'tch_afs_7_4' declaration Generate 'tch_afs_6_7' declaration Generate 'tch_afs_5_9' declaration Generate 'tch_afs_5_15' declaration Generate 'tch_afs_4_75' declaration Generate 'tch_fr' declaration Generate 'tch_hr' declaration Generate 'tch_ahs_7_95' declaration Generate 'tch_ahs_7_4' declaration Generate 'tch_ahs_6_7' declaration Generate 'tch_ahs_5_9' declaration Generate 'tch_ahs_5_15' declaration Generate 'tch_ahs_4_75' declaration Generate 'mcs1_dl_hdr' declaration Generate 'mcs1_ul_hdr' declaration Generate 'mcs1' declaration Generate 'mcs2' declaration Generate 'mcs3' declaration Generate 'mcs4' declaration Generate 'mcs5_dl_hdr' declaration Generate 'mcs5_ul_hdr' declaration Generate 'mcs5' declaration Generate 'mcs6' declaration Generate 'mcs7_dl_hdr' declaration Generate 'mcs7_ul_hdr' declaration Generate 'mcs7' declaration Generate 'mcs8' declaration Generate 'mcs9' declaration Generation complete. make install-am make[3]: Entering directory '/build/deps/libosmocore/include' GEN osmocom/core/bit32gen.h GEN osmocom/core/bit16gen.h GEN osmocom/core/bit64gen.h GEN osmocom/core/crc8gen.h GEN osmocom/core/crc32gen.h GEN osmocom/core/crc64gen.h GEN osmocom/core/bit16gen.h GEN osmocom/core/crc16gen.h GEN osmocom/core/crc8gen.h GEN osmocom/core/bit32gen.h GEN osmocom/core/bit64gen.h GEN osmocom/core/crc32gen.h GEN osmocom/core/crc64gen.h GEN osmocom/core/crc16gen.h make[4]: Entering directory '/build/deps/libosmocore/include' make[4]: Nothing to be done for 'install-exec-am'. /bin/mkdir -p '/build/deps/install/stow/libosmocore/include' /bin/mkdir -p '/build/deps/install/stow/libosmocore/include/osmocom/core' /usr/bin/install -c -m 644 osmocom/core/application.h osmocom/core/backtrace.h osmocom/core/bit16gen.h osmocom/core/bit32gen.h osmocom/core/bit64gen.h osmocom/core/bits.h osmocom/core/bitvec.h osmocom/core/bitcomp.h osmocom/core/byteswap.h osmocom/core/conv.h osmocom/core/counter.h osmocom/core/crc16.h osmocom/core/crc16gen.h osmocom/core/crc32gen.h osmocom/core/crc64gen.h osmocom/core/crc8gen.h osmocom/core/crcgen.h osmocom/core/endian.h osmocom/core/defs.h osmocom/core/fsm.h osmocom/core/gsmtap.h osmocom/core/gsmtap_util.h osmocom/core/isdnhdlc.h osmocom/core/linuxlist.h osmocom/core/linuxrbtree.h osmocom/core/logging.h osmocom/core/loggingrb.h osmocom/core/stats.h osmocom/core/macaddr.h osmocom/core/msgb.h osmocom/core/panic.h osmocom/core/prbs.h osmocom/core/prim.h osmocom/core/process.h osmocom/core/rate_ctr.h osmocom/core/stat_item.h osmocom/core/select.h osmocom/core/sercomm.h osmocom/core/signal.h osmocom/core/socket.h '/build/deps/install/stow/libosmocore/include/osmocom/core' /bin/mkdir -p '/build/deps/install/stow/libosmocore/include/osmocom/gsm' /usr/bin/install -c -m 644 osmocom/gsm/a5.h osmocom/gsm/abis_nm.h osmocom/gsm/apn.h osmocom/gsm/bts_features.h osmocom/gsm/cbsp.h osmocom/gsm/comp128.h osmocom/gsm/comp128v23.h osmocom/gsm/bitvec_gsm.h osmocom/gsm/gan.h osmocom/gsm/gsm0341.h osmocom/gsm/gsm0411_smc.h osmocom/gsm/gsm0411_smr.h osmocom/gsm/gsm0411_utils.h osmocom/gsm/gsm0480.h osmocom/gsm/gsm0502.h osmocom/gsm/gsm0503.h osmocom/gsm/gsm0808.h osmocom/gsm/gsm29205.h osmocom/gsm/gsm0808_utils.h osmocom/gsm/gsm23003.h osmocom/gsm/gsm29118.h osmocom/gsm/gsm48.h osmocom/gsm/gsm48_arfcn_range_encode.h osmocom/gsm/gsm48_ie.h osmocom/gsm/gsm48_rest_octets.h osmocom/gsm/gsm_utils.h osmocom/gsm/gsup.h osmocom/gsm/gsup_sms.h osmocom/gsm/ipa.h osmocom/gsm/lapd_core.h osmocom/gsm/lapdm.h osmocom/gsm/meas_rep.h osmocom/gsm/mncc.h osmocom/gsm/prim.h osmocom/gsm/l1sap.h osmocom/gsm/oap.h osmocom/gsm/oap_client.h osmocom/gsm/rsl.h osmocom/gsm/rxlev_stat.h osmocom/gsm/sysinfo.h '/build/deps/install/stow/libosmocore/include/osmocom/gsm' /bin/mkdir -p '/build/deps/install/stow/libosmocore/include/osmocom/coding' /usr/bin/install -c -m 644 osmocom/coding/gsm0503_tables.h osmocom/coding/gsm0503_parity.h osmocom/coding/gsm0503_mapping.h osmocom/coding/gsm0503_interleaving.h osmocom/coding/gsm0503_coding.h '/build/deps/install/stow/libosmocore/include/osmocom/coding' /bin/mkdir -p '/build/deps/install/stow/libosmocore/include/osmocom/core' /usr/bin/install -c -m 644 osmocom/core/statistics.h osmocom/core/strrb.h osmocom/core/talloc.h osmocom/core/tdef.h osmocom/core/timer.h osmocom/core/timer_compat.h osmocom/core/utils.h osmocom/core/write_queue.h osmocom/core/sockaddr_str.h osmocom/core/use_count.h osmocom/core/plugin.h osmocom/core/msgfile.h osmocom/core/serial.h '/build/deps/install/stow/libosmocore/include/osmocom/core' /bin/mkdir -p '/build/deps/install/stow/libosmocore/include/osmocom/vty' /usr/bin/install -c -m 644 osmocom/vty/buffer.h osmocom/vty/command.h osmocom/vty/logging.h osmocom/vty/stats.h osmocom/vty/misc.h osmocom/vty/telnet_interface.h osmocom/vty/vector.h osmocom/vty/vty.h osmocom/vty/ports.h osmocom/vty/tdef_vty.h '/build/deps/install/stow/libosmocore/include/osmocom/vty' /bin/mkdir -p '/build/deps/install/stow/libosmocore/include/osmocom/gsm/protocol' /usr/bin/install -c -m 644 osmocom/gsm/protocol/gsm_03_40.h osmocom/gsm/protocol/gsm_03_41.h osmocom/gsm/protocol/gsm_04_08.h osmocom/gsm/protocol/gsm_04_08_gprs.h osmocom/gsm/protocol/gsm_04_11.h osmocom/gsm/protocol/gsm_04_12.h osmocom/gsm/protocol/gsm_04_14.h osmocom/gsm/protocol/gsm_04_80.h osmocom/gsm/protocol/gsm_08_08.h osmocom/gsm/protocol/gsm_08_58.h osmocom/gsm/protocol/gsm_09_02.h osmocom/gsm/protocol/gsm_12_21.h osmocom/gsm/protocol/gsm_23_003.h osmocom/gsm/protocol/gsm_23_041.h osmocom/gsm/protocol/gsm_29_118.h osmocom/gsm/protocol/gsm_44_318.h osmocom/gsm/protocol/gsm_48_049.h osmocom/gsm/protocol/ipaccess.h osmocom/gsm/protocol/smpp34_osmocom.h '/build/deps/install/stow/libosmocore/include/osmocom/gsm/protocol' /bin/mkdir -p '/build/deps/install/stow/libosmocore/include/osmocom/sim' /usr/bin/install -c -m 644 osmocom/sim/class_tables.h osmocom/sim/sim.h '/build/deps/install/stow/libosmocore/include/osmocom/sim' /bin/mkdir -p '/build/deps/install/stow/libosmocore/include/osmocom/gprs' /usr/bin/install -c -m 644 osmocom/gprs/gprs_bssgp.h osmocom/gprs/gprs_bssgp_bss.h osmocom/gprs/gprs_msgb.h osmocom/gprs/gprs_ns.h osmocom/gprs/gprs_ns_frgre.h osmocom/gprs/gprs_rlc.h '/build/deps/install/stow/libosmocore/include/osmocom/gprs' /bin/mkdir -p '/build/deps/install/stow/libosmocore/include/osmocom/crypt' /usr/bin/install -c -m 644 osmocom/crypt/auth.h osmocom/crypt/gprs_cipher.h '/build/deps/install/stow/libosmocore/include/osmocom/crypt' /bin/mkdir -p '/build/deps/install/stow/libosmocore/include/osmocom/gsm' /usr/bin/install -c -m 644 osmocom/gsm/tlv.h '/build/deps/install/stow/libosmocore/include/osmocom/gsm' /bin/mkdir -p '/build/deps/install/stow/libosmocore/include/osmocom/ctrl' /usr/bin/install -c -m 644 osmocom/ctrl/control_cmd.h osmocom/ctrl/control_if.h osmocom/ctrl/ports.h osmocom/ctrl/control_vty.h '/build/deps/install/stow/libosmocore/include/osmocom/ctrl' /bin/mkdir -p '/build/deps/install/stow/libosmocore/include/osmocom/gprs/protocol' /usr/bin/install -c -m 644 osmocom/gprs/protocol/gsm_04_60.h osmocom/gprs/protocol/gsm_08_16.h osmocom/gprs/protocol/gsm_08_18.h '/build/deps/install/stow/libosmocore/include/osmocom/gprs/protocol' /bin/mkdir -p '/build/deps/install/stow/libosmocore/include/osmocom/codec' /usr/bin/install -c -m 644 osmocom/codec/ecu.h osmocom/codec/codec.h osmocom/codec/gsm610_bits.h '/build/deps/install/stow/libosmocore/include/osmocom/codec' make[4]: Leaving directory '/build/deps/libosmocore/include' make[3]: Leaving directory '/build/deps/libosmocore/include' make[2]: Leaving directory '/build/deps/libosmocore/include' Making install in src make[2]: Entering directory '/build/deps/libosmocore/src' GEN crc32gen.c GEN crc8gen.c GEN crc16gen.c GEN crc64gen.c make install-am make[3]: Entering directory '/build/deps/libosmocore/src' CC timer.lo CC timer_gettimeofday.lo CC context.lo CC timer_clockgettime.lo CC signal.lo CC bits.lo CC select.lo CC msgb.lo CC bitvec.lo CC bitcomp.lo CC counter.lo CC fsm.lo CC write_queue.lo CC utils.lo CC socket.lo CC logging.lo CC logging_syslog.lo CC logging_gsmtap.lo CC rate_ctr.lo CC gsmtap_util.lo CC crc16.lo CC panic.lo CC backtrace.lo CC conv.lo CC application.lo CC rbtree.lo CC strrb.lo CC loggingrb.lo CC crc8gen.lo CC crc16gen.lo CC crc32gen.lo CC crc64gen.lo CC macaddr.lo CC stat_item.lo CC stats.lo CC stats_statsd.lo CC prim.lo CC conv_acc.lo CC conv_acc_generic.lo CC sercomm.lo CC prbs.lo CC isdnhdlc.lo CC tdef.lo CC sockaddr_str.lo CC use_count.lo CC conv_acc_sse.lo CC conv_acc_sse_avx.lo CC plugin.lo CC msgfile.lo CC serial.lo CCLD libosmocore.la make[4]: Entering directory '/build/deps/libosmocore/src' make[4]: Nothing to be done for 'install-data-am'. /bin/mkdir -p '/build/deps/install/stow/libosmocore/lib' /bin/bash ../libtool --mode=install /usr/bin/install -c libosmocore.la '/build/deps/install/stow/libosmocore/lib' libtool: install: /usr/bin/install -c .libs/libosmocore.so.12.2.0 /build/deps/install/stow/libosmocore/lib/libosmocore.so.12.2.0 libtool: install: (cd /build/deps/install/stow/libosmocore/lib && { ln -s -f libosmocore.so.12.2.0 libosmocore.so.12 || { rm -f libosmocore.so.12 && ln -s libosmocore.so.12.2.0 libosmocore.so.12; }; }) libtool: install: (cd /build/deps/install/stow/libosmocore/lib && { ln -s -f libosmocore.so.12.2.0 libosmocore.so || { rm -f libosmocore.so && ln -s libosmocore.so.12.2.0 libosmocore.so; }; }) libtool: install: /usr/bin/install -c .libs/libosmocore.lai /build/deps/install/stow/libosmocore/lib/libosmocore.la libtool: finish: PATH="/usr/local/bin:/usr/bin:/bin:/usr/games:/home/osmocom-build/bin:/build_bin:/sbin" ldconfig -n /build/deps/install/stow/libosmocore/lib ---------------------------------------------------------------------- Libraries have been installed in: /build/deps/install/stow/libosmocore/lib
If you ever happen to want to link against installed libraries in a given directory, LIBDIR, you must either use libtool, and specify the full pathname of the library, or use the '-LLIBDIR' flag during linking and do at least one of the following: - add LIBDIR to the 'LD_LIBRARY_PATH' environment variable during execution - add LIBDIR to the 'LD_RUN_PATH' environment variable during linking - use the '-Wl,-rpath -Wl,LIBDIR' linker flag - have your system administrator add LIBDIR to '/etc/ld.so.conf'
See any operating system documentation about shared libraries for more information, such as the ld(1) and ld.so(8) manual pages. ---------------------------------------------------------------------- make[4]: Leaving directory '/build/deps/libosmocore/src' make[3]: Leaving directory '/build/deps/libosmocore/src' make[2]: Leaving directory '/build/deps/libosmocore/src' Making install in src/vty make[2]: Entering directory '/build/deps/libosmocore/src/vty' CC command.lo CC logging_vty.lo CC vector.lo CC telnet_interface.lo CC stats_vty.lo CC vty.lo CC buffer.lo CC utils.lo /bin/bash: line 2: 5824 Segmentation fault (core dumped) /bin/bash ../../libtool --silent --tag=CC --mode=compile gcc -DHAVE_CONFIG_H -I. -I../.. -I../../include -I../../include -DBUILDING_LIBOSMOCORE -Wall -Wall -g -O2 -DBUILDING_LIBOSMOCORE -Wall -MT buffer.lo -MD -MP -MF $depbase.Tpo -c -o buffer.lo buffer.c make[2]: *** [buffer.lo] Error 139 make[2]: *** Waiting for unfinished jobs.... Makefile:498: recipe for target 'buffer.lo' failed utils.c: In function ‘handle_counter’: utils.c:317:3: warning: ‘osmo_counter_get’ is deprecated: Implement as osmo_stat_item instead [-Wdeprecated-declarations] osmo_counter_get(counter), VTY_NEWLINE); ^~~~~~~~~~~~~~~~ In file included from utils.c:39:0: ../../include/osmocom/core/counter.h:35:29: note: declared here static inline unsigned long osmo_counter_get(struct osmo_counter *ctr) ^~~~~~~~~~~~~~~~ make[2]: Leaving directory '/build/deps/libosmocore/src/vty' Makefile:634: recipe for target 'install-recursive' failed make[1]: Leaving directory '/build/deps/libosmocore' make[1]: *** [install-recursive] Error 1 Makefile:933: recipe for target 'install' failed make: *** [install] Error 2 Build step 'Execute shell' marked build as failure [WARNINGS]Skipping publisher since build result is FAILURE
jenkins-notifications@lists.osmocom.org