See https://jenkins.osmocom.org/jenkins/job/Osmocom_OBS_master/93686/display/redirect
Changes:
------------------------------------------ Started by upstream project "master-osmo-e1-hardware" build number 1651 originally caused by: Started by timer Running as SYSTEM Building remotely on build5-deb12build-ansible (ttcn3 obs osmo-gsm-tester-build ttcn3-ggsn-test-kernel-git ttcn3_with_linux_6.1_or_higher qemu io_uring osmocom-gerrit coverity osmocom-master) in workspace https://jenkins.osmocom.org/jenkins/job/Osmocom_OBS_master/ws/ The recommended git tool is: NONE No credentials specified Wiping out workspace first. Cloning the remote Git repository Cloning repository https://gerrit.osmocom.org/osmo-ci
git init https://jenkins.osmocom.org/jenkins/job/Osmocom_OBS_master/ws/ # timeout=10
Fetching upstream changes from https://gerrit.osmocom.org/osmo-ci
git --version # timeout=10 git --version # 'git version 2.39.5' git fetch --tags --force --progress -- https://gerrit.osmocom.org/osmo-ci +refs/heads/*:refs/remotes/origin/* # timeout=10 git config remote.origin.url https://gerrit.osmocom.org/osmo-ci # timeout=10 git config --add remote.origin.fetch +refs/heads/*:refs/remotes/origin/* # timeout=10
Avoid second fetch
git rev-parse refs/remotes/origin/refs/remotes/origin/master^{commit} # timeout=10 git rev-parse refs/remotes/origin/master^{commit} # timeout=10
Checking out Revision 9a18ebaa78fc255a0aea42186a2743829d69162e (refs/remotes/origin/master)
git config core.sparsecheckout # timeout=10 git checkout -f 9a18ebaa78fc255a0aea42186a2743829d69162e # timeout=10
Commit message: "obs: gerrit_binpkgs: set --allow-unknown-package"
git rev-list --no-walk 9a18ebaa78fc255a0aea42186a2743829d69162e # timeout=10
[Osmocom_OBS_master] $ /bin/sh -xe /tmp/jenkins16306027691586856814.sh + export PYTHONUNBUFFERED=1 + ./scripts/obs/update_obs_project.py --apiurl https://obs.osmocom.org --conflict-version --docker --feed master --meta osmocom:master docker: building image debian-12-osmocom-obs-build-srcpkg + run_in_docker_and_exit(): ['docker', 'build', '--build-arg', 'DISTRO=debian:12', '--build-arg', 'DISTRO_FROM=debian:12', '--build-arg', 'UID=1000', '-t', 'debian-12-osmocom-obs-build-srcpkg', '-f', 'https://jenkins.osmocom.org/jenkins/job/Osmocom_OBS_master/ws/scripts/obs/data/build_srcpkg.Dockerfile', 'https://jenkins.osmocom.org/jenkins/job/Osmocom_OBS_master/ws/scripts/obs/data'] #0 building with "default" instance using docker driver
#1 [internal] load build definition from build_srcpkg.Dockerfile #1 transferring dockerfile: 579B done #1 WARN: InvalidDefaultArgInFrom: Default value for ARG ${DISTRO_FROM} results in empty or invalid base image name (line 3) #1 DONE 0.0s
#2 [internal] load metadata for docker.io/library/debian:12 #2 DONE 0.8s
#3 [internal] load .dockerignore #3 transferring context: 2B done #3 DONE 0.0s
#4 [1/3] FROM docker.io/library/debian:12@sha256:18023f131f52fc3ea21973cabffe0b216c60b417fd2478e94d9d59981ebba6af #4 resolve docker.io/library/debian:12@sha256:18023f131f52fc3ea21973cabffe0b216c60b417fd2478e94d9d59981ebba6af 0.0s done #4 DONE 0.0s
#5 [2/3] RUN APT-GET update && apt-get upgrade -y && apt-get install -y --no-install-recommends ca-certificates colordiff debhelper dh-python dpkg-dev fakeroot git git-review gnupg2 libxml2-utils lsb-release meson osc python3-packaging python3-setuptools quilt rebar3 sed sphinx-common && apt-get clean #5 CACHED
#6 [3/3] RUN USERADD --uid=1000 -m user #6 CACHED
#7 exporting to image #7 exporting layers done #7 writing image sha256:bc6a5998c69e89ffa8b1575b367bf8e7e099cfb23989f67da73b87732b6acf83 0.0s done #7 naming to docker.io/library/debian-12-osmocom-obs-build-srcpkg done #7 DONE 0.0s
[33m1 warning found (use docker --debug to expand): [0m - InvalidDefaultArgInFrom: Default value for ARG ${DISTRO_FROM} results in empty or invalid base image name (line 3) docker: running: update_obs_project.py inside docker OBS: getting packages in osmocom:master
ERROR: command failed unexpectedly
*** command *** ['osc', '-A', 'https://obs.osmocom.org', 'list', 'osmocom:master']
*** returncode *** 1
*** output *** Server returned an error: HTTP Error 504: Gateway Time-out
Request: https://obs.osmocom.org/source/osmocom:master Headers: Server: nginx Date: Fri, 04 Apr 2025 02:07:22 GMT Content-Type: text/html Content-Length: 160 Connection: close
*** python trace *** Traceback (most recent call last): File "/obs/update_obs_project.py", line 265, in <module> main() File "/obs/update_obs_project.py", line 257, in main pkgs_remote = lib.osc.get_remote_pkgs() ^^^^^^^^^^^^^^^^^^^^^^^^^ File "/obs/lib/osc.py", line 63, in get_remote_pkgs ret = run_osc(["list", proj]) ^^^^^^^^^^^^^^^^^^^^^^^ File "/obs/lib/osc.py", line 58, in run_osc return lib.run_cmd(cmd, *args, **kwargs) ^^^^^^^^^^^^^^^^^^^^^^^^^^^^^^^^^ File "/obs/lib/__init__.py", line 200, in run_cmd exit_error_cmd(p, "command failed unexpectedly") File "/obs/lib/__init__.py", line 161, in exit_error_cmd raise RuntimeError("shell command related error, find details right above" RuntimeError: shell command related error, find details right above this python trace Build step 'Execute shell' marked build as failure
See https://jenkins.osmocom.org/jenkins/job/Osmocom_OBS_master/93687/display/redirect
Changes:
------------------------------------------ Started by upstream project "master-osmo-epdg" build number 614 originally caused by: Started by timer Running as SYSTEM Building remotely on build4-deb12build-ansible (ttcn3 obs osmo-gsm-tester-build ttcn3_with_linux_6.1_or_higher qemu io_uring osmocom-gerrit coverity osmocom-master) in workspace https://jenkins.osmocom.org/jenkins/job/Osmocom_OBS_master/ws/ The recommended git tool is: NONE No credentials specified Wiping out workspace first. Cloning the remote Git repository Cloning repository https://gerrit.osmocom.org/osmo-ci
git init https://jenkins.osmocom.org/jenkins/job/Osmocom_OBS_master/ws/ # timeout=10
Fetching upstream changes from https://gerrit.osmocom.org/osmo-ci
git --version # timeout=10 git --version # 'git version 2.39.5' git fetch --tags --force --progress -- https://gerrit.osmocom.org/osmo-ci +refs/heads/*:refs/remotes/origin/* # timeout=10 git config remote.origin.url https://gerrit.osmocom.org/osmo-ci # timeout=10 git config --add remote.origin.fetch +refs/heads/*:refs/remotes/origin/* # timeout=10
Avoid second fetch
git rev-parse refs/remotes/origin/refs/remotes/origin/master^{commit} # timeout=10 git rev-parse refs/remotes/origin/master^{commit} # timeout=10
Checking out Revision 9a18ebaa78fc255a0aea42186a2743829d69162e (refs/remotes/origin/master)
git config core.sparsecheckout # timeout=10 git checkout -f 9a18ebaa78fc255a0aea42186a2743829d69162e # timeout=10
Commit message: "obs: gerrit_binpkgs: set --allow-unknown-package"
git rev-list --no-walk 9a18ebaa78fc255a0aea42186a2743829d69162e # timeout=10
[Osmocom_OBS_master] $ /bin/sh -xe /tmp/jenkins5576722248822530145.sh + export PYTHONUNBUFFERED=1 + ./scripts/obs/update_obs_project.py --apiurl https://obs.osmocom.org --conflict-version --docker --feed master --meta osmocom:master docker: building image debian-12-osmocom-obs-build-srcpkg + run_in_docker_and_exit(): ['docker', 'build', '--build-arg', 'DISTRO=debian:12', '--build-arg', 'DISTRO_FROM=debian:12', '--build-arg', 'UID=1000', '-t', 'debian-12-osmocom-obs-build-srcpkg', '-f', 'https://jenkins.osmocom.org/jenkins/job/Osmocom_OBS_master/ws/scripts/obs/data/build_srcpkg.Dockerfile', 'https://jenkins.osmocom.org/jenkins/job/Osmocom_OBS_master/ws/scripts/obs/data'] #0 building with "default" instance using docker driver
#1 [internal] load build definition from build_srcpkg.Dockerfile #1 transferring dockerfile: 579B done #1 WARN: InvalidDefaultArgInFrom: Default value for ARG ${DISTRO_FROM} results in empty or invalid base image name (line 3) #1 DONE 0.0s
#2 [internal] load metadata for docker.io/library/debian:12 #2 DONE 0.9s
#3 [internal] load .dockerignore #3 transferring context: 2B done #3 DONE 0.0s
#4 [1/3] FROM docker.io/library/debian:12@sha256:18023f131f52fc3ea21973cabffe0b216c60b417fd2478e94d9d59981ebba6af #4 DONE 0.0s
#5 [2/3] RUN APT-GET update && apt-get upgrade -y && apt-get install -y --no-install-recommends ca-certificates colordiff debhelper dh-python dpkg-dev fakeroot git git-review gnupg2 libxml2-utils lsb-release meson osc python3-packaging python3-setuptools quilt rebar3 sed sphinx-common && apt-get clean #5 CACHED
#6 [3/3] RUN USERADD --uid=1000 -m user #6 CACHED
#7 exporting to image #7 exporting layers done #7 writing image sha256:2a9dd95b35028e4d71315e59c45ba43dc43f920d55d8b4980b221443515a5cd4 0.0s done #7 naming to docker.io/library/debian-12-osmocom-obs-build-srcpkg 0.0s done #7 DONE 0.0s
[33m1 warning found (use docker --debug to expand): [0m - InvalidDefaultArgInFrom: Default value for ARG ${DISTRO_FROM} results in empty or invalid base image name (line 3) docker: running: update_obs_project.py inside docker OBS: getting packages in osmocom:master Traceback (most recent call last): File "/obs/update_obs_project.py", line 265, in <module> main() File "/obs/update_obs_project.py", line 257, in main pkgs_remote = lib.osc.get_remote_pkgs() ^^^^^^^^^^^^^^^^^^^^^^^^^ File "/obs/lib/osc.py", line 63, in get_remote_pkgs ret = run_osc(["list", proj]) ^^^^^^^^^^^^^^^^^^^^^^^ File "/obs/lib/osc.py", line 58, in run_osc return lib.run_cmd(cmd, *args, **kwargs) ^^^^^^^^^^^^^^^^^^^^^^^^^^^^^^^^^ File "/obs/lib/__init__.py", line 200, in run_cmd
ERROR: command failed unexpectedly
*** command *** ['osc', '-A', 'https://obs.osmocom.org', 'list', 'osmocom:master']
*** returncode *** 1
*** output *** Server returned an error: HTTP Error 504: Gateway Time-out
Request: https://obs.osmocom.org/source/osmocom:master Headers: Server: nginx Date: Fri, 04 Apr 2025 02:12:25 GMT Content-Type: text/html Content-Length: 160 Connection: close
*** python trace *** exit_error_cmd(p, "command failed unexpectedly") File "/obs/lib/__init__.py", line 161, in exit_error_cmd raise RuntimeError("shell command related error, find details right above" RuntimeError: shell command related error, find details right above this python trace Build step 'Execute shell' marked build as failure
See https://jenkins.osmocom.org/jenkins/job/Osmocom_OBS_master/93688/display/redirect
Changes:
------------------------------------------ Started by upstream project "master-pyosmocom" build number 242 originally caused by: Started by timer Running as SYSTEM Building remotely on build4-deb12build-ansible (ttcn3 obs osmo-gsm-tester-build ttcn3_with_linux_6.1_or_higher qemu io_uring osmocom-gerrit coverity osmocom-master) in workspace https://jenkins.osmocom.org/jenkins/job/Osmocom_OBS_master/ws/ The recommended git tool is: NONE No credentials specified Wiping out workspace first. Cloning the remote Git repository Cloning repository https://gerrit.osmocom.org/osmo-ci
git init https://jenkins.osmocom.org/jenkins/job/Osmocom_OBS_master/ws/ # timeout=10
Fetching upstream changes from https://gerrit.osmocom.org/osmo-ci
git --version # timeout=10 git --version # 'git version 2.39.5' git fetch --tags --force --progress -- https://gerrit.osmocom.org/osmo-ci +refs/heads/*:refs/remotes/origin/* # timeout=10 git config remote.origin.url https://gerrit.osmocom.org/osmo-ci # timeout=10 git config --add remote.origin.fetch +refs/heads/*:refs/remotes/origin/* # timeout=10
Avoid second fetch
git rev-parse refs/remotes/origin/refs/remotes/origin/master^{commit} # timeout=10 git rev-parse refs/remotes/origin/master^{commit} # timeout=10
Checking out Revision 9a18ebaa78fc255a0aea42186a2743829d69162e (refs/remotes/origin/master)
git config core.sparsecheckout # timeout=10 git checkout -f 9a18ebaa78fc255a0aea42186a2743829d69162e # timeout=10
Commit message: "obs: gerrit_binpkgs: set --allow-unknown-package"
git rev-list --no-walk 9a18ebaa78fc255a0aea42186a2743829d69162e # timeout=10
[Osmocom_OBS_master] $ /bin/sh -xe /tmp/jenkins9143212760318805823.sh + export PYTHONUNBUFFERED=1 + ./scripts/obs/update_obs_project.py --apiurl https://obs.osmocom.org --conflict-version --docker --feed master --meta osmocom:master docker: building image debian-12-osmocom-obs-build-srcpkg + run_in_docker_and_exit(): ['docker', 'build', '--build-arg', 'DISTRO=debian:12', '--build-arg', 'DISTRO_FROM=debian:12', '--build-arg', 'UID=1000', '-t', 'debian-12-osmocom-obs-build-srcpkg', '-f', 'https://jenkins.osmocom.org/jenkins/job/Osmocom_OBS_master/ws/scripts/obs/data/build_srcpkg.Dockerfile', 'https://jenkins.osmocom.org/jenkins/job/Osmocom_OBS_master/ws/scripts/obs/data'] #0 building with "default" instance using docker driver
#1 [internal] load build definition from build_srcpkg.Dockerfile #1 transferring dockerfile: 579B done #1 WARN: InvalidDefaultArgInFrom: Default value for ARG ${DISTRO_FROM} results in empty or invalid base image name (line 3) #1 DONE 0.0s
#2 [internal] load metadata for docker.io/library/debian:12 #2 DONE 0.8s
#3 [internal] load .dockerignore #3 transferring context: 2B done #3 DONE 0.0s
#4 [1/3] FROM docker.io/library/debian:12@sha256:18023f131f52fc3ea21973cabffe0b216c60b417fd2478e94d9d59981ebba6af #4 DONE 0.0s
#5 [2/3] RUN APT-GET update && apt-get upgrade -y && apt-get install -y --no-install-recommends ca-certificates colordiff debhelper dh-python dpkg-dev fakeroot git git-review gnupg2 libxml2-utils lsb-release meson osc python3-packaging python3-setuptools quilt rebar3 sed sphinx-common && apt-get clean #5 CACHED
#6 [3/3] RUN USERADD --uid=1000 -m user #6 CACHED
#7 exporting to image #7 exporting layers done #7 writing image sha256:2a9dd95b35028e4d71315e59c45ba43dc43f920d55d8b4980b221443515a5cd4 done #7 naming to docker.io/library/debian-12-osmocom-obs-build-srcpkg done #7 DONE 0.0s
[33m1 warning found (use docker --debug to expand): [0m - InvalidDefaultArgInFrom: Default value for ARG ${DISTRO_FROM} results in empty or invalid base image name (line 3) docker: running: update_obs_project.py inside docker OBS: getting packages in osmocom:master Traceback (most recent call last): File "/obs/update_obs_project.py", line 265, in <module> main() File "/obs/update_obs_project.py", line 257, in main pkgs_remote = lib.osc.get_remote_pkgs() ^^^^^^^^^^^^^^^^^^^^^^^^^ File "/obs/lib/osc.py", line 63, in get_remote_pkgs
ERROR: command failed unexpectedly
*** command *** ['osc', '-A', 'https://obs.osmocom.org', 'list', 'osmocom:master']
*** returncode *** 1
*** output *** Server returned an error: HTTP Error 503: Service Unavailable
Request: https://obs.osmocom.org/source/osmocom:master Headers: Server: nginx Date: Fri, 04 Apr 2025 02:41:17 GMT Content-Type: text/html; charset=UTF-8 Content-Length: 189 Connection: close cache-control: no-cache, no-store, must-revalidate Status: 503 Service Unavailable Cache-Control: public
*** python trace *** ret = run_osc(["list", proj]) ^^^^^^^^^^^^^^^^^^^^^^^ File "/obs/lib/osc.py", line 58, in run_osc return lib.run_cmd(cmd, *args, **kwargs) ^^^^^^^^^^^^^^^^^^^^^^^^^^^^^^^^^ File "/obs/lib/__init__.py", line 200, in run_cmd exit_error_cmd(p, "command failed unexpectedly") File "/obs/lib/__init__.py", line 161, in exit_error_cmd raise RuntimeError("shell command related error, find details right above" RuntimeError: shell command related error, find details right above this python trace Build step 'Execute shell' marked build as failure
See https://jenkins.osmocom.org/jenkins/job/Osmocom_OBS_master/93689/display/redirect
Changes:
------------------------------------------ Started by upstream project "master-osmo-uecups" build number 1857 originally caused by: Started by timer Running as SYSTEM Building remotely on build4-deb12build-ansible (ttcn3 obs osmo-gsm-tester-build ttcn3_with_linux_6.1_or_higher qemu io_uring osmocom-gerrit coverity osmocom-master) in workspace https://jenkins.osmocom.org/jenkins/job/Osmocom_OBS_master/ws/ The recommended git tool is: NONE No credentials specified Wiping out workspace first. Cloning the remote Git repository Cloning repository https://gerrit.osmocom.org/osmo-ci
git init https://jenkins.osmocom.org/jenkins/job/Osmocom_OBS_master/ws/ # timeout=10
Fetching upstream changes from https://gerrit.osmocom.org/osmo-ci
git --version # timeout=10 git --version # 'git version 2.39.5' git fetch --tags --force --progress -- https://gerrit.osmocom.org/osmo-ci +refs/heads/*:refs/remotes/origin/* # timeout=10 git config remote.origin.url https://gerrit.osmocom.org/osmo-ci # timeout=10 git config --add remote.origin.fetch +refs/heads/*:refs/remotes/origin/* # timeout=10
Avoid second fetch
git rev-parse refs/remotes/origin/refs/remotes/origin/master^{commit} # timeout=10 git rev-parse refs/remotes/origin/master^{commit} # timeout=10
Checking out Revision 9a18ebaa78fc255a0aea42186a2743829d69162e (refs/remotes/origin/master)
git config core.sparsecheckout # timeout=10 git checkout -f 9a18ebaa78fc255a0aea42186a2743829d69162e # timeout=10
Commit message: "obs: gerrit_binpkgs: set --allow-unknown-package"
git rev-list --no-walk 9a18ebaa78fc255a0aea42186a2743829d69162e # timeout=10
[Osmocom_OBS_master] $ /bin/sh -xe /tmp/jenkins1583030020434006956.sh + export PYTHONUNBUFFERED=1 + ./scripts/obs/update_obs_project.py --apiurl https://obs.osmocom.org --conflict-version --docker --feed master --meta osmocom:master docker: building image debian-12-osmocom-obs-build-srcpkg + run_in_docker_and_exit(): ['docker', 'build', '--build-arg', 'DISTRO=debian:12', '--build-arg', 'DISTRO_FROM=debian:12', '--build-arg', 'UID=1000', '-t', 'debian-12-osmocom-obs-build-srcpkg', '-f', 'https://jenkins.osmocom.org/jenkins/job/Osmocom_OBS_master/ws/scripts/obs/data/build_srcpkg.Dockerfile', 'https://jenkins.osmocom.org/jenkins/job/Osmocom_OBS_master/ws/scripts/obs/data'] #0 building with "default" instance using docker driver
#1 [internal] load build definition from build_srcpkg.Dockerfile #1 transferring dockerfile: 579B done #1 WARN: InvalidDefaultArgInFrom: Default value for ARG ${DISTRO_FROM} results in empty or invalid base image name (line 3) #1 DONE 0.0s
#2 [internal] load metadata for docker.io/library/debian:12 #2 DONE 0.8s
#3 [internal] load .dockerignore #3 transferring context: 2B done #3 DONE 0.0s
#4 [1/3] FROM docker.io/library/debian:12@sha256:18023f131f52fc3ea21973cabffe0b216c60b417fd2478e94d9d59981ebba6af #4 DONE 0.0s
#5 [2/3] RUN APT-GET update && apt-get upgrade -y && apt-get install -y --no-install-recommends ca-certificates colordiff debhelper dh-python dpkg-dev fakeroot git git-review gnupg2 libxml2-utils lsb-release meson osc python3-packaging python3-setuptools quilt rebar3 sed sphinx-common && apt-get clean #5 CACHED
#6 [3/3] RUN USERADD --uid=1000 -m user #6 CACHED
#7 exporting to image #7 exporting layers done #7 writing image sha256:2a9dd95b35028e4d71315e59c45ba43dc43f920d55d8b4980b221443515a5cd4 done #7 naming to docker.io/library/debian-12-osmocom-obs-build-srcpkg done #7 DONE 0.0s
[33m1 warning found (use docker --debug to expand): [0m - InvalidDefaultArgInFrom: Default value for ARG ${DISTRO_FROM} results in empty or invalid base image name (line 3) docker: running: update_obs_project.py inside docker OBS: getting packages in osmocom:master
ERROR: command failed unexpectedly
*** command *** ['osc', '-A', 'https://obs.osmocom.org', 'list', 'osmocom:master']
*** returncode *** 1
*** output *** Server returned an error: HTTP Error 503: Service Unavailable
Request: https://obs.osmocom.org/source/osmocom:master Headers: Server: nginx Date: Fri, 04 Apr 2025 02:55:02 GMT Content-Type: text/html; charset=UTF-8 Content-Length: 189 Connection: close cache-control: no-cache, no-store, must-revalidate Status: 503 Service Unavailable Cache-Control: public
*** python trace *** Traceback (most recent call last): File "/obs/update_obs_project.py", line 265, in <module> main() File "/obs/update_obs_project.py", line 257, in main pkgs_remote = lib.osc.get_remote_pkgs() ^^^^^^^^^^^^^^^^^^^^^^^^^ File "/obs/lib/osc.py", line 63, in get_remote_pkgs ret = run_osc(["list", proj]) ^^^^^^^^^^^^^^^^^^^^^^^ File "/obs/lib/osc.py", line 58, in run_osc return lib.run_cmd(cmd, *args, **kwargs) ^^^^^^^^^^^^^^^^^^^^^^^^^^^^^^^^^ File "/obs/lib/__init__.py", line 200, in run_cmd exit_error_cmd(p, "command failed unexpectedly") File "/obs/lib/__init__.py", line 161, in exit_error_cmd raise RuntimeError("shell command related error, find details right above" RuntimeError: shell command related error, find details right above this python trace Build step 'Execute shell' marked build as failure
See https://jenkins.osmocom.org/jenkins/job/Osmocom_OBS_master/93690/display/redirect
Changes:
------------------------------------------ Started by upstream project "master-osmo-sip-connector" build number 6973 originally caused by: Started by timer Running as SYSTEM Building remotely on build4-deb12build-ansible (ttcn3 obs osmo-gsm-tester-build ttcn3_with_linux_6.1_or_higher qemu io_uring osmocom-gerrit coverity osmocom-master) in workspace https://jenkins.osmocom.org/jenkins/job/Osmocom_OBS_master/ws/ The recommended git tool is: NONE No credentials specified Wiping out workspace first. Cloning the remote Git repository Cloning repository https://gerrit.osmocom.org/osmo-ci
git init https://jenkins.osmocom.org/jenkins/job/Osmocom_OBS_master/ws/ # timeout=10
Fetching upstream changes from https://gerrit.osmocom.org/osmo-ci
git --version # timeout=10 git --version # 'git version 2.39.5' git fetch --tags --force --progress -- https://gerrit.osmocom.org/osmo-ci +refs/heads/*:refs/remotes/origin/* # timeout=10 git config remote.origin.url https://gerrit.osmocom.org/osmo-ci # timeout=10 git config --add remote.origin.fetch +refs/heads/*:refs/remotes/origin/* # timeout=10
Avoid second fetch
git rev-parse refs/remotes/origin/refs/remotes/origin/master^{commit} # timeout=10 git rev-parse refs/remotes/origin/master^{commit} # timeout=10
Checking out Revision 9a18ebaa78fc255a0aea42186a2743829d69162e (refs/remotes/origin/master)
git config core.sparsecheckout # timeout=10 git checkout -f 9a18ebaa78fc255a0aea42186a2743829d69162e # timeout=10
Commit message: "obs: gerrit_binpkgs: set --allow-unknown-package"
git rev-list --no-walk 9a18ebaa78fc255a0aea42186a2743829d69162e # timeout=10
[Osmocom_OBS_master] $ /bin/sh -xe /tmp/jenkins2866356642610938204.sh + export PYTHONUNBUFFERED=1 + ./scripts/obs/update_obs_project.py --apiurl https://obs.osmocom.org --conflict-version --docker --feed master --meta osmocom:master docker: building image debian-12-osmocom-obs-build-srcpkg + run_in_docker_and_exit(): ['docker', 'build', '--build-arg', 'DISTRO=debian:12', '--build-arg', 'DISTRO_FROM=debian:12', '--build-arg', 'UID=1000', '-t', 'debian-12-osmocom-obs-build-srcpkg', '-f', 'https://jenkins.osmocom.org/jenkins/job/Osmocom_OBS_master/ws/scripts/obs/data/build_srcpkg.Dockerfile', 'https://jenkins.osmocom.org/jenkins/job/Osmocom_OBS_master/ws/scripts/obs/data'] #0 building with "default" instance using docker driver
#1 [internal] load build definition from build_srcpkg.Dockerfile #1 transferring dockerfile: 579B done #1 WARN: InvalidDefaultArgInFrom: Default value for ARG ${DISTRO_FROM} results in empty or invalid base image name (line 3) #1 DONE 0.1s
#2 [internal] load metadata for docker.io/library/debian:12 #2 DONE 0.9s
#3 [internal] load .dockerignore #3 transferring context: 2B done #3 DONE 0.1s
#4 [1/3] FROM docker.io/library/debian:12@sha256:18023f131f52fc3ea21973cabffe0b216c60b417fd2478e94d9d59981ebba6af #4 DONE 0.0s
#5 [2/3] RUN APT-GET update && apt-get upgrade -y && apt-get install -y --no-install-recommends ca-certificates colordiff debhelper dh-python dpkg-dev fakeroot git git-review gnupg2 libxml2-utils lsb-release meson osc python3-packaging python3-setuptools quilt rebar3 sed sphinx-common && apt-get clean #5 CACHED
#6 [3/3] RUN USERADD --uid=1000 -m user #6 CACHED
#7 exporting to image #7 exporting layers done #7 writing image sha256:2a9dd95b35028e4d71315e59c45ba43dc43f920d55d8b4980b221443515a5cd4 done #7 naming to docker.io/library/debian-12-osmocom-obs-build-srcpkg #7 naming to docker.io/library/debian-12-osmocom-obs-build-srcpkg 0.0s done #7 DONE 0.0s
[33m1 warning found (use docker --debug to expand): [0m - InvalidDefaultArgInFrom: Default value for ARG ${DISTRO_FROM} results in empty or invalid base image name (line 3) docker: running: update_obs_project.py inside docker OBS: getting packages in osmocom:master Traceback (most recent call last): File "/obs/update_obs_project.py", line 265, in <module>
ERROR: command failed unexpectedly
*** command *** ['osc', '-A', 'https://obs.osmocom.org', 'list', 'osmocom:master']
*** returncode *** 1
*** output *** Server returned an error: HTTP Error 503: Service Unavailable
Request: https://obs.osmocom.org/source/osmocom:master Headers: Server: nginx Date: Fri, 04 Apr 2025 03:09:57 GMT Content-Type: text/html; charset=UTF-8 Content-Length: 189 Connection: close cache-control: no-cache, no-store, must-revalidate Status: 503 Service Unavailable Cache-Control: public
*** python trace *** main() File "/obs/update_obs_project.py", line 257, in main pkgs_remote = lib.osc.get_remote_pkgs() ^^^^^^^^^^^^^^^^^^^^^^^^^ File "/obs/lib/osc.py", line 63, in get_remote_pkgs ret = run_osc(["list", proj]) ^^^^^^^^^^^^^^^^^^^^^^^ File "/obs/lib/osc.py", line 58, in run_osc return lib.run_cmd(cmd, *args, **kwargs) ^^^^^^^^^^^^^^^^^^^^^^^^^^^^^^^^^ File "/obs/lib/__init__.py", line 200, in run_cmd exit_error_cmd(p, "command failed unexpectedly") File "/obs/lib/__init__.py", line 161, in exit_error_cmd raise RuntimeError("shell command related error, find details right above" RuntimeError: shell command related error, find details right above this python trace Build step 'Execute shell' marked build as failure
See https://jenkins.osmocom.org/jenkins/job/Osmocom_OBS_master/93691/display/redirect
Changes:
------------------------------------------ Started by upstream project "master-osmo_dia2gsup" build number 571 originally caused by: Started by timer Running as SYSTEM Building remotely on build4-deb12build-ansible (ttcn3 obs osmo-gsm-tester-build ttcn3_with_linux_6.1_or_higher qemu io_uring osmocom-gerrit coverity osmocom-master) in workspace https://jenkins.osmocom.org/jenkins/job/Osmocom_OBS_master/ws/ The recommended git tool is: NONE No credentials specified Wiping out workspace first. Cloning the remote Git repository Cloning repository https://gerrit.osmocom.org/osmo-ci
git init https://jenkins.osmocom.org/jenkins/job/Osmocom_OBS_master/ws/ # timeout=10
Fetching upstream changes from https://gerrit.osmocom.org/osmo-ci
git --version # timeout=10 git --version # 'git version 2.39.5' git fetch --tags --force --progress -- https://gerrit.osmocom.org/osmo-ci +refs/heads/*:refs/remotes/origin/* # timeout=10 git config remote.origin.url https://gerrit.osmocom.org/osmo-ci # timeout=10 git config --add remote.origin.fetch +refs/heads/*:refs/remotes/origin/* # timeout=10
Avoid second fetch
git rev-parse refs/remotes/origin/refs/remotes/origin/master^{commit} # timeout=10 git rev-parse refs/remotes/origin/master^{commit} # timeout=10
Checking out Revision 9a18ebaa78fc255a0aea42186a2743829d69162e (refs/remotes/origin/master)
git config core.sparsecheckout # timeout=10 git checkout -f 9a18ebaa78fc255a0aea42186a2743829d69162e # timeout=10
Commit message: "obs: gerrit_binpkgs: set --allow-unknown-package"
git rev-list --no-walk 9a18ebaa78fc255a0aea42186a2743829d69162e # timeout=10
[Osmocom_OBS_master] $ /bin/sh -xe /tmp/jenkins11581035763332158328.sh + export PYTHONUNBUFFERED=1 + ./scripts/obs/update_obs_project.py --apiurl https://obs.osmocom.org --conflict-version --docker --feed master --meta osmocom:master docker: building image debian-12-osmocom-obs-build-srcpkg + run_in_docker_and_exit(): ['docker', 'build', '--build-arg', 'DISTRO=debian:12', '--build-arg', 'DISTRO_FROM=debian:12', '--build-arg', 'UID=1000', '-t', 'debian-12-osmocom-obs-build-srcpkg', '-f', 'https://jenkins.osmocom.org/jenkins/job/Osmocom_OBS_master/ws/scripts/obs/data/build_srcpkg.Dockerfile', 'https://jenkins.osmocom.org/jenkins/job/Osmocom_OBS_master/ws/scripts/obs/data'] #0 building with "default" instance using docker driver
#1 [internal] load build definition from build_srcpkg.Dockerfile #1 transferring dockerfile: 579B done #1 WARN: InvalidDefaultArgInFrom: Default value for ARG ${DISTRO_FROM} results in empty or invalid base image name (line 3) #1 DONE 0.0s
#2 [internal] load metadata for docker.io/library/debian:12 #2 DONE 0.4s
#3 [internal] load .dockerignore #3 transferring context: 2B done #3 DONE 0.0s
#4 [1/3] FROM docker.io/library/debian:12@sha256:18023f131f52fc3ea21973cabffe0b216c60b417fd2478e94d9d59981ebba6af #4 DONE 0.0s
#5 [2/3] RUN APT-GET update && apt-get upgrade -y && apt-get install -y --no-install-recommends ca-certificates colordiff debhelper dh-python dpkg-dev fakeroot git git-review gnupg2 libxml2-utils lsb-release meson osc python3-packaging python3-setuptools quilt rebar3 sed sphinx-common && apt-get clean #5 CACHED
#6 [3/3] RUN USERADD --uid=1000 -m user #6 CACHED
#7 exporting to image #7 exporting layers done #7 writing image sha256:2a9dd95b35028e4d71315e59c45ba43dc43f920d55d8b4980b221443515a5cd4 done #7 naming to docker.io/library/debian-12-osmocom-obs-build-srcpkg done #7 DONE 0.0s
[33m1 warning found (use docker --debug to expand): [0m - InvalidDefaultArgInFrom: Default value for ARG ${DISTRO_FROM} results in empty or invalid base image name (line 3) docker: running: update_obs_project.py inside docker OBS: getting packages in osmocom:master Traceback (most recent call last): File "/obs/update_obs_project.py", line 265, in <module> main() File "/obs/update_obs_project.py", line 257, in main pkgs_remote = lib.osc.get_remote_pkgs() ^^^^^^^^^^^^^ ERROR: command failed unexpectedly
*** command *** ['osc', '-A', 'https://obs.osmocom.org', 'list', 'osmocom:master']
*** returncode *** 1
*** output *** Server returned an error: HTTP Error 503: Service Unavailable
Request: https://obs.osmocom.org/source/osmocom:master Headers: Server: nginx Date: Fri, 04 Apr 2025 03:14:26 GMT Content-Type: text/html; charset=UTF-8 Content-Length: 189 Connection: close cache-control: no-cache, no-store, must-revalidate Status: 503 Service Unavailable Cache-Control: public
*** python trace *** ^^^^^^^^^^^^ File "/obs/lib/osc.py", line 63, in get_remote_pkgs ret = run_osc(["list", proj]) ^^^^^^^^^^^^^^^^^^^^^^^ File "/obs/lib/osc.py", line 58, in run_osc return lib.run_cmd(cmd, *args, **kwargs) ^^^^^^^^^^^^^^^^^^^^^^^^^^^^^^^^^ File "/obs/lib/__init__.py", line 200, in run_cmd exit_error_cmd(p, "command failed unexpectedly") File "/obs/lib/__init__.py", line 161, in exit_error_cmd raise RuntimeError("shell command related error, find details right above" RuntimeError: shell command related error, find details right above this python trace Build step 'Execute shell' marked build as failure
See https://jenkins.osmocom.org/jenkins/job/Osmocom_OBS_master/93692/display/redirect
Changes:
------------------------------------------ Started by upstream project "master-osmo-e1-recorder" build number 1978 originally caused by: Started by timer Running as SYSTEM Building remotely on build4-deb12build-ansible (ttcn3 obs osmo-gsm-tester-build ttcn3_with_linux_6.1_or_higher qemu io_uring osmocom-gerrit coverity osmocom-master) in workspace https://jenkins.osmocom.org/jenkins/job/Osmocom_OBS_master/ws/ The recommended git tool is: NONE No credentials specified Wiping out workspace first. Cloning the remote Git repository Cloning repository https://gerrit.osmocom.org/osmo-ci
git init https://jenkins.osmocom.org/jenkins/job/Osmocom_OBS_master/ws/ # timeout=10
Fetching upstream changes from https://gerrit.osmocom.org/osmo-ci
git --version # timeout=10 git --version # 'git version 2.39.5' git fetch --tags --force --progress -- https://gerrit.osmocom.org/osmo-ci +refs/heads/*:refs/remotes/origin/* # timeout=10 git config remote.origin.url https://gerrit.osmocom.org/osmo-ci # timeout=10 git config --add remote.origin.fetch +refs/heads/*:refs/remotes/origin/* # timeout=10
Avoid second fetch
git rev-parse refs/remotes/origin/refs/remotes/origin/master^{commit} # timeout=10 git rev-parse refs/remotes/origin/master^{commit} # timeout=10
Checking out Revision 9a18ebaa78fc255a0aea42186a2743829d69162e (refs/remotes/origin/master)
git config core.sparsecheckout # timeout=10 git checkout -f 9a18ebaa78fc255a0aea42186a2743829d69162e # timeout=10
Commit message: "obs: gerrit_binpkgs: set --allow-unknown-package"
git rev-list --no-walk 9a18ebaa78fc255a0aea42186a2743829d69162e # timeout=10
[Osmocom_OBS_master] $ /bin/sh -xe /tmp/jenkins11781700534325817858.sh + export PYTHONUNBUFFERED=1 + ./scripts/obs/update_obs_project.py --apiurl https://obs.osmocom.org --conflict-version --docker --feed master --meta osmocom:master docker: building image debian-12-osmocom-obs-build-srcpkg + run_in_docker_and_exit(): ['docker', 'build', '--build-arg', 'DISTRO=debian:12', '--build-arg', 'DISTRO_FROM=debian:12', '--build-arg', 'UID=1000', '-t', 'debian-12-osmocom-obs-build-srcpkg', '-f', 'https://jenkins.osmocom.org/jenkins/job/Osmocom_OBS_master/ws/scripts/obs/data/build_srcpkg.Dockerfile', 'https://jenkins.osmocom.org/jenkins/job/Osmocom_OBS_master/ws/scripts/obs/data'] #0 building with "default" instance using docker driver
#1 [internal] load build definition from build_srcpkg.Dockerfile #1 transferring dockerfile: 579B done #1 WARN: InvalidDefaultArgInFrom: Default value for ARG ${DISTRO_FROM} results in empty or invalid base image name (line 3) #1 DONE 0.0s
#2 [internal] load metadata for docker.io/library/debian:12 #2 DONE 0.8s
#3 [internal] load .dockerignore #3 transferring context: 2B done #3 DONE 0.0s
#4 [1/3] FROM docker.io/library/debian:12@sha256:18023f131f52fc3ea21973cabffe0b216c60b417fd2478e94d9d59981ebba6af #4 DONE 0.0s
#5 [2/3] RUN APT-GET update && apt-get upgrade -y && apt-get install -y --no-install-recommends ca-certificates colordiff debhelper dh-python dpkg-dev fakeroot git git-review gnupg2 libxml2-utils lsb-release meson osc python3-packaging python3-setuptools quilt rebar3 sed sphinx-common && apt-get clean #5 CACHED
#6 [3/3] RUN USERADD --uid=1000 -m user #6 CACHED
#7 exporting to image #7 exporting layers done #7 writing image sha256:2a9dd95b35028e4d71315e59c45ba43dc43f920d55d8b4980b221443515a5cd4 done #7 naming to docker.io/library/debian-12-osmocom-obs-build-srcpkg 0.0s done #7 DONE 0.0s
[33m1 warning found (use docker --debug to expand): [0m - InvalidDefaultArgInFrom: Default value for ARG ${DISTRO_FROM} results in empty or invalid base image name (line 3) docker: running: update_obs_project.py inside docker OBS: getting packages in osmocom:master
ERROR: command failed unexpectedly
*** command *** ['osc', '-A', 'https://obs.osmocom.org', 'list', 'osmocom:master']
*** returncode *** 1
*** output *** Server returned an error: HTTP Error 503: Service Unavailable
Request: https://obs.osmocom.org/source/osmocom:master Headers: Server: nginx Date: Fri, 04 Apr 2025 04:10:12 GMT Content-Type: text/html; charset=UTF-8 Content-Length: 189 Connection: close cache-control: no-cache, no-store, must-revalidate Status: 503 Service Unavailable Cache-Control: public
*** python trace *** Traceback (most recent call last): File "/obs/update_obs_project.py", line 265, in <module> main() File "/obs/update_obs_project.py", line 257, in main pkgs_remote = lib.osc.get_remote_pkgs() ^^^^^^^^^^^^^^^^^^^^^^^^^ File "/obs/lib/osc.py", line 63, in get_remote_pkgs ret = run_osc(["list", proj]) ^^^^^^^^^^^^^^^^^^^^^^^ File "/obs/lib/osc.py", line 58, in run_osc return lib.run_cmd(cmd, *args, **kwargs) ^^^^^^^^^^^^^^^^^^^^^^^^^^^^^^^^^ File "/obs/lib/__init__.py", line 200, in run_cmd exit_error_cmd(p, "command failed unexpectedly") File "/obs/lib/__init__.py", line 161, in exit_error_cmd raise RuntimeError("shell command related error, find details right above" RuntimeError: shell command related error, find details right above this python trace Build step 'Execute shell' marked build as failure
See https://jenkins.osmocom.org/jenkins/job/Osmocom_OBS_master/93693/display/redirect
Changes:
------------------------------------------ Started by upstream project "master-libosmo-gprs" build number 1105 originally caused by: Started by timer Running as SYSTEM Building remotely on build4-deb12build-ansible (ttcn3 obs osmo-gsm-tester-build ttcn3_with_linux_6.1_or_higher qemu io_uring osmocom-gerrit coverity osmocom-master) in workspace https://jenkins.osmocom.org/jenkins/job/Osmocom_OBS_master/ws/ The recommended git tool is: NONE No credentials specified Wiping out workspace first. Cloning the remote Git repository Cloning repository https://gerrit.osmocom.org/osmo-ci
git init https://jenkins.osmocom.org/jenkins/job/Osmocom_OBS_master/ws/ # timeout=10
Fetching upstream changes from https://gerrit.osmocom.org/osmo-ci
git --version # timeout=10 git --version # 'git version 2.39.5' git fetch --tags --force --progress -- https://gerrit.osmocom.org/osmo-ci +refs/heads/*:refs/remotes/origin/* # timeout=10 git config remote.origin.url https://gerrit.osmocom.org/osmo-ci # timeout=10 git config --add remote.origin.fetch +refs/heads/*:refs/remotes/origin/* # timeout=10
Avoid second fetch
git rev-parse refs/remotes/origin/refs/remotes/origin/master^{commit} # timeout=10 git rev-parse refs/remotes/origin/master^{commit} # timeout=10
Checking out Revision 9a18ebaa78fc255a0aea42186a2743829d69162e (refs/remotes/origin/master)
git config core.sparsecheckout # timeout=10 git checkout -f 9a18ebaa78fc255a0aea42186a2743829d69162e # timeout=10
Commit message: "obs: gerrit_binpkgs: set --allow-unknown-package"
git rev-list --no-walk 9a18ebaa78fc255a0aea42186a2743829d69162e # timeout=10
[Osmocom_OBS_master] $ /bin/sh -xe /tmp/jenkins7568846260567110356.sh + export PYTHONUNBUFFERED=1 + ./scripts/obs/update_obs_project.py --apiurl https://obs.osmocom.org --conflict-version --docker --feed master --meta osmocom:master docker: building image debian-12-osmocom-obs-build-srcpkg + run_in_docker_and_exit(): ['docker', 'build', '--build-arg', 'DISTRO=debian:12', '--build-arg', 'DISTRO_FROM=debian:12', '--build-arg', 'UID=1000', '-t', 'debian-12-osmocom-obs-build-srcpkg', '-f', 'https://jenkins.osmocom.org/jenkins/job/Osmocom_OBS_master/ws/scripts/obs/data/build_srcpkg.Dockerfile', 'https://jenkins.osmocom.org/jenkins/job/Osmocom_OBS_master/ws/scripts/obs/data'] #0 building with "default" instance using docker driver
#1 [internal] load build definition from build_srcpkg.Dockerfile #1 transferring dockerfile: 579B done #1 WARN: InvalidDefaultArgInFrom: Default value for ARG ${DISTRO_FROM} results in empty or invalid base image name (line 3) #1 DONE 0.0s
#2 [internal] load metadata for docker.io/library/debian:12 #2 DONE 0.8s
#3 [internal] load .dockerignore #3 transferring context: 2B done #3 DONE 0.0s
#4 [1/3] FROM docker.io/library/debian:12@sha256:18023f131f52fc3ea21973cabffe0b216c60b417fd2478e94d9d59981ebba6af #4 DONE 0.0s
#5 [2/3] RUN APT-GET update && apt-get upgrade -y && apt-get install -y --no-install-recommends ca-certificates colordiff debhelper dh-python dpkg-dev fakeroot git git-review gnupg2 libxml2-utils lsb-release meson osc python3-packaging python3-setuptools quilt rebar3 sed sphinx-common && apt-get clean #5 CACHED
#6 [3/3] RUN USERADD --uid=1000 -m user #6 CACHED
#7 exporting to image #7 exporting layers done #7 writing image sha256:2a9dd95b35028e4d71315e59c45ba43dc43f920d55d8b4980b221443515a5cd4 done #7 naming to docker.io/library/debian-12-osmocom-obs-build-srcpkg 0.0s done #7 DONE 0.0s
[33m1 warning found (use docker --debug to expand): [0m - InvalidDefaultArgInFrom: Default value for ARG ${DISTRO_FROM} results in empty or invalid base image name (line 3) docker: running: update_obs_project.py inside docker OBS: getting packages in osmocom:master
ERROR: command failed unexpectedly
*** command *** ['osc', '-A', 'https://obs.osmocom.org', 'list', 'osmocom:master']
*** returncode *** 1
*** output *** Server returned an error: HTTP Error 503: Service Unavailable
Request: https://obs.osmocom.org/source/osmocom:master Headers: Server: nginx Date: Fri, 04 Apr 2025 04:17:18 GMT Content-Type: text/html; charset=UTF-8 Content-Length: 189 Connection: close cache-control: no-cache, no-store, must-revalidate Status: 503 Service Unavailable Cache-Control: public
*** python trace *** Traceback (most recent call last): File "/obs/update_obs_project.py", line 265, in <module> main() File "/obs/update_obs_project.py", line 257, in main pkgs_remote = lib.osc.get_remote_pkgs() ^^^^^^^^^^^^^^^^^^^^^^^^^ File "/obs/lib/osc.py", line 63, in get_remote_pkgs ret = run_osc(["list", proj]) ^^^^^^^^^^^^^^^^^^^^^^^ File "/obs/lib/osc.py", line 58, in run_osc return lib.run_cmd(cmd, *args, **kwargs) ^^^^^^^^^^^^^^^^^^^^^^^^^^^^^^^^^ File "/obs/lib/__init__.py", line 200, in run_cmd exit_error_cmd(p, "command failed unexpectedly") File "/obs/lib/__init__.py", line 161, in exit_error_cmd raise RuntimeError("shell command related error, find details right above" RuntimeError: shell command related error, find details right above this python trace Build step 'Execute shell' marked build as failure
See https://jenkins.osmocom.org/jenkins/job/Osmocom_OBS_master/93694/display/redirect
Changes:
------------------------------------------ Started by upstream project "master-libosmo-pfcp" build number 2542 originally caused by: Started by timer Running as SYSTEM Building remotely on build5-deb12build-ansible (ttcn3 obs osmo-gsm-tester-build ttcn3-ggsn-test-kernel-git ttcn3_with_linux_6.1_or_higher qemu io_uring osmocom-gerrit coverity osmocom-master) in workspace https://jenkins.osmocom.org/jenkins/job/Osmocom_OBS_master/ws/ The recommended git tool is: NONE No credentials specified Wiping out workspace first. Cloning the remote Git repository Cloning repository https://gerrit.osmocom.org/osmo-ci
git init https://jenkins.osmocom.org/jenkins/job/Osmocom_OBS_master/ws/ # timeout=10
Fetching upstream changes from https://gerrit.osmocom.org/osmo-ci
git --version # timeout=10 git --version # 'git version 2.39.5' git fetch --tags --force --progress -- https://gerrit.osmocom.org/osmo-ci +refs/heads/*:refs/remotes/origin/* # timeout=10 git config remote.origin.url https://gerrit.osmocom.org/osmo-ci # timeout=10 git config --add remote.origin.fetch +refs/heads/*:refs/remotes/origin/* # timeout=10
Avoid second fetch
git rev-parse refs/remotes/origin/refs/remotes/origin/master^{commit} # timeout=10 git rev-parse refs/remotes/origin/master^{commit} # timeout=10
Checking out Revision 9a18ebaa78fc255a0aea42186a2743829d69162e (refs/remotes/origin/master)
git config core.sparsecheckout # timeout=10 git checkout -f 9a18ebaa78fc255a0aea42186a2743829d69162e # timeout=10
Commit message: "obs: gerrit_binpkgs: set --allow-unknown-package"
git rev-list --no-walk 9a18ebaa78fc255a0aea42186a2743829d69162e # timeout=10
[Osmocom_OBS_master] $ /bin/sh -xe /tmp/jenkins11360402366816307828.sh + export PYTHONUNBUFFERED=1 + ./scripts/obs/update_obs_project.py --apiurl https://obs.osmocom.org --conflict-version --docker --feed master --meta osmocom:master docker: building image debian-12-osmocom-obs-build-srcpkg + run_in_docker_and_exit(): ['docker', 'build', '--build-arg', 'DISTRO=debian:12', '--build-arg', 'DISTRO_FROM=debian:12', '--build-arg', 'UID=1000', '-t', 'debian-12-osmocom-obs-build-srcpkg', '-f', 'https://jenkins.osmocom.org/jenkins/job/Osmocom_OBS_master/ws/scripts/obs/data/build_srcpkg.Dockerfile', 'https://jenkins.osmocom.org/jenkins/job/Osmocom_OBS_master/ws/scripts/obs/data'] #0 building with "default" instance using docker driver
#1 [internal] load build definition from build_srcpkg.Dockerfile #1 transferring dockerfile: 579B done #1 WARN: InvalidDefaultArgInFrom: Default value for ARG ${DISTRO_FROM} results in empty or invalid base image name (line 3) #1 DONE 0.1s
#2 [internal] load metadata for docker.io/library/debian:12 #2 DONE 1.2s
#3 [internal] load .dockerignore #3 transferring context: 2B done #3 DONE 0.1s
#4 [1/3] FROM docker.io/library/debian:12@sha256:18023f131f52fc3ea21973cabffe0b216c60b417fd2478e94d9d59981ebba6af #4 resolve docker.io/library/debian:12@sha256:18023f131f52fc3ea21973cabffe0b216c60b417fd2478e94d9d59981ebba6af 0.1s done #4 DONE 0.1s
#5 [2/3] RUN APT-GET update && apt-get upgrade -y && apt-get install -y --no-install-recommends ca-certificates colordiff debhelper dh-python dpkg-dev fakeroot git git-review gnupg2 libxml2-utils lsb-release meson osc python3-packaging python3-setuptools quilt rebar3 sed sphinx-common && apt-get clean #5 CACHED
#6 [3/3] RUN USERADD --uid=1000 -m user #6 CACHED
#7 exporting to image #7 exporting layers done #7 writing image sha256:bc6a5998c69e89ffa8b1575b367bf8e7e099cfb23989f67da73b87732b6acf83 done #7 naming to docker.io/library/debian-12-osmocom-obs-build-srcpkg done #7 DONE 0.0s
[33m1 warning found (use docker --debug to expand): [0m - InvalidDefaultArgInFrom: Default value for ARG ${DISTRO_FROM} results in empty or invalid base image name (line 3) docker: running: update_obs_project.py inside docker OBS: getting packages in osmocom:master
ERROR: command failed unexpectedly
*** command *** ['osc', '-A', 'https://obs.osmocom.org', 'list', 'osmocom:master']
*** returncode *** 1
*** output *** Server returned an error: HTTP Error 503: Service Unavailable
Request: https://obs.osmocom.org/source/osmocom:master Headers: Server: nginx Date: Fri, 04 Apr 2025 04:28:04 GMT Content-Type: text/html; charset=UTF-8 Content-Length: 189 Connection: close cache-control: no-cache, no-store, must-revalidate Status: 503 Service Unavailable Cache-Control: public
*** python trace *** Traceback (most recent call last): File "/obs/update_obs_project.py", line 265, in <module> main() File "/obs/update_obs_project.py", line 257, in main pkgs_remote = lib.osc.get_remote_pkgs() ^^^^^^^^^^^^^^^^^^^^^^^^^ File "/obs/lib/osc.py", line 63, in get_remote_pkgs ret = run_osc(["list", proj]) ^^^^^^^^^^^^^^^^^^^^^^^ File "/obs/lib/osc.py", line 58, in run_osc return lib.run_cmd(cmd, *args, **kwargs) ^^^^^^^^^^^^^^^^^^^^^^^^^^^^^^^^^ File "/obs/lib/__init__.py", line 200, in run_cmd exit_error_cmd(p, "command failed unexpectedly") File "/obs/lib/__init__.py", line 161, in exit_error_cmd raise RuntimeError("shell command related error, find details right above" RuntimeError: shell command related error, find details right above this python trace Build step 'Execute shell' marked build as failure
See https://jenkins.osmocom.org/jenkins/job/Osmocom_OBS_master/93695/display/redirect
Changes:
------------------------------------------ Started by upstream project "master-osmo-pcu" build number 7319 originally caused by: Started by upstream project "master-libosmo-gprs" build number 1105 originally caused by: Started by timer Running as SYSTEM Building remotely on build5-deb12build-ansible (ttcn3 obs osmo-gsm-tester-build ttcn3-ggsn-test-kernel-git ttcn3_with_linux_6.1_or_higher qemu io_uring osmocom-gerrit coverity osmocom-master) in workspace https://jenkins.osmocom.org/jenkins/job/Osmocom_OBS_master/ws/ The recommended git tool is: NONE No credentials specified Wiping out workspace first. Cloning the remote Git repository Cloning repository https://gerrit.osmocom.org/osmo-ci
git init https://jenkins.osmocom.org/jenkins/job/Osmocom_OBS_master/ws/ # timeout=10
Fetching upstream changes from https://gerrit.osmocom.org/osmo-ci
git --version # timeout=10 git --version # 'git version 2.39.5' git fetch --tags --force --progress -- https://gerrit.osmocom.org/osmo-ci +refs/heads/*:refs/remotes/origin/* # timeout=10 git config remote.origin.url https://gerrit.osmocom.org/osmo-ci # timeout=10 git config --add remote.origin.fetch +refs/heads/*:refs/remotes/origin/* # timeout=10
Avoid second fetch
git rev-parse refs/remotes/origin/refs/remotes/origin/master^{commit} # timeout=10 git rev-parse refs/remotes/origin/master^{commit} # timeout=10
Checking out Revision 9a18ebaa78fc255a0aea42186a2743829d69162e (refs/remotes/origin/master)
git config core.sparsecheckout # timeout=10 git checkout -f 9a18ebaa78fc255a0aea42186a2743829d69162e # timeout=10
Commit message: "obs: gerrit_binpkgs: set --allow-unknown-package"
git rev-list --no-walk 9a18ebaa78fc255a0aea42186a2743829d69162e # timeout=10
[Osmocom_OBS_master] $ /bin/sh -xe /tmp/jenkins4285163903246593097.sh + export PYTHONUNBUFFERED=1 + ./scripts/obs/update_obs_project.py --apiurl https://obs.osmocom.org --conflict-version --docker --feed master --meta osmocom:master docker: building image debian-12-osmocom-obs-build-srcpkg + run_in_docker_and_exit(): ['docker', 'build', '--build-arg', 'DISTRO=debian:12', '--build-arg', 'DISTRO_FROM=debian:12', '--build-arg', 'UID=1000', '-t', 'debian-12-osmocom-obs-build-srcpkg', '-f', 'https://jenkins.osmocom.org/jenkins/job/Osmocom_OBS_master/ws/scripts/obs/data/build_srcpkg.Dockerfile', 'https://jenkins.osmocom.org/jenkins/job/Osmocom_OBS_master/ws/scripts/obs/data'] #0 building with "default" instance using docker driver
#1 [internal] load build definition from build_srcpkg.Dockerfile #1 transferring dockerfile: 579B done #1 WARN: InvalidDefaultArgInFrom: Default value for ARG ${DISTRO_FROM} results in empty or invalid base image name (line 3) #1 DONE 0.0s
#2 [internal] load metadata for docker.io/library/debian:12 #2 DONE 0.4s
#3 [internal] load .dockerignore #3 transferring context: 2B done #3 DONE 0.0s
#4 [1/3] FROM docker.io/library/debian:12@sha256:18023f131f52fc3ea21973cabffe0b216c60b417fd2478e94d9d59981ebba6af #4 resolve docker.io/library/debian:12@sha256:18023f131f52fc3ea21973cabffe0b216c60b417fd2478e94d9d59981ebba6af 0.0s done #4 DONE 0.0s
#5 [2/3] RUN APT-GET update && apt-get upgrade -y && apt-get install -y --no-install-recommends ca-certificates colordiff debhelper dh-python dpkg-dev fakeroot git git-review gnupg2 libxml2-utils lsb-release meson osc python3-packaging python3-setuptools quilt rebar3 sed sphinx-common && apt-get clean #5 CACHED
#6 [3/3] RUN USERADD --uid=1000 -m user #6 CACHED
#7 exporting to image #7 exporting layers done #7 writing image sha256:bc6a5998c69e89ffa8b1575b367bf8e7e099cfb23989f67da73b87732b6acf83 0.0s done #7 naming to docker.io/library/debian-12-osmocom-obs-build-srcpkg #7 naming to docker.io/library/debian-12-osmocom-obs-build-srcpkg done #7 DONE 0.0s
[33m1 warning found (use docker --debug to expand): [0m - InvalidDefaultArgInFrom: Default value for ARG ${DISTRO_FROM} results in empty or invalid base image name (line 3) docker: running: update_obs_project.py inside docker OBS: getting packages in osmocom:master Traceback (most recent call last): File "/obs/update_obs_project.py", line 265, in <module>
ERROR: command failed unexpectedly
*** command *** ['osc', '-A', 'https://obs.osmocom.org', 'list', 'osmocom:master']
*** returncode *** 1
*** output *** Server returned an error: HTTP Error 503: Service Unavailable
Request: https://obs.osmocom.org/source/osmocom:master Headers: Server: nginx Date: Fri, 04 Apr 2025 04:29:33 GMT Content-Type: text/html; charset=UTF-8 Content-Length: 189 Connection: close cache-control: no-cache, no-store, must-revalidate Status: 503 Service Unavailable Cache-Control: public
*** python trace *** main() File "/obs/update_obs_project.py", line 257, in main pkgs_remote = lib.osc.get_remote_pkgs() ^^^^^^^^^^^^^^^^^^^^^^^^^ File "/obs/lib/osc.py", line 63, in get_remote_pkgs ret = run_osc(["list", proj]) ^^^^^^^^^^^^^^^^^^^^^^^ File "/obs/lib/osc.py", line 58, in run_osc return lib.run_cmd(cmd, *args, **kwargs) ^^^^^^^^^^^^^^^^^^^^^^^^^^^^^^^^^ File "/obs/lib/__init__.py", line 200, in run_cmd exit_error_cmd(p, "command failed unexpectedly") File "/obs/lib/__init__.py", line 161, in exit_error_cmd raise RuntimeError("shell command related error, find details right above" RuntimeError: shell command related error, find details right above this python trace Build step 'Execute shell' marked build as failure
See https://jenkins.osmocom.org/jenkins/job/Osmocom_OBS_master/93696/display/redirect
Changes:
------------------------------------------ Started by upstream project "master-osmo-upf" build number 5325 originally caused by: Started by upstream project "master-libosmo-pfcp" build number 2542 originally caused by: Started by timer Running as SYSTEM Building remotely on build5-deb12build-ansible (ttcn3 obs osmo-gsm-tester-build ttcn3-ggsn-test-kernel-git ttcn3_with_linux_6.1_or_higher qemu io_uring osmocom-gerrit coverity osmocom-master) in workspace https://jenkins.osmocom.org/jenkins/job/Osmocom_OBS_master/ws/ The recommended git tool is: NONE No credentials specified Wiping out workspace first. Cloning the remote Git repository Cloning repository https://gerrit.osmocom.org/osmo-ci
git init https://jenkins.osmocom.org/jenkins/job/Osmocom_OBS_master/ws/ # timeout=10
Fetching upstream changes from https://gerrit.osmocom.org/osmo-ci
git --version # timeout=10 git --version # 'git version 2.39.5' git fetch --tags --force --progress -- https://gerrit.osmocom.org/osmo-ci +refs/heads/*:refs/remotes/origin/* # timeout=10 git config remote.origin.url https://gerrit.osmocom.org/osmo-ci # timeout=10 git config --add remote.origin.fetch +refs/heads/*:refs/remotes/origin/* # timeout=10
Avoid second fetch
git rev-parse refs/remotes/origin/refs/remotes/origin/master^{commit} # timeout=10 git rev-parse refs/remotes/origin/master^{commit} # timeout=10
Checking out Revision 9a18ebaa78fc255a0aea42186a2743829d69162e (refs/remotes/origin/master)
git config core.sparsecheckout # timeout=10 git checkout -f 9a18ebaa78fc255a0aea42186a2743829d69162e # timeout=10
Commit message: "obs: gerrit_binpkgs: set --allow-unknown-package"
git rev-list --no-walk 9a18ebaa78fc255a0aea42186a2743829d69162e # timeout=10
[Osmocom_OBS_master] $ /bin/sh -xe /tmp/jenkins3166143308205261082.sh + export PYTHONUNBUFFERED=1 + ./scripts/obs/update_obs_project.py --apiurl https://obs.osmocom.org --conflict-version --docker --feed master --meta osmocom:master docker: building image debian-12-osmocom-obs-build-srcpkg + run_in_docker_and_exit(): ['docker', 'build', '--build-arg', 'DISTRO=debian:12', '--build-arg', 'DISTRO_FROM=debian:12', '--build-arg', 'UID=1000', '-t', 'debian-12-osmocom-obs-build-srcpkg', '-f', 'https://jenkins.osmocom.org/jenkins/job/Osmocom_OBS_master/ws/scripts/obs/data/build_srcpkg.Dockerfile', 'https://jenkins.osmocom.org/jenkins/job/Osmocom_OBS_master/ws/scripts/obs/data'] #0 building with "default" instance using docker driver
#1 [internal] load build definition from build_srcpkg.Dockerfile #1 transferring dockerfile: 579B done #1 WARN: InvalidDefaultArgInFrom: Default value for ARG ${DISTRO_FROM} results in empty or invalid base image name (line 3) #1 DONE 0.0s
#2 [internal] load metadata for docker.io/library/debian:12 #2 DONE 0.4s
#3 [internal] load .dockerignore #3 transferring context: 2B done #3 DONE 0.0s
#4 [1/3] FROM docker.io/library/debian:12@sha256:18023f131f52fc3ea21973cabffe0b216c60b417fd2478e94d9d59981ebba6af #4 resolve docker.io/library/debian:12@sha256:18023f131f52fc3ea21973cabffe0b216c60b417fd2478e94d9d59981ebba6af 0.0s done #4 DONE 0.0s
#5 [2/3] RUN APT-GET update && apt-get upgrade -y && apt-get install -y --no-install-recommends ca-certificates colordiff debhelper dh-python dpkg-dev fakeroot git git-review gnupg2 libxml2-utils lsb-release meson osc python3-packaging python3-setuptools quilt rebar3 sed sphinx-common && apt-get clean #5 CACHED
#6 [3/3] RUN USERADD --uid=1000 -m user #6 CACHED
#7 exporting to image #7 exporting layers done #7 writing image sha256:bc6a5998c69e89ffa8b1575b367bf8e7e099cfb23989f67da73b87732b6acf83 done #7 naming to docker.io/library/debian-12-osmocom-obs-build-srcpkg done #7 DONE 0.0s
[33m1 warning found (use docker --debug to expand): [0m - InvalidDefaultArgInFrom: Default value for ARG ${DISTRO_FROM} results in empty or invalid base image name (line 3) docker: running: update_obs_project.py inside docker OBS: getting packages in osmocom:master
ERROR: command failed unexpectedly
*** command *** ['osc', '-A', 'https://obs.osmocom.org', 'list', 'osmocom:master']
*** returncode *** 1
*** output *** Server returned an error: HTTP Error 503: Service Unavailable
Request: https://obs.osmocom.org/source/osmocom:master Headers: Server: nginx Date: Fri, 04 Apr 2025 04:29:47 GMT Content-Type: text/html; charset=UTF-8 Content-Length: 189 Connection: close cache-control: no-cache, no-store, must-revalidate Status: 503 Service Unavailable Cache-Control: public
*** python trace *** Traceback (most recent call last): File "/obs/update_obs_project.py", line 265, in <module> main() File "/obs/update_obs_project.py", line 257, in main pkgs_remote = lib.osc.get_remote_pkgs() ^^^^^^^^^^^^^^^^^^^^^^^^^ File "/obs/lib/osc.py", line 63, in get_remote_pkgs ret = run_osc(["list", proj]) ^^^^^^^^^^^^^^^^^^^^^^^ File "/obs/lib/osc.py", line 58, in run_osc return lib.run_cmd(cmd, *args, **kwargs) ^^^^^^^^^^^^^^^^^^^^^^^^^^^^^^^^^ File "/obs/lib/__init__.py", line 200, in run_cmd exit_error_cmd(p, "command failed unexpectedly") File "/obs/lib/__init__.py", line 161, in exit_error_cmd raise RuntimeError("shell command related error, find details right above" RuntimeError: shell command related error, find details right above this python trace Build step 'Execute shell' marked build as failure
See https://jenkins.osmocom.org/jenkins/job/Osmocom_OBS_master/93697/display/redirect
Changes:
------------------------------------------ Started by upstream project "master-osmo-hnbgw" build number 11424 originally caused by: Started by upstream project "master-libosmo-pfcp" build number 2542 originally caused by: Started by timer Running as SYSTEM Building remotely on build5-deb12build-ansible (ttcn3 obs osmo-gsm-tester-build ttcn3-ggsn-test-kernel-git ttcn3_with_linux_6.1_or_higher qemu io_uring osmocom-gerrit coverity osmocom-master) in workspace https://jenkins.osmocom.org/jenkins/job/Osmocom_OBS_master/ws/ The recommended git tool is: NONE No credentials specified Wiping out workspace first. Cloning the remote Git repository Cloning repository https://gerrit.osmocom.org/osmo-ci
git init https://jenkins.osmocom.org/jenkins/job/Osmocom_OBS_master/ws/ # timeout=10
Fetching upstream changes from https://gerrit.osmocom.org/osmo-ci
git --version # timeout=10 git --version # 'git version 2.39.5' git fetch --tags --force --progress -- https://gerrit.osmocom.org/osmo-ci +refs/heads/*:refs/remotes/origin/* # timeout=10 git config remote.origin.url https://gerrit.osmocom.org/osmo-ci # timeout=10 git config --add remote.origin.fetch +refs/heads/*:refs/remotes/origin/* # timeout=10
Avoid second fetch
git rev-parse refs/remotes/origin/refs/remotes/origin/master^{commit} # timeout=10 git rev-parse refs/remotes/origin/master^{commit} # timeout=10
Checking out Revision 9a18ebaa78fc255a0aea42186a2743829d69162e (refs/remotes/origin/master)
git config core.sparsecheckout # timeout=10 git checkout -f 9a18ebaa78fc255a0aea42186a2743829d69162e # timeout=10
Commit message: "obs: gerrit_binpkgs: set --allow-unknown-package"
git rev-list --no-walk 9a18ebaa78fc255a0aea42186a2743829d69162e # timeout=10
[Osmocom_OBS_master] $ /bin/sh -xe /tmp/jenkins3017033289148374294.sh + export PYTHONUNBUFFERED=1 + ./scripts/obs/update_obs_project.py --apiurl https://obs.osmocom.org --conflict-version --docker --feed master --meta osmocom:master docker: building image debian-12-osmocom-obs-build-srcpkg + run_in_docker_and_exit(): ['docker', 'build', '--build-arg', 'DISTRO=debian:12', '--build-arg', 'DISTRO_FROM=debian:12', '--build-arg', 'UID=1000', '-t', 'debian-12-osmocom-obs-build-srcpkg', '-f', 'https://jenkins.osmocom.org/jenkins/job/Osmocom_OBS_master/ws/scripts/obs/data/build_srcpkg.Dockerfile', 'https://jenkins.osmocom.org/jenkins/job/Osmocom_OBS_master/ws/scripts/obs/data'] #0 building with "default" instance using docker driver
#1 [internal] load build definition from build_srcpkg.Dockerfile #1 transferring dockerfile: 579B done #1 WARN: InvalidDefaultArgInFrom: Default value for ARG ${DISTRO_FROM} results in empty or invalid base image name (line 3) #1 DONE 0.0s
#2 [internal] load metadata for docker.io/library/debian:12 #2 DONE 0.4s
#3 [internal] load .dockerignore #3 transferring context: 2B done #3 DONE 0.0s
#4 [1/3] FROM docker.io/library/debian:12@sha256:18023f131f52fc3ea21973cabffe0b216c60b417fd2478e94d9d59981ebba6af #4 resolve docker.io/library/debian:12@sha256:18023f131f52fc3ea21973cabffe0b216c60b417fd2478e94d9d59981ebba6af 0.0s done #4 DONE 0.0s
#5 [2/3] RUN APT-GET update && apt-get upgrade -y && apt-get install -y --no-install-recommends ca-certificates colordiff debhelper dh-python dpkg-dev fakeroot git git-review gnupg2 libxml2-utils lsb-release meson osc python3-packaging python3-setuptools quilt rebar3 sed sphinx-common && apt-get clean #5 CACHED
#6 [3/3] RUN USERADD --uid=1000 -m user #6 CACHED
#7 exporting to image #7 exporting layers done #7 writing image sha256:bc6a5998c69e89ffa8b1575b367bf8e7e099cfb23989f67da73b87732b6acf83 done #7 naming to docker.io/library/debian-12-osmocom-obs-build-srcpkg #7 naming to docker.io/library/debian-12-osmocom-obs-build-srcpkg 0.0s done #7 DONE 0.0s
[33m1 warning found (use docker --debug to expand): [0m - InvalidDefaultArgInFrom: Default value for ARG ${DISTRO_FROM} results in empty or invalid base image name (line 3) docker: running: update_obs_project.py inside docker OBS: getting packages in osmocom:master
ERROR: command failed unexpectedly
*** command *** ['osc', '-A', 'https://obs.osmocom.org', 'list', 'osmocom:master']
*** returncode *** 1
*** output *** Server returned an error: HTTP Error 503: Service Unavailable
Request: https://obs.osmocom.org/source/osmocom:master Headers: Server: nginx Date: Fri, 04 Apr 2025 04:30:02 GMT Content-Type: text/html; charset=UTF-8 Content-Length: 189 Connection: close cache-control: no-cache, no-store, must-revalidate Status: 503 Service Unavailable Cache-Control: public
*** python trace *** Traceback (most recent call last): File "/obs/update_obs_project.py", line 265, in <module> main() File "/obs/update_obs_project.py", line 257, in main pkgs_remote = lib.osc.get_remote_pkgs() ^^^^^^^^^^^^^^^^^^^^^^^^^ File "/obs/lib/osc.py", line 63, in get_remote_pkgs ret = run_osc(["list", proj]) ^^^^^^^^^^^^^^^^^^^^^^^ File "/obs/lib/osc.py", line 58, in run_osc return lib.run_cmd(cmd, *args, **kwargs) ^^^^^^^^^^^^^^^^^^^^^^^^^^^^^^^^^ File "/obs/lib/__init__.py", line 200, in run_cmd exit_error_cmd(p, "command failed unexpectedly") File "/obs/lib/__init__.py", line 161, in exit_error_cmd raise RuntimeError("shell command related error, find details right above" RuntimeError: shell command related error, find details right above this python trace Build step 'Execute shell' marked build as failure
See https://jenkins.osmocom.org/jenkins/job/Osmocom_OBS_master/93698/display/redirect
Changes:
------------------------------------------ Started by upstream project "master-osmo-tetra" build number 6897 originally caused by: Started by timer Running as SYSTEM Building remotely on build4-deb12build-ansible (ttcn3 obs osmo-gsm-tester-build ttcn3_with_linux_6.1_or_higher qemu io_uring osmocom-gerrit coverity osmocom-master) in workspace https://jenkins.osmocom.org/jenkins/job/Osmocom_OBS_master/ws/ The recommended git tool is: NONE No credentials specified Wiping out workspace first. Cloning the remote Git repository Cloning repository https://gerrit.osmocom.org/osmo-ci
git init https://jenkins.osmocom.org/jenkins/job/Osmocom_OBS_master/ws/ # timeout=10
Fetching upstream changes from https://gerrit.osmocom.org/osmo-ci
git --version # timeout=10 git --version # 'git version 2.39.5' git fetch --tags --force --progress -- https://gerrit.osmocom.org/osmo-ci +refs/heads/*:refs/remotes/origin/* # timeout=10 git config remote.origin.url https://gerrit.osmocom.org/osmo-ci # timeout=10 git config --add remote.origin.fetch +refs/heads/*:refs/remotes/origin/* # timeout=10
Avoid second fetch
git rev-parse refs/remotes/origin/refs/remotes/origin/master^{commit} # timeout=10 git rev-parse refs/remotes/origin/master^{commit} # timeout=10
Checking out Revision 9a18ebaa78fc255a0aea42186a2743829d69162e (refs/remotes/origin/master)
git config core.sparsecheckout # timeout=10 git checkout -f 9a18ebaa78fc255a0aea42186a2743829d69162e # timeout=10
Commit message: "obs: gerrit_binpkgs: set --allow-unknown-package"
git rev-list --no-walk 9a18ebaa78fc255a0aea42186a2743829d69162e # timeout=10
[Osmocom_OBS_master] $ /bin/sh -xe /tmp/jenkins7625977042367920792.sh + export PYTHONUNBUFFERED=1 + ./scripts/obs/update_obs_project.py --apiurl https://obs.osmocom.org --conflict-version --docker --feed master --meta osmocom:master docker: building image debian-12-osmocom-obs-build-srcpkg + run_in_docker_and_exit(): ['docker', 'build', '--build-arg', 'DISTRO=debian:12', '--build-arg', 'DISTRO_FROM=debian:12', '--build-arg', 'UID=1000', '-t', 'debian-12-osmocom-obs-build-srcpkg', '-f', 'https://jenkins.osmocom.org/jenkins/job/Osmocom_OBS_master/ws/scripts/obs/data/build_srcpkg.Dockerfile', 'https://jenkins.osmocom.org/jenkins/job/Osmocom_OBS_master/ws/scripts/obs/data'] #0 building with "default" instance using docker driver
#1 [internal] load build definition from build_srcpkg.Dockerfile #1 transferring dockerfile: 579B done #1 WARN: InvalidDefaultArgInFrom: Default value for ARG ${DISTRO_FROM} results in empty or invalid base image name (line 3) #1 DONE 0.0s
#2 [internal] load metadata for docker.io/library/debian:12 #2 DONE 0.9s
#3 [internal] load .dockerignore #3 transferring context: 2B done #3 DONE 0.0s
#4 [1/3] FROM docker.io/library/debian:12@sha256:18023f131f52fc3ea21973cabffe0b216c60b417fd2478e94d9d59981ebba6af #4 DONE 0.0s
#5 [2/3] RUN APT-GET update && apt-get upgrade -y && apt-get install -y --no-install-recommends ca-certificates colordiff debhelper dh-python dpkg-dev fakeroot git git-review gnupg2 libxml2-utils lsb-release meson osc python3-packaging python3-setuptools quilt rebar3 sed sphinx-common && apt-get clean #5 CACHED
#6 [3/3] RUN USERADD --uid=1000 -m user #6 CACHED
#7 exporting to image #7 exporting layers done #7 writing image sha256:2a9dd95b35028e4d71315e59c45ba43dc43f920d55d8b4980b221443515a5cd4 done #7 naming to docker.io/library/debian-12-osmocom-obs-build-srcpkg done #7 DONE 0.0s
[33m1 warning found (use docker --debug to expand): [0m - InvalidDefaultArgInFrom: Default value for ARG ${DISTRO_FROM} results in empty or invalid base image name (line 3) docker: running: update_obs_project.py inside docker OBS: getting packages in osmocom:master
ERROR: command failed unexpectedly
*** command *** ['osc', '-A', 'https://obs.osmocom.org', 'list', 'osmocom:master']
*** returncode *** 1
*** output *** Server returned an error: HTTP Error 503: Service Unavailable
Request: https://obs.osmocom.org/source/osmocom:master Headers: Server: nginx Date: Fri, 04 Apr 2025 04:50:37 GMT Content-Type: text/html; charset=UTF-8 Content-Length: 189 Connection: close cache-control: no-cache, no-store, must-revalidate Status: 503 Service Unavailable Cache-Control: public
*** python trace *** Traceback (most recent call last): File "/obs/update_obs_project.py", line 265, in <module> main() File "/obs/update_obs_project.py", line 257, in main pkgs_remote = lib.osc.get_remote_pkgs() ^^^^^^^^^^^^^^^^^^^^^^^^^ File "/obs/lib/osc.py", line 63, in get_remote_pkgs ret = run_osc(["list", proj]) ^^^^^^^^^^^^^^^^^^^^^^^ File "/obs/lib/osc.py", line 58, in run_osc return lib.run_cmd(cmd, *args, **kwargs) ^^^^^^^^^^^^^^^^^^^^^^^^^^^^^^^^^ File "/obs/lib/__init__.py", line 200, in run_cmd exit_error_cmd(p, "command failed unexpectedly") File "/obs/lib/__init__.py", line 161, in exit_error_cmd raise RuntimeError("shell command related error, find details right above" RuntimeError: shell command related error, find details right above this python trace Build step 'Execute shell' marked build as failure
See https://jenkins.osmocom.org/jenkins/job/Osmocom_OBS_master/93699/display/redirect
Changes:
------------------------------------------ Started by upstream project "master-osmo-asf4-dfu" build number 2301 originally caused by: Started by timer Running as SYSTEM Building remotely on build4-deb12build-ansible (ttcn3 obs osmo-gsm-tester-build ttcn3_with_linux_6.1_or_higher qemu io_uring osmocom-gerrit coverity osmocom-master) in workspace https://jenkins.osmocom.org/jenkins/job/Osmocom_OBS_master/ws/ The recommended git tool is: NONE No credentials specified Wiping out workspace first. Cloning the remote Git repository Cloning repository https://gerrit.osmocom.org/osmo-ci
git init https://jenkins.osmocom.org/jenkins/job/Osmocom_OBS_master/ws/ # timeout=10
Fetching upstream changes from https://gerrit.osmocom.org/osmo-ci
git --version # timeout=10 git --version # 'git version 2.39.5' git fetch --tags --force --progress -- https://gerrit.osmocom.org/osmo-ci +refs/heads/*:refs/remotes/origin/* # timeout=10 git config remote.origin.url https://gerrit.osmocom.org/osmo-ci # timeout=10 git config --add remote.origin.fetch +refs/heads/*:refs/remotes/origin/* # timeout=10
Avoid second fetch
git rev-parse refs/remotes/origin/refs/remotes/origin/master^{commit} # timeout=10 git rev-parse refs/remotes/origin/master^{commit} # timeout=10
Checking out Revision 9a18ebaa78fc255a0aea42186a2743829d69162e (refs/remotes/origin/master)
git config core.sparsecheckout # timeout=10 git checkout -f 9a18ebaa78fc255a0aea42186a2743829d69162e # timeout=10
Commit message: "obs: gerrit_binpkgs: set --allow-unknown-package"
git rev-list --no-walk 9a18ebaa78fc255a0aea42186a2743829d69162e # timeout=10
[Osmocom_OBS_master] $ /bin/sh -xe /tmp/jenkins12512452233618508951.sh + export PYTHONUNBUFFERED=1 + ./scripts/obs/update_obs_project.py --apiurl https://obs.osmocom.org --conflict-version --docker --feed master --meta osmocom:master docker: building image debian-12-osmocom-obs-build-srcpkg + run_in_docker_and_exit(): ['docker', 'build', '--build-arg', 'DISTRO=debian:12', '--build-arg', 'DISTRO_FROM=debian:12', '--build-arg', 'UID=1000', '-t', 'debian-12-osmocom-obs-build-srcpkg', '-f', 'https://jenkins.osmocom.org/jenkins/job/Osmocom_OBS_master/ws/scripts/obs/data/build_srcpkg.Dockerfile', 'https://jenkins.osmocom.org/jenkins/job/Osmocom_OBS_master/ws/scripts/obs/data'] #0 building with "default" instance using docker driver
#1 [internal] load build definition from build_srcpkg.Dockerfile #1 transferring dockerfile: 579B done #1 WARN: InvalidDefaultArgInFrom: Default value for ARG ${DISTRO_FROM} results in empty or invalid base image name (line 3) #1 DONE 0.0s
#2 [internal] load metadata for docker.io/library/debian:12 #2 DONE 0.9s
#3 [internal] load .dockerignore #3 transferring context: 2B done #3 DONE 0.0s
#4 [1/3] FROM docker.io/library/debian:12@sha256:18023f131f52fc3ea21973cabffe0b216c60b417fd2478e94d9d59981ebba6af #4 DONE 0.0s
#5 [2/3] RUN APT-GET update && apt-get upgrade -y && apt-get install -y --no-install-recommends ca-certificates colordiff debhelper dh-python dpkg-dev fakeroot git git-review gnupg2 libxml2-utils lsb-release meson osc python3-packaging python3-setuptools quilt rebar3 sed sphinx-common && apt-get clean #5 CACHED
#6 [3/3] RUN USERADD --uid=1000 -m user #6 CACHED
#7 exporting to image #7 exporting layers done #7 writing image sha256:2a9dd95b35028e4d71315e59c45ba43dc43f920d55d8b4980b221443515a5cd4 0.0s done #7 naming to docker.io/library/debian-12-osmocom-obs-build-srcpkg 0.0s done #7 DONE 0.0s
[33m1 warning found (use docker --debug to expand): [0m - InvalidDefaultArgInFrom: Default value for ARG ${DISTRO_FROM} results in empty or invalid base image name (line 3) docker: running: update_obs_project.py inside docker OBS: getting packages in osmocom:master Traceback (most recent call last): File "/obs/update_obs_project.py", line 265, in <module>
ERROR: command failed unexpectedly
*** command *** ['osc', '-A', 'https://obs.osmocom.org', 'list', 'osmocom:master']
*** returncode *** 1
*** output *** Server returned an error: HTTP Error 503: Service Unavailable
Request: https://obs.osmocom.org/source/osmocom:master Headers: Server: nginx Date: Fri, 04 Apr 2025 05:20:17 GMT Content-Type: text/html; charset=UTF-8 Content-Length: 189 Connection: close cache-control: no-cache, no-store, must-revalidate Status: 503 Service Unavailable Cache-Control: public
*** python trace *** main() File "/obs/update_obs_project.py", line 257, in main pkgs_remote = lib.osc.get_remote_pkgs() ^^^^^^^^^^^^^^^^^^^^^^^^^ File "/obs/lib/osc.py", line 63, in get_remote_pkgs ret = run_osc(["list", proj]) ^^^^^^^^^^^^^^^^^^^^^^^ File "/obs/lib/osc.py", line 58, in run_osc return lib.run_cmd(cmd, *args, **kwargs) ^^^^^^^^^^^^^^^^^^^^^^^^^^^^^^^^^ File "/obs/lib/__init__.py", line 200, in run_cmd exit_error_cmd(p, "command failed unexpectedly") File "/obs/lib/__init__.py", line 161, in exit_error_cmd raise RuntimeError("shell command related error, find details right above" RuntimeError: shell command related error, find details right above this python trace Build step 'Execute shell' marked build as failure
See https://jenkins.osmocom.org/jenkins/job/Osmocom_OBS_master/93700/display/redirect
Changes:
------------------------------------------ Started by upstream project "master-no2bootloader" build number 1600 originally caused by: Started by timer Running as SYSTEM Building remotely on build4-deb12build-ansible (ttcn3 obs osmo-gsm-tester-build ttcn3_with_linux_6.1_or_higher qemu io_uring osmocom-gerrit coverity osmocom-master) in workspace https://jenkins.osmocom.org/jenkins/job/Osmocom_OBS_master/ws/ The recommended git tool is: NONE No credentials specified Wiping out workspace first. Cloning the remote Git repository Cloning repository https://gerrit.osmocom.org/osmo-ci
git init https://jenkins.osmocom.org/jenkins/job/Osmocom_OBS_master/ws/ # timeout=10
Fetching upstream changes from https://gerrit.osmocom.org/osmo-ci
git --version # timeout=10 git --version # 'git version 2.39.5' git fetch --tags --force --progress -- https://gerrit.osmocom.org/osmo-ci +refs/heads/*:refs/remotes/origin/* # timeout=10 git config remote.origin.url https://gerrit.osmocom.org/osmo-ci # timeout=10 git config --add remote.origin.fetch +refs/heads/*:refs/remotes/origin/* # timeout=10
Avoid second fetch
git rev-parse refs/remotes/origin/refs/remotes/origin/master^{commit} # timeout=10 git rev-parse refs/remotes/origin/master^{commit} # timeout=10
Checking out Revision 9a18ebaa78fc255a0aea42186a2743829d69162e (refs/remotes/origin/master)
git config core.sparsecheckout # timeout=10 git checkout -f 9a18ebaa78fc255a0aea42186a2743829d69162e # timeout=10
Commit message: "obs: gerrit_binpkgs: set --allow-unknown-package"
git rev-list --no-walk 9a18ebaa78fc255a0aea42186a2743829d69162e # timeout=10
[Osmocom_OBS_master] $ /bin/sh -xe /tmp/jenkins7068772934770765149.sh + export PYTHONUNBUFFERED=1 + ./scripts/obs/update_obs_project.py --apiurl https://obs.osmocom.org --conflict-version --docker --feed master --meta osmocom:master docker: building image debian-12-osmocom-obs-build-srcpkg + run_in_docker_and_exit(): ['docker', 'build', '--build-arg', 'DISTRO=debian:12', '--build-arg', 'DISTRO_FROM=debian:12', '--build-arg', 'UID=1000', '-t', 'debian-12-osmocom-obs-build-srcpkg', '-f', 'https://jenkins.osmocom.org/jenkins/job/Osmocom_OBS_master/ws/scripts/obs/data/build_srcpkg.Dockerfile', 'https://jenkins.osmocom.org/jenkins/job/Osmocom_OBS_master/ws/scripts/obs/data'] #0 building with "default" instance using docker driver
#1 [internal] load build definition from build_srcpkg.Dockerfile #1 transferring dockerfile: 579B done #1 WARN: InvalidDefaultArgInFrom: Default value for ARG ${DISTRO_FROM} results in empty or invalid base image name (line 3) #1 DONE 0.0s
#2 [internal] load metadata for docker.io/library/debian:12 #2 DONE 0.8s
#3 [internal] load .dockerignore #3 transferring context: 2B done #3 DONE 0.0s
#4 [1/3] FROM docker.io/library/debian:12@sha256:18023f131f52fc3ea21973cabffe0b216c60b417fd2478e94d9d59981ebba6af #4 DONE 0.0s
#5 [2/3] RUN APT-GET update && apt-get upgrade -y && apt-get install -y --no-install-recommends ca-certificates colordiff debhelper dh-python dpkg-dev fakeroot git git-review gnupg2 libxml2-utils lsb-release meson osc python3-packaging python3-setuptools quilt rebar3 sed sphinx-common && apt-get clean #5 CACHED
#6 [3/3] RUN USERADD --uid=1000 -m user #6 CACHED
#7 exporting to image #7 exporting layers done #7 writing image sha256:2a9dd95b35028e4d71315e59c45ba43dc43f920d55d8b4980b221443515a5cd4 done #7 naming to docker.io/library/debian-12-osmocom-obs-build-srcpkg done #7 DONE 0.0s
[33m1 warning found (use docker --debug to expand): [0m - InvalidDefaultArgInFrom: Default value for ARG ${DISTRO_FROM} results in empty or invalid base image name (line 3) docker: running: update_obs_project.py inside docker OBS: getting packages in osmocom:master Traceback (most recent call last): File "/obs/update_obs_project.py", line 265, in <module>
ERROR: command failed unexpectedly
*** command *** ['osc', '-A', 'https://obs.osmocom.org', 'list', 'osmocom:master']
*** returncode *** 1
*** output *** Server returned an error: HTTP Error 503: Service Unavailable
Request: https://obs.osmocom.org/source/osmocom:master Headers: Server: nginx Date: Fri, 04 Apr 2025 05:25:27 GMT Content-Type: text/html; charset=UTF-8 Content-Length: 189 Connection: close cache-control: no-cache, no-store, must-revalidate Status: 503 Service Unavailable Cache-Control: public
*** python trace *** main() File "/obs/update_obs_project.py", line 257, in main pkgs_remote = lib.osc.get_remote_pkgs() ^^^^^^^^^^^^^^^^^^^^^^^^^ File "/obs/lib/osc.py", line 63, in get_remote_pkgs ret = run_osc(["list", proj]) ^^^^^^^^^^^^^^^^^^^^^^^ File "/obs/lib/osc.py", line 58, in run_osc return lib.run_cmd(cmd, *args, **kwargs) ^^^^^^^^^^^^^^^^^^^^^^^^^^^^^^^^^ File "/obs/lib/__init__.py", line 200, in run_cmd exit_error_cmd(p, "command failed unexpectedly") File "/obs/lib/__init__.py", line 161, in exit_error_cmd raise RuntimeError("shell command related error, find details right above" RuntimeError: shell command related error, find details right above this python trace Build step 'Execute shell' marked build as failure
See https://jenkins.osmocom.org/jenkins/job/Osmocom_OBS_master/93701/display/redirect
Changes:
------------------------------------------ Started by upstream project "master-libasn1c" build number 2671 originally caused by: Started by timer Running as SYSTEM Building remotely on build5-deb12build-ansible (ttcn3 obs osmo-gsm-tester-build ttcn3-ggsn-test-kernel-git ttcn3_with_linux_6.1_or_higher qemu io_uring osmocom-gerrit coverity osmocom-master) in workspace https://jenkins.osmocom.org/jenkins/job/Osmocom_OBS_master/ws/ The recommended git tool is: NONE No credentials specified Wiping out workspace first. Cloning the remote Git repository Cloning repository https://gerrit.osmocom.org/osmo-ci
git init https://jenkins.osmocom.org/jenkins/job/Osmocom_OBS_master/ws/ # timeout=10
Fetching upstream changes from https://gerrit.osmocom.org/osmo-ci
git --version # timeout=10 git --version # 'git version 2.39.5' git fetch --tags --force --progress -- https://gerrit.osmocom.org/osmo-ci +refs/heads/*:refs/remotes/origin/* # timeout=10 git config remote.origin.url https://gerrit.osmocom.org/osmo-ci # timeout=10 git config --add remote.origin.fetch +refs/heads/*:refs/remotes/origin/* # timeout=10
Avoid second fetch
git rev-parse refs/remotes/origin/refs/remotes/origin/master^{commit} # timeout=10 git rev-parse refs/remotes/origin/master^{commit} # timeout=10
Checking out Revision 9a18ebaa78fc255a0aea42186a2743829d69162e (refs/remotes/origin/master)
git config core.sparsecheckout # timeout=10 git checkout -f 9a18ebaa78fc255a0aea42186a2743829d69162e # timeout=10
Commit message: "obs: gerrit_binpkgs: set --allow-unknown-package"
git rev-list --no-walk 9a18ebaa78fc255a0aea42186a2743829d69162e # timeout=10
[Osmocom_OBS_master] $ /bin/sh -xe /tmp/jenkins951883734735943819.sh + export PYTHONUNBUFFERED=1 + ./scripts/obs/update_obs_project.py --apiurl https://obs.osmocom.org --conflict-version --docker --feed master --meta osmocom:master docker: building image debian-12-osmocom-obs-build-srcpkg + run_in_docker_and_exit(): ['docker', 'build', '--build-arg', 'DISTRO=debian:12', '--build-arg', 'DISTRO_FROM=debian:12', '--build-arg', 'UID=1000', '-t', 'debian-12-osmocom-obs-build-srcpkg', '-f', 'https://jenkins.osmocom.org/jenkins/job/Osmocom_OBS_master/ws/scripts/obs/data/build_srcpkg.Dockerfile', 'https://jenkins.osmocom.org/jenkins/job/Osmocom_OBS_master/ws/scripts/obs/data'] #0 building with "default" instance using docker driver
#1 [internal] load build definition from build_srcpkg.Dockerfile #1 transferring dockerfile: 579B done #1 WARN: InvalidDefaultArgInFrom: Default value for ARG ${DISTRO_FROM} results in empty or invalid base image name (line 3) #1 DONE 0.1s
#2 [internal] load metadata for docker.io/library/debian:12 #2 DONE 1.2s
#3 [internal] load .dockerignore #3 transferring context: 2B done #3 DONE 0.1s
#4 [1/3] FROM docker.io/library/debian:12@sha256:18023f131f52fc3ea21973cabffe0b216c60b417fd2478e94d9d59981ebba6af #4 resolve docker.io/library/debian:12@sha256:18023f131f52fc3ea21973cabffe0b216c60b417fd2478e94d9d59981ebba6af 0.0s done #4 DONE 0.0s
#5 [2/3] RUN APT-GET update && apt-get upgrade -y && apt-get install -y --no-install-recommends ca-certificates colordiff debhelper dh-python dpkg-dev fakeroot git git-review gnupg2 libxml2-utils lsb-release meson osc python3-packaging python3-setuptools quilt rebar3 sed sphinx-common && apt-get clean #5 CACHED
#6 [3/3] RUN USERADD --uid=1000 -m user #6 CACHED
#7 exporting to image #7 exporting layers done #7 writing image sha256:bc6a5998c69e89ffa8b1575b367bf8e7e099cfb23989f67da73b87732b6acf83 done #7 naming to docker.io/library/debian-12-osmocom-obs-build-srcpkg 0.0s done #7 DONE 0.0s
[33m1 warning found (use docker --debug to expand): [0m - InvalidDefaultArgInFrom: Default value for ARG ${DISTRO_FROM} results in empty or invalid base image name (line 3) docker: running: update_obs_project.py inside docker OBS: getting packages in osmocom:master Traceback (most recent call last): File "/obs/update_obs_project.py", line 265, in <module> main() File "/obs/update_obs_project.py", line 257, in main pkgs_remote = lib.osc.get_remote_pkgs() ^^^^^^^^^^^^^^^^^^^^^^^^^ File "/obs/lib/osc.py", line 63, in get_remote_pkgs
ERROR: command failed unexpectedly
*** command *** ['osc', '-A', 'https://obs.osmocom.org', 'list', 'osmocom:master']
*** returncode *** 1
*** output *** Server returned an error: HTTP Error 503: Service Unavailable
Request: https://obs.osmocom.org/source/osmocom:master Headers: Server: nginx Date: Fri, 04 Apr 2025 06:12:29 GMT Content-Type: text/html; charset=UTF-8 Content-Length: 189 Connection: close cache-control: no-cache, no-store, must-revalidate Status: 503 Service Unavailable Cache-Control: public
*** python trace *** ret = run_osc(["list", proj]) ^^^^^^^^^^^^^^^^^^^^^^^ File "/obs/lib/osc.py", line 58, in run_osc return lib.run_cmd(cmd, *args, **kwargs) ^^^^^^^^^^^^^^^^^^^^^^^^^^^^^^^^^ File "/obs/lib/__init__.py", line 200, in run_cmd exit_error_cmd(p, "command failed unexpectedly") File "/obs/lib/__init__.py", line 161, in exit_error_cmd raise RuntimeError("shell command related error, find details right above" RuntimeError: shell command related error, find details right above this python trace Build step 'Execute shell' marked build as failure
See https://jenkins.osmocom.org/jenkins/job/Osmocom_OBS_master/93702/display/redirect
Changes:
------------------------------------------ Started by upstream project "master-osmo-iuh" build number 18178 originally caused by: Started by upstream project "master-libasn1c" build number 2671 originally caused by: Started by timer Running as SYSTEM Building remotely on build5-deb12build-ansible (ttcn3 obs osmo-gsm-tester-build ttcn3-ggsn-test-kernel-git ttcn3_with_linux_6.1_or_higher qemu io_uring osmocom-gerrit coverity osmocom-master) in workspace https://jenkins.osmocom.org/jenkins/job/Osmocom_OBS_master/ws/ The recommended git tool is: NONE No credentials specified Wiping out workspace first. Cloning the remote Git repository Cloning repository https://gerrit.osmocom.org/osmo-ci
git init https://jenkins.osmocom.org/jenkins/job/Osmocom_OBS_master/ws/ # timeout=10
Fetching upstream changes from https://gerrit.osmocom.org/osmo-ci
git --version # timeout=10 git --version # 'git version 2.39.5' git fetch --tags --force --progress -- https://gerrit.osmocom.org/osmo-ci +refs/heads/*:refs/remotes/origin/* # timeout=10 git config remote.origin.url https://gerrit.osmocom.org/osmo-ci # timeout=10 git config --add remote.origin.fetch +refs/heads/*:refs/remotes/origin/* # timeout=10
Avoid second fetch
git rev-parse refs/remotes/origin/refs/remotes/origin/master^{commit} # timeout=10 git rev-parse refs/remotes/origin/master^{commit} # timeout=10
Checking out Revision 9a18ebaa78fc255a0aea42186a2743829d69162e (refs/remotes/origin/master)
git config core.sparsecheckout # timeout=10 git checkout -f 9a18ebaa78fc255a0aea42186a2743829d69162e # timeout=10
Commit message: "obs: gerrit_binpkgs: set --allow-unknown-package"
git rev-list --no-walk 9a18ebaa78fc255a0aea42186a2743829d69162e # timeout=10
[Osmocom_OBS_master] $ /bin/sh -xe /tmp/jenkins8123170321887328140.sh + export PYTHONUNBUFFERED=1 + ./scripts/obs/update_obs_project.py --apiurl https://obs.osmocom.org --conflict-version --docker --feed master --meta osmocom:master docker: building image debian-12-osmocom-obs-build-srcpkg + run_in_docker_and_exit(): ['docker', 'build', '--build-arg', 'DISTRO=debian:12', '--build-arg', 'DISTRO_FROM=debian:12', '--build-arg', 'UID=1000', '-t', 'debian-12-osmocom-obs-build-srcpkg', '-f', 'https://jenkins.osmocom.org/jenkins/job/Osmocom_OBS_master/ws/scripts/obs/data/build_srcpkg.Dockerfile', 'https://jenkins.osmocom.org/jenkins/job/Osmocom_OBS_master/ws/scripts/obs/data'] #0 building with "default" instance using docker driver
#1 [internal] load build definition from build_srcpkg.Dockerfile #1 transferring dockerfile: 579B done #1 WARN: InvalidDefaultArgInFrom: Default value for ARG ${DISTRO_FROM} results in empty or invalid base image name (line 3) #1 DONE 0.0s
#2 [internal] load metadata for docker.io/library/debian:12 #2 DONE 0.4s
#3 [internal] load .dockerignore #3 transferring context: 2B done #3 DONE 0.0s
#4 [1/3] FROM docker.io/library/debian:12@sha256:18023f131f52fc3ea21973cabffe0b216c60b417fd2478e94d9d59981ebba6af #4 resolve docker.io/library/debian:12@sha256:18023f131f52fc3ea21973cabffe0b216c60b417fd2478e94d9d59981ebba6af 0.0s done #4 DONE 0.0s
#5 [2/3] RUN APT-GET update && apt-get upgrade -y && apt-get install -y --no-install-recommends ca-certificates colordiff debhelper dh-python dpkg-dev fakeroot git git-review gnupg2 libxml2-utils lsb-release meson osc python3-packaging python3-setuptools quilt rebar3 sed sphinx-common && apt-get clean #5 CACHED
#6 [3/3] RUN USERADD --uid=1000 -m user #6 CACHED
#7 exporting to image #7 exporting layers done #7 writing image sha256:bc6a5998c69e89ffa8b1575b367bf8e7e099cfb23989f67da73b87732b6acf83 done #7 naming to docker.io/library/debian-12-osmocom-obs-build-srcpkg #7 naming to docker.io/library/debian-12-osmocom-obs-build-srcpkg 0.0s done #7 DONE 0.0s
[33m1 warning found (use docker --debug to expand): [0m - InvalidDefaultArgInFrom: Default value for ARG ${DISTRO_FROM} results in empty or invalid base image name (line 3) docker: running: update_obs_project.py inside docker OBS: getting packages in osmocom:master
ERROR: command failed unexpectedly
*** command *** ['osc', '-A', 'https://obs.osmocom.org', 'list', 'osmocom:master']
*** returncode *** 1
*** output *** Server returned an error: HTTP Error 503: Service Unavailable
Request: https://obs.osmocom.org/source/osmocom:master Headers: Server: nginx Date: Fri, 04 Apr 2025 06:14:58 GMT Content-Type: text/html; charset=UTF-8 Content-Length: 189 Connection: close cache-control: no-cache, no-store, must-revalidate Status: 503 Service Unavailable Cache-Control: public
*** python trace *** Traceback (most recent call last): File "/obs/update_obs_project.py", line 265, in <module> main() File "/obs/update_obs_project.py", line 257, in main pkgs_remote = lib.osc.get_remote_pkgs() ^^^^^^^^^^^^^^^^^^^^^^^^^ File "/obs/lib/osc.py", line 63, in get_remote_pkgs ret = run_osc(["list", proj]) ^^^^^^^^^^^^^^^^^^^^^^^ File "/obs/lib/osc.py", line 58, in run_osc return lib.run_cmd(cmd, *args, **kwargs) ^^^^^^^^^^^^^^^^^^^^^^^^^^^^^^^^^ File "/obs/lib/__init__.py", line 200, in run_cmd exit_error_cmd(p, "command failed unexpectedly") File "/obs/lib/__init__.py", line 161, in exit_error_cmd raise RuntimeError("shell command related error, find details right above" RuntimeError: shell command related error, find details right above this python trace Build step 'Execute shell' marked build as failure
See https://jenkins.osmocom.org/jenkins/job/Osmocom_OBS_master/93703/display/redirect
Changes:
------------------------------------------ Started by upstream project "master-osmo-hnbgw" build number 11425 originally caused by: Started by upstream project "master-osmo-iuh" build number 18178 originally caused by: Started by upstream project "master-libasn1c" build number 2671 originally caused by: Started by timer Running as SYSTEM Building remotely on build5-deb12build-ansible (ttcn3 obs osmo-gsm-tester-build ttcn3-ggsn-test-kernel-git ttcn3_with_linux_6.1_or_higher qemu io_uring osmocom-gerrit coverity osmocom-master) in workspace https://jenkins.osmocom.org/jenkins/job/Osmocom_OBS_master/ws/ The recommended git tool is: NONE No credentials specified Wiping out workspace first. Cloning the remote Git repository Cloning repository https://gerrit.osmocom.org/osmo-ci
git init https://jenkins.osmocom.org/jenkins/job/Osmocom_OBS_master/ws/ # timeout=10
Fetching upstream changes from https://gerrit.osmocom.org/osmo-ci
git --version # timeout=10 git --version # 'git version 2.39.5' git fetch --tags --force --progress -- https://gerrit.osmocom.org/osmo-ci +refs/heads/*:refs/remotes/origin/* # timeout=10 git config remote.origin.url https://gerrit.osmocom.org/osmo-ci # timeout=10 git config --add remote.origin.fetch +refs/heads/*:refs/remotes/origin/* # timeout=10
Avoid second fetch
git rev-parse refs/remotes/origin/refs/remotes/origin/master^{commit} # timeout=10 git rev-parse refs/remotes/origin/master^{commit} # timeout=10
Checking out Revision 9a18ebaa78fc255a0aea42186a2743829d69162e (refs/remotes/origin/master)
git config core.sparsecheckout # timeout=10 git checkout -f 9a18ebaa78fc255a0aea42186a2743829d69162e # timeout=10
Commit message: "obs: gerrit_binpkgs: set --allow-unknown-package"
git rev-list --no-walk 9a18ebaa78fc255a0aea42186a2743829d69162e # timeout=10
[Osmocom_OBS_master] $ /bin/sh -xe /tmp/jenkins4386103767526483743.sh + export PYTHONUNBUFFERED=1 + ./scripts/obs/update_obs_project.py --apiurl https://obs.osmocom.org --conflict-version --docker --feed master --meta osmocom:master docker: building image debian-12-osmocom-obs-build-srcpkg + run_in_docker_and_exit(): ['docker', 'build', '--build-arg', 'DISTRO=debian:12', '--build-arg', 'DISTRO_FROM=debian:12', '--build-arg', 'UID=1000', '-t', 'debian-12-osmocom-obs-build-srcpkg', '-f', 'https://jenkins.osmocom.org/jenkins/job/Osmocom_OBS_master/ws/scripts/obs/data/build_srcpkg.Dockerfile', 'https://jenkins.osmocom.org/jenkins/job/Osmocom_OBS_master/ws/scripts/obs/data'] #0 building with "default" instance using docker driver
#1 [internal] load build definition from build_srcpkg.Dockerfile #1 transferring dockerfile: 579B done #1 WARN: InvalidDefaultArgInFrom: Default value for ARG ${DISTRO_FROM} results in empty or invalid base image name (line 3) #1 DONE 0.0s
#2 [internal] load metadata for docker.io/library/debian:12 #2 DONE 0.4s
#3 [internal] load .dockerignore #3 transferring context: 2B done #3 DONE 0.0s
#4 [1/3] FROM docker.io/library/debian:12@sha256:18023f131f52fc3ea21973cabffe0b216c60b417fd2478e94d9d59981ebba6af #4 resolve docker.io/library/debian:12@sha256:18023f131f52fc3ea21973cabffe0b216c60b417fd2478e94d9d59981ebba6af 0.0s done #4 DONE 0.0s
#5 [2/3] RUN APT-GET update && apt-get upgrade -y && apt-get install -y --no-install-recommends ca-certificates colordiff debhelper dh-python dpkg-dev fakeroot git git-review gnupg2 libxml2-utils lsb-release meson osc python3-packaging python3-setuptools quilt rebar3 sed sphinx-common && apt-get clean #5 CACHED
#6 [3/3] RUN USERADD --uid=1000 -m user #6 CACHED
#7 exporting to image #7 exporting layers done #7 writing image sha256:bc6a5998c69e89ffa8b1575b367bf8e7e099cfb23989f67da73b87732b6acf83 0.0s done #7 naming to docker.io/library/debian-12-osmocom-obs-build-srcpkg #7 naming to docker.io/library/debian-12-osmocom-obs-build-srcpkg done #7 DONE 0.0s
[33m1 warning found (use docker --debug to expand): [0m - InvalidDefaultArgInFrom: Default value for ARG ${DISTRO_FROM} results in empty or invalid base image name (line 3) docker: running: update_obs_project.py inside docker OBS: getting packages in osmocom:master
ERROR: command failed unexpectedly
*** command *** ['osc', '-A', 'https://obs.osmocom.org', 'list', 'osmocom:master']
*** returncode *** 1
*** output *** Server returned an error: HTTP Error 503: Service Unavailable
Request: https://obs.osmocom.org/source/osmocom:master Headers: Server: nginx Date: Fri, 04 Apr 2025 06:16:53 GMT Content-Type: text/html; charset=UTF-8 Content-Length: 189 Connection: close cache-control: no-cache, no-store, must-revalidate Status: 503 Service Unavailable Cache-Control: public
*** python trace *** Traceback (most recent call last): File "/obs/update_obs_project.py", line 265, in <module> main() File "/obs/update_obs_project.py", line 257, in main pkgs_remote = lib.osc.get_remote_pkgs() ^^^^^^^^^^^^^^^^^^^^^^^^^ File "/obs/lib/osc.py", line 63, in get_remote_pkgs ret = run_osc(["list", proj]) ^^^^^^^^^^^^^^^^^^^^^^^ File "/obs/lib/osc.py", line 58, in run_osc return lib.run_cmd(cmd, *args, **kwargs) ^^^^^^^^^^^^^^^^^^^^^^^^^^^^^^^^^ File "/obs/lib/__init__.py", line 200, in run_cmd exit_error_cmd(p, "command failed unexpectedly") File "/obs/lib/__init__.py", line 161, in exit_error_cmd raise RuntimeError("shell command related error, find details right above" RuntimeError: shell command related error, find details right above this python trace Build step 'Execute shell' marked build as failure
See https://jenkins.osmocom.org/jenkins/job/Osmocom_OBS_master/93704/display/redirect
Changes:
------------------------------------------ Started by upstream project "master-osmo-hnodeb" build number 8761 originally caused by: Started by upstream project "master-osmo-iuh" build number 18178 originally caused by: Started by upstream project "master-libasn1c" build number 2671 originally caused by: Started by timer Running as SYSTEM Building remotely on build4-deb12build-ansible (ttcn3 obs osmo-gsm-tester-build ttcn3_with_linux_6.1_or_higher qemu io_uring osmocom-gerrit coverity osmocom-master) in workspace https://jenkins.osmocom.org/jenkins/job/Osmocom_OBS_master/ws/ The recommended git tool is: NONE No credentials specified Wiping out workspace first. Cloning the remote Git repository Cloning repository https://gerrit.osmocom.org/osmo-ci
git init https://jenkins.osmocom.org/jenkins/job/Osmocom_OBS_master/ws/ # timeout=10
Fetching upstream changes from https://gerrit.osmocom.org/osmo-ci
git --version # timeout=10 git --version # 'git version 2.39.5' git fetch --tags --force --progress -- https://gerrit.osmocom.org/osmo-ci +refs/heads/*:refs/remotes/origin/* # timeout=10 git config remote.origin.url https://gerrit.osmocom.org/osmo-ci # timeout=10 git config --add remote.origin.fetch +refs/heads/*:refs/remotes/origin/* # timeout=10
Avoid second fetch
git rev-parse refs/remotes/origin/refs/remotes/origin/master^{commit} # timeout=10 git rev-parse refs/remotes/origin/master^{commit} # timeout=10
Checking out Revision 9a18ebaa78fc255a0aea42186a2743829d69162e (refs/remotes/origin/master)
git config core.sparsecheckout # timeout=10 git checkout -f 9a18ebaa78fc255a0aea42186a2743829d69162e # timeout=10
Commit message: "obs: gerrit_binpkgs: set --allow-unknown-package"
git rev-list --no-walk 9a18ebaa78fc255a0aea42186a2743829d69162e # timeout=10
[Osmocom_OBS_master] $ /bin/sh -xe /tmp/jenkins1890754468690988064.sh + export PYTHONUNBUFFERED=1 + ./scripts/obs/update_obs_project.py --apiurl https://obs.osmocom.org --conflict-version --docker --feed master --meta osmocom:master docker: building image debian-12-osmocom-obs-build-srcpkg + run_in_docker_and_exit(): ['docker', 'build', '--build-arg', 'DISTRO=debian:12', '--build-arg', 'DISTRO_FROM=debian:12', '--build-arg', 'UID=1000', '-t', 'debian-12-osmocom-obs-build-srcpkg', '-f', 'https://jenkins.osmocom.org/jenkins/job/Osmocom_OBS_master/ws/scripts/obs/data/build_srcpkg.Dockerfile', 'https://jenkins.osmocom.org/jenkins/job/Osmocom_OBS_master/ws/scripts/obs/data'] #0 building with "default" instance using docker driver
#1 [internal] load build definition from build_srcpkg.Dockerfile #1 transferring dockerfile: 579B done #1 WARN: InvalidDefaultArgInFrom: Default value for ARG ${DISTRO_FROM} results in empty or invalid base image name (line 3) #1 DONE 0.1s
#2 [internal] load metadata for docker.io/library/debian:12 #2 DONE 0.8s
#3 [internal] load .dockerignore #3 transferring context: 2B done #3 DONE 0.1s
#4 [1/3] FROM docker.io/library/debian:12@sha256:18023f131f52fc3ea21973cabffe0b216c60b417fd2478e94d9d59981ebba6af #4 DONE 0.0s
#5 [2/3] RUN APT-GET update && apt-get upgrade -y && apt-get install -y --no-install-recommends ca-certificates colordiff debhelper dh-python dpkg-dev fakeroot git git-review gnupg2 libxml2-utils lsb-release meson osc python3-packaging python3-setuptools quilt rebar3 sed sphinx-common && apt-get clean #5 CACHED
#6 [3/3] RUN USERADD --uid=1000 -m user #6 CACHED
#7 exporting to image #7 exporting layers done #7 writing image sha256:2a9dd95b35028e4d71315e59c45ba43dc43f920d55d8b4980b221443515a5cd4 done #7 naming to docker.io/library/debian-12-osmocom-obs-build-srcpkg done #7 DONE 0.0s
[33m1 warning found (use docker --debug to expand): [0m - InvalidDefaultArgInFrom: Default value for ARG ${DISTRO_FROM} results in empty or invalid base image name (line 3) docker: running: update_obs_project.py inside docker OBS: getting packages in osmocom:master
ERROR: command failed unexpectedly
*** command *** ['osc', '-A', 'https://obs.osmocom.org', 'list', 'osmocom:master']
*** returncode *** 1
*** output *** Server returned an error: HTTP Error 503: Service Unavailable
Request: https://obs.osmocom.org/source/osmocom:master Headers: Server: nginx Date: Fri, 04 Apr 2025 06:17:08 GMT Content-Type: text/html; charset=UTF-8 Content-Length: 189 Connection: close cache-control: no-cache, no-store, must-revalidate Status: 503 Service Unavailable Cache-Control: public
*** python trace *** Traceback (most recent call last): File "/obs/update_obs_project.py", line 265, in <module> main() File "/obs/update_obs_project.py", line 257, in main pkgs_remote = lib.osc.get_remote_pkgs() ^^^^^^^^^^^^^^^^^^^^^^^^^ File "/obs/lib/osc.py", line 63, in get_remote_pkgs ret = run_osc(["list", proj]) ^^^^^^^^^^^^^^^^^^^^^^^ File "/obs/lib/osc.py", line 58, in run_osc return lib.run_cmd(cmd, *args, **kwargs) ^^^^^^^^^^^^^^^^^^^^^^^^^^^^^^^^^ File "/obs/lib/__init__.py", line 200, in run_cmd exit_error_cmd(p, "command failed unexpectedly") File "/obs/lib/__init__.py", line 161, in exit_error_cmd raise RuntimeError("shell command related error, find details right above" RuntimeError: shell command related error, find details right above this python trace Build step 'Execute shell' marked build as failure
See https://jenkins.osmocom.org/jenkins/job/Osmocom_OBS_master/93705/display/redirect
Changes:
------------------------------------------ Started by upstream project "master-osmo-sgsn" build number 52763 originally caused by: Started by upstream project "master-osmo-iuh" build number 18178 originally caused by: Started by upstream project "master-libasn1c" build number 2671 originally caused by: Started by timer Running as SYSTEM Building remotely on build4-deb12build-ansible (ttcn3 obs osmo-gsm-tester-build ttcn3_with_linux_6.1_or_higher qemu io_uring osmocom-gerrit coverity osmocom-master) in workspace https://jenkins.osmocom.org/jenkins/job/Osmocom_OBS_master/ws/ The recommended git tool is: NONE No credentials specified Wiping out workspace first. Cloning the remote Git repository Cloning repository https://gerrit.osmocom.org/osmo-ci
git init https://jenkins.osmocom.org/jenkins/job/Osmocom_OBS_master/ws/ # timeout=10
Fetching upstream changes from https://gerrit.osmocom.org/osmo-ci
git --version # timeout=10 git --version # 'git version 2.39.5' git fetch --tags --force --progress -- https://gerrit.osmocom.org/osmo-ci +refs/heads/*:refs/remotes/origin/* # timeout=10 git config remote.origin.url https://gerrit.osmocom.org/osmo-ci # timeout=10 git config --add remote.origin.fetch +refs/heads/*:refs/remotes/origin/* # timeout=10
Avoid second fetch
git rev-parse refs/remotes/origin/refs/remotes/origin/master^{commit} # timeout=10 git rev-parse refs/remotes/origin/master^{commit} # timeout=10
Checking out Revision 9a18ebaa78fc255a0aea42186a2743829d69162e (refs/remotes/origin/master)
git config core.sparsecheckout # timeout=10 git checkout -f 9a18ebaa78fc255a0aea42186a2743829d69162e # timeout=10
Commit message: "obs: gerrit_binpkgs: set --allow-unknown-package"
git rev-list --no-walk 9a18ebaa78fc255a0aea42186a2743829d69162e # timeout=10
[Osmocom_OBS_master] $ /bin/sh -xe /tmp/jenkins991775192534735823.sh + export PYTHONUNBUFFERED=1 + ./scripts/obs/update_obs_project.py --apiurl https://obs.osmocom.org --conflict-version --docker --feed master --meta osmocom:master docker: building image debian-12-osmocom-obs-build-srcpkg + run_in_docker_and_exit(): ['docker', 'build', '--build-arg', 'DISTRO=debian:12', '--build-arg', 'DISTRO_FROM=debian:12', '--build-arg', 'UID=1000', '-t', 'debian-12-osmocom-obs-build-srcpkg', '-f', 'https://jenkins.osmocom.org/jenkins/job/Osmocom_OBS_master/ws/scripts/obs/data/build_srcpkg.Dockerfile', 'https://jenkins.osmocom.org/jenkins/job/Osmocom_OBS_master/ws/scripts/obs/data'] #0 building with "default" instance using docker driver
#1 [internal] load build definition from build_srcpkg.Dockerfile #1 transferring dockerfile: 579B done #1 WARN: InvalidDefaultArgInFrom: Default value for ARG ${DISTRO_FROM} results in empty or invalid base image name (line 3) #1 DONE 0.0s
#2 [internal] load metadata for docker.io/library/debian:12 #2 DONE 0.4s
#3 [internal] load .dockerignore #3 transferring context: 2B done #3 DONE 0.0s
#4 [1/3] FROM docker.io/library/debian:12@sha256:18023f131f52fc3ea21973cabffe0b216c60b417fd2478e94d9d59981ebba6af #4 DONE 0.0s
#5 [2/3] RUN APT-GET update && apt-get upgrade -y && apt-get install -y --no-install-recommends ca-certificates colordiff debhelper dh-python dpkg-dev fakeroot git git-review gnupg2 libxml2-utils lsb-release meson osc python3-packaging python3-setuptools quilt rebar3 sed sphinx-common && apt-get clean #5 CACHED
#6 [3/3] RUN USERADD --uid=1000 -m user #6 CACHED
#7 exporting to image #7 exporting layers done #7 writing image sha256:2a9dd95b35028e4d71315e59c45ba43dc43f920d55d8b4980b221443515a5cd4 done #7 naming to docker.io/library/debian-12-osmocom-obs-build-srcpkg done #7 DONE 0.0s
[33m1 warning found (use docker --debug to expand): [0m - InvalidDefaultArgInFrom: Default value for ARG ${DISTRO_FROM} results in empty or invalid base image name (line 3) docker: running: update_obs_project.py inside docker OBS: getting packages in osmocom:master
ERROR: command failed unexpectedly
*** command *** ['osc', '-A', 'https://obs.osmocom.org', 'list', 'osmocom:master']
*** returncode *** 1
*** output *** Server returned an error: HTTP Error 503: Service Unavailable
Request: https://obs.osmocom.org/source/osmocom:master Headers: Server: nginx Date: Fri, 04 Apr 2025 06:18:24 GMT Content-Type: text/html; charset=UTF-8 Content-Length: 189 Connection: close cache-control: no-cache, no-store, must-revalidate Status: 503 Service Unavailable Cache-Control: public
*** python trace *** Traceback (most recent call last): File "/obs/update_obs_project.py", line 265, in <module> main() File "/obs/update_obs_project.py", line 257, in main pkgs_remote = lib.osc.get_remote_pkgs() ^^^^^^^^^^^^^^^^^^^^^^^^^ File "/obs/lib/osc.py", line 63, in get_remote_pkgs ret = run_osc(["list", proj]) ^^^^^^^^^^^^^^^^^^^^^^^ File "/obs/lib/osc.py", line 58, in run_osc return lib.run_cmd(cmd, *args, **kwargs) ^^^^^^^^^^^^^^^^^^^^^^^^^^^^^^^^^ File "/obs/lib/__init__.py", line 200, in run_cmd exit_error_cmd(p, "command failed unexpectedly") File "/obs/lib/__init__.py", line 161, in exit_error_cmd raise RuntimeError("shell command related error, find details right above" RuntimeError: shell command related error, find details right above this python trace Build step 'Execute shell' marked build as failure
See https://jenkins.osmocom.org/jenkins/job/Osmocom_OBS_master/93706/display/redirect
Changes:
------------------------------------------ Started by upstream project "master-osmo-msc" build number 47789 originally caused by: Started by upstream project "master-osmo-iuh" build number 18178 originally caused by: Started by upstream project "master-libasn1c" build number 2671 originally caused by: Started by timer Running as SYSTEM Building remotely on build4-deb12build-ansible (ttcn3 obs osmo-gsm-tester-build ttcn3_with_linux_6.1_or_higher qemu io_uring osmocom-gerrit coverity osmocom-master) in workspace https://jenkins.osmocom.org/jenkins/job/Osmocom_OBS_master/ws/ The recommended git tool is: NONE No credentials specified Wiping out workspace first. Cloning the remote Git repository Cloning repository https://gerrit.osmocom.org/osmo-ci
git init https://jenkins.osmocom.org/jenkins/job/Osmocom_OBS_master/ws/ # timeout=10
Fetching upstream changes from https://gerrit.osmocom.org/osmo-ci
git --version # timeout=10 git --version # 'git version 2.39.5' git fetch --tags --force --progress -- https://gerrit.osmocom.org/osmo-ci +refs/heads/*:refs/remotes/origin/* # timeout=10 git config remote.origin.url https://gerrit.osmocom.org/osmo-ci # timeout=10 git config --add remote.origin.fetch +refs/heads/*:refs/remotes/origin/* # timeout=10
Avoid second fetch
git rev-parse refs/remotes/origin/refs/remotes/origin/master^{commit} # timeout=10 git rev-parse refs/remotes/origin/master^{commit} # timeout=10
Checking out Revision 9a18ebaa78fc255a0aea42186a2743829d69162e (refs/remotes/origin/master)
git config core.sparsecheckout # timeout=10 git checkout -f 9a18ebaa78fc255a0aea42186a2743829d69162e # timeout=10
Commit message: "obs: gerrit_binpkgs: set --allow-unknown-package"
git rev-list --no-walk 9a18ebaa78fc255a0aea42186a2743829d69162e # timeout=10
[Osmocom_OBS_master] $ /bin/sh -xe /tmp/jenkins2851354024547775751.sh + export PYTHONUNBUFFERED=1 + ./scripts/obs/update_obs_project.py --apiurl https://obs.osmocom.org --conflict-version --docker --feed master --meta osmocom:master docker: building image debian-12-osmocom-obs-build-srcpkg + run_in_docker_and_exit(): ['docker', 'build', '--build-arg', 'DISTRO=debian:12', '--build-arg', 'DISTRO_FROM=debian:12', '--build-arg', 'UID=1000', '-t', 'debian-12-osmocom-obs-build-srcpkg', '-f', 'https://jenkins.osmocom.org/jenkins/job/Osmocom_OBS_master/ws/scripts/obs/data/build_srcpkg.Dockerfile', 'https://jenkins.osmocom.org/jenkins/job/Osmocom_OBS_master/ws/scripts/obs/data'] #0 building with "default" instance using docker driver
#1 [internal] load build definition from build_srcpkg.Dockerfile #1 transferring dockerfile: 579B done #1 WARN: InvalidDefaultArgInFrom: Default value for ARG ${DISTRO_FROM} results in empty or invalid base image name (line 3) #1 DONE 0.0s
#2 [internal] load metadata for docker.io/library/debian:12 #2 DONE 0.4s
#3 [internal] load .dockerignore #3 transferring context: 2B done #3 DONE 0.0s
#4 [1/3] FROM docker.io/library/debian:12@sha256:18023f131f52fc3ea21973cabffe0b216c60b417fd2478e94d9d59981ebba6af #4 DONE 0.0s
#5 [2/3] RUN APT-GET update && apt-get upgrade -y && apt-get install -y --no-install-recommends ca-certificates colordiff debhelper dh-python dpkg-dev fakeroot git git-review gnupg2 libxml2-utils lsb-release meson osc python3-packaging python3-setuptools quilt rebar3 sed sphinx-common && apt-get clean #5 CACHED
#6 [3/3] RUN USERADD --uid=1000 -m user #6 CACHED
#7 exporting to image #7 exporting layers done #7 writing image sha256:2a9dd95b35028e4d71315e59c45ba43dc43f920d55d8b4980b221443515a5cd4 0.0s done #7 naming to docker.io/library/debian-12-osmocom-obs-build-srcpkg done #7 DONE 0.0s
[33m1 warning found (use docker --debug to expand): [0m - InvalidDefaultArgInFrom: Default value for ARG ${DISTRO_FROM} results in empty or invalid base image name (line 3) docker: running: update_obs_project.py inside docker OBS: getting packages in osmocom:master Traceback (most recent call last): File "/obs/update_obs_project.py", line 265, in <module>
ERROR: command failed unexpectedly
*** command *** ['osc', '-A', 'https://obs.osmocom.org', 'list', 'osmocom:master']
*** returncode *** 1
*** output *** Server returned an error: HTTP Error 503: Service Unavailable
Request: https://obs.osmocom.org/source/osmocom:master Headers: Server: nginx Date: Fri, 04 Apr 2025 06:18:38 GMT Content-Type: text/html; charset=UTF-8 Content-Length: 189 Connection: close cache-control: no-cache, no-store, must-revalidate Status: 503 Service Unavailable Cache-Control: public
*** python trace *** main() File "/obs/update_obs_project.py", line 257, in main pkgs_remote = lib.osc.get_remote_pkgs() ^^^^^^^^^^^^^^^^^^^^^^^^^ File "/obs/lib/osc.py", line 63, in get_remote_pkgs ret = run_osc(["list", proj]) ^^^^^^^^^^^^^^^^^^^^^^^ File "/obs/lib/osc.py", line 58, in run_osc return lib.run_cmd(cmd, *args, **kwargs) ^^^^^^^^^^^^^^^^^^^^^^^^^^^^^^^^^ File "/obs/lib/__init__.py", line 200, in run_cmd exit_error_cmd(p, "command failed unexpectedly") File "/obs/lib/__init__.py", line 161, in exit_error_cmd raise RuntimeError("shell command related error, find details right above" RuntimeError: shell command related error, find details right above this python trace Build step 'Execute shell' marked build as failure
See https://jenkins.osmocom.org/jenkins/job/Osmocom_OBS_master/93707/display/redirect
Changes:
------------------------------------------ Started by upstream project "master-android-apdu-proxy" build number 158 originally caused by: Started by timer Running as SYSTEM Building remotely on build5-deb12build-ansible (ttcn3 obs osmo-gsm-tester-build ttcn3-ggsn-test-kernel-git ttcn3_with_linux_6.1_or_higher qemu io_uring osmocom-gerrit coverity osmocom-master) in workspace https://jenkins.osmocom.org/jenkins/job/Osmocom_OBS_master/ws/ The recommended git tool is: NONE No credentials specified Wiping out workspace first. Cloning the remote Git repository Cloning repository https://gerrit.osmocom.org/osmo-ci
git init https://jenkins.osmocom.org/jenkins/job/Osmocom_OBS_master/ws/ # timeout=10
Fetching upstream changes from https://gerrit.osmocom.org/osmo-ci
git --version # timeout=10 git --version # 'git version 2.39.5' git fetch --tags --force --progress -- https://gerrit.osmocom.org/osmo-ci +refs/heads/*:refs/remotes/origin/* # timeout=10 git config remote.origin.url https://gerrit.osmocom.org/osmo-ci # timeout=10 git config --add remote.origin.fetch +refs/heads/*:refs/remotes/origin/* # timeout=10
Avoid second fetch
git rev-parse refs/remotes/origin/refs/remotes/origin/master^{commit} # timeout=10 git rev-parse refs/remotes/origin/master^{commit} # timeout=10
Checking out Revision 9a18ebaa78fc255a0aea42186a2743829d69162e (refs/remotes/origin/master)
git config core.sparsecheckout # timeout=10 git checkout -f 9a18ebaa78fc255a0aea42186a2743829d69162e # timeout=10
Commit message: "obs: gerrit_binpkgs: set --allow-unknown-package"
git rev-list --no-walk 9a18ebaa78fc255a0aea42186a2743829d69162e # timeout=10
[Osmocom_OBS_master] $ /bin/sh -xe /tmp/jenkins7902229244216935693.sh + export PYTHONUNBUFFERED=1 + ./scripts/obs/update_obs_project.py --apiurl https://obs.osmocom.org --conflict-version --docker --feed master --meta osmocom:master docker: building image debian-12-osmocom-obs-build-srcpkg + run_in_docker_and_exit(): ['docker', 'build', '--build-arg', 'DISTRO=debian:12', '--build-arg', 'DISTRO_FROM=debian:12', '--build-arg', 'UID=1000', '-t', 'debian-12-osmocom-obs-build-srcpkg', '-f', 'https://jenkins.osmocom.org/jenkins/job/Osmocom_OBS_master/ws/scripts/obs/data/build_srcpkg.Dockerfile', 'https://jenkins.osmocom.org/jenkins/job/Osmocom_OBS_master/ws/scripts/obs/data'] #0 building with "default" instance using docker driver
#1 [internal] load build definition from build_srcpkg.Dockerfile #1 transferring dockerfile: 579B done #1 WARN: InvalidDefaultArgInFrom: Default value for ARG ${DISTRO_FROM} results in empty or invalid base image name (line 3) #1 DONE 0.1s
#2 [internal] load metadata for docker.io/library/debian:12 #2 DONE 0.8s
#3 [internal] load .dockerignore #3 transferring context: 2B done #3 DONE 0.0s
#4 [1/3] FROM docker.io/library/debian:12@sha256:18023f131f52fc3ea21973cabffe0b216c60b417fd2478e94d9d59981ebba6af #4 resolve docker.io/library/debian:12@sha256:18023f131f52fc3ea21973cabffe0b216c60b417fd2478e94d9d59981ebba6af 0.0s done #4 DONE 0.0s
#5 [2/3] RUN APT-GET update && apt-get upgrade -y && apt-get install -y --no-install-recommends ca-certificates colordiff debhelper dh-python dpkg-dev fakeroot git git-review gnupg2 libxml2-utils lsb-release meson osc python3-packaging python3-setuptools quilt rebar3 sed sphinx-common && apt-get clean #5 CACHED
#6 [3/3] RUN USERADD --uid=1000 -m user #6 CACHED
#7 exporting to image #7 exporting layers done #7 writing image sha256:bc6a5998c69e89ffa8b1575b367bf8e7e099cfb23989f67da73b87732b6acf83 done #7 naming to docker.io/library/debian-12-osmocom-obs-build-srcpkg done #7 DONE 0.0s
[33m1 warning found (use docker --debug to expand): [0m - InvalidDefaultArgInFrom: Default value for ARG ${DISTRO_FROM} results in empty or invalid base image name (line 3) docker: running: update_obs_project.py inside docker OBS: getting packages in osmocom:master Traceback (most recent call last): File "/obs/update_obs_project.py", line 265, in <module> main() File "/obs/update_obs_project.py", line 257, in main pkgs_remote = lib.osc.get_remote_pkgs() ^^^^^^^^^^^^^^^^^^^^^^^^^ File "/obs/lib/osc.py", line 63, in get_remote_pkgs
ERROR: command failed unexpectedly
*** command *** ['osc', '-A', 'https://obs.osmocom.org', 'list', 'osmocom:master']
*** returncode *** 1
*** output *** Server returned an error: HTTP Error 503: Service Unavailable
Request: https://obs.osmocom.org/source/osmocom:master Headers: Server: nginx Date: Fri, 04 Apr 2025 06:25:18 GMT Content-Type: text/html; charset=UTF-8 Content-Length: 189 Connection: close cache-control: no-cache, no-store, must-revalidate Status: 503 Service Unavailable Cache-Control: public
*** python trace *** ret = run_osc(["list", proj]) ^^^^^^^^^^^^^^^^^^^^^^^ File "/obs/lib/osc.py", line 58, in run_osc return lib.run_cmd(cmd, *args, **kwargs) ^^^^^^^^^^^^^^^^^^^^^^^^^^^^^^^^^ File "/obs/lib/__init__.py", line 200, in run_cmd exit_error_cmd(p, "command failed unexpectedly") File "/obs/lib/__init__.py", line 161, in exit_error_cmd raise RuntimeError("shell command related error, find details right above" RuntimeError: shell command related error, find details right above this python trace Build step 'Execute shell' marked build as failure
See https://jenkins.osmocom.org/jenkins/job/Osmocom_OBS_master/93708/display/redirect
Changes:
------------------------------------------ Started by upstream project "master-osmo-bsc" build number 27643 originally caused by: Started by timer Running as SYSTEM Building remotely on build5-deb12build-ansible (ttcn3 obs osmo-gsm-tester-build ttcn3-ggsn-test-kernel-git ttcn3_with_linux_6.1_or_higher qemu io_uring osmocom-gerrit coverity osmocom-master) in workspace https://jenkins.osmocom.org/jenkins/job/Osmocom_OBS_master/ws/ The recommended git tool is: NONE No credentials specified Wiping out workspace first. Cloning the remote Git repository Cloning repository https://gerrit.osmocom.org/osmo-ci
git init https://jenkins.osmocom.org/jenkins/job/Osmocom_OBS_master/ws/ # timeout=10
Fetching upstream changes from https://gerrit.osmocom.org/osmo-ci
git --version # timeout=10 git --version # 'git version 2.39.5' git fetch --tags --force --progress -- https://gerrit.osmocom.org/osmo-ci +refs/heads/*:refs/remotes/origin/* # timeout=10 git config remote.origin.url https://gerrit.osmocom.org/osmo-ci # timeout=10 git config --add remote.origin.fetch +refs/heads/*:refs/remotes/origin/* # timeout=10
Avoid second fetch
git rev-parse refs/remotes/origin/refs/remotes/origin/master^{commit} # timeout=10 git rev-parse refs/remotes/origin/master^{commit} # timeout=10
Checking out Revision 9a18ebaa78fc255a0aea42186a2743829d69162e (refs/remotes/origin/master)
git config core.sparsecheckout # timeout=10 git checkout -f 9a18ebaa78fc255a0aea42186a2743829d69162e # timeout=10
Commit message: "obs: gerrit_binpkgs: set --allow-unknown-package"
git rev-list --no-walk 9a18ebaa78fc255a0aea42186a2743829d69162e # timeout=10
[Osmocom_OBS_master] $ /bin/sh -xe /tmp/jenkins3886962255115432927.sh + export PYTHONUNBUFFERED=1 + ./scripts/obs/update_obs_project.py --apiurl https://obs.osmocom.org --conflict-version --docker --feed master --meta osmocom:master docker: building image debian-12-osmocom-obs-build-srcpkg + run_in_docker_and_exit(): ['docker', 'build', '--build-arg', 'DISTRO=debian:12', '--build-arg', 'DISTRO_FROM=debian:12', '--build-arg', 'UID=1000', '-t', 'debian-12-osmocom-obs-build-srcpkg', '-f', 'https://jenkins.osmocom.org/jenkins/job/Osmocom_OBS_master/ws/scripts/obs/data/build_srcpkg.Dockerfile', 'https://jenkins.osmocom.org/jenkins/job/Osmocom_OBS_master/ws/scripts/obs/data'] #0 building with "default" instance using docker driver
#1 [internal] load build definition from build_srcpkg.Dockerfile #1 transferring dockerfile: 579B done #1 WARN: InvalidDefaultArgInFrom: Default value for ARG ${DISTRO_FROM} results in empty or invalid base image name (line 3) #1 DONE 0.0s
#2 [internal] load metadata for docker.io/library/debian:12 #2 DONE 0.7s
#3 [internal] load .dockerignore #3 transferring context: 2B done #3 DONE 0.0s
#4 [1/3] FROM docker.io/library/debian:12@sha256:18023f131f52fc3ea21973cabffe0b216c60b417fd2478e94d9d59981ebba6af #4 resolve docker.io/library/debian:12@sha256:18023f131f52fc3ea21973cabffe0b216c60b417fd2478e94d9d59981ebba6af 0.0s done #4 DONE 0.0s
#5 [2/3] RUN APT-GET update && apt-get upgrade -y && apt-get install -y --no-install-recommends ca-certificates colordiff debhelper dh-python dpkg-dev fakeroot git git-review gnupg2 libxml2-utils lsb-release meson osc python3-packaging python3-setuptools quilt rebar3 sed sphinx-common && apt-get clean #5 CACHED
#6 [3/3] RUN USERADD --uid=1000 -m user #6 CACHED
#7 exporting to image #7 exporting layers done #7 writing image sha256:bc6a5998c69e89ffa8b1575b367bf8e7e099cfb23989f67da73b87732b6acf83 #7 writing image sha256:bc6a5998c69e89ffa8b1575b367bf8e7e099cfb23989f67da73b87732b6acf83 done #7 naming to docker.io/library/debian-12-osmocom-obs-build-srcpkg done #7 DONE 0.0s
[33m1 warning found (use docker --debug to expand): [0m - InvalidDefaultArgInFrom: Default value for ARG ${DISTRO_FROM} results in empty or invalid base image name (line 3) docker: running: update_obs_project.py inside docker OBS: getting packages in osmocom:master Traceback (most recent call last): File "/obs/update_obs_project.py", line 265, in <module> main() File "/obs/update_obs_project.py", line 257, in main
ERROR: command failed unexpectedly
*** command *** ['osc', '-A', 'https://obs.osmocom.org', 'list', 'osmocom:master']
*** returncode *** 1
*** output *** Server returned an error: HTTP Error 503: Service Unavailable
Request: https://obs.osmocom.org/source/osmocom:master Headers: Server: nginx Date: Fri, 04 Apr 2025 06:30:43 GMT Content-Type: text/html; charset=UTF-8 Content-Length: 189 Connection: close cache-control: no-cache, no-store, must-revalidate Status: 503 Service Unavailable Cache-Control: public
*** python trace *** pkgs_remote = lib.osc.get_remote_pkgs() ^^^^^^^^^^^^^^^^^^^^^^^^^ File "/obs/lib/osc.py", line 63, in get_remote_pkgs ret = run_osc(["list", proj]) ^^^^^^^^^^^^^^^^^^^^^^^ File "/obs/lib/osc.py", line 58, in run_osc return lib.run_cmd(cmd, *args, **kwargs) ^^^^^^^^^^^^^^^^^^^^^^^^^^^^^^^^^ File "/obs/lib/__init__.py", line 200, in run_cmd exit_error_cmd(p, "command failed unexpectedly") File "/obs/lib/__init__.py", line 161, in exit_error_cmd raise RuntimeError("shell command related error, find details right above" RuntimeError: shell command related error, find details right above this python trace Build step 'Execute shell' marked build as failure
See https://jenkins.osmocom.org/jenkins/job/Osmocom_OBS_master/93709/display/redirect
Changes:
------------------------------------------ Started by upstream project "master-simtrace2" build number 2696 originally caused by: Started by timer Running as SYSTEM Building remotely on build5-deb12build-ansible (ttcn3 obs osmo-gsm-tester-build ttcn3-ggsn-test-kernel-git ttcn3_with_linux_6.1_or_higher qemu io_uring osmocom-gerrit coverity osmocom-master) in workspace https://jenkins.osmocom.org/jenkins/job/Osmocom_OBS_master/ws/ The recommended git tool is: NONE No credentials specified Wiping out workspace first. Cloning the remote Git repository Cloning repository https://gerrit.osmocom.org/osmo-ci
git init https://jenkins.osmocom.org/jenkins/job/Osmocom_OBS_master/ws/ # timeout=10
Fetching upstream changes from https://gerrit.osmocom.org/osmo-ci
git --version # timeout=10 git --version # 'git version 2.39.5' git fetch --tags --force --progress -- https://gerrit.osmocom.org/osmo-ci +refs/heads/*:refs/remotes/origin/* # timeout=10 git config remote.origin.url https://gerrit.osmocom.org/osmo-ci # timeout=10 git config --add remote.origin.fetch +refs/heads/*:refs/remotes/origin/* # timeout=10
Avoid second fetch
git rev-parse refs/remotes/origin/refs/remotes/origin/master^{commit} # timeout=10 git rev-parse refs/remotes/origin/master^{commit} # timeout=10
Checking out Revision 9a18ebaa78fc255a0aea42186a2743829d69162e (refs/remotes/origin/master)
git config core.sparsecheckout # timeout=10 git checkout -f 9a18ebaa78fc255a0aea42186a2743829d69162e # timeout=10
Commit message: "obs: gerrit_binpkgs: set --allow-unknown-package"
git rev-list --no-walk 9a18ebaa78fc255a0aea42186a2743829d69162e # timeout=10
[Osmocom_OBS_master] $ /bin/sh -xe /tmp/jenkins7728101011144140642.sh + export PYTHONUNBUFFERED=1 + ./scripts/obs/update_obs_project.py --apiurl https://obs.osmocom.org --conflict-version --docker --feed master --meta osmocom:master docker: building image debian-12-osmocom-obs-build-srcpkg + run_in_docker_and_exit(): ['docker', 'build', '--build-arg', 'DISTRO=debian:12', '--build-arg', 'DISTRO_FROM=debian:12', '--build-arg', 'UID=1000', '-t', 'debian-12-osmocom-obs-build-srcpkg', '-f', 'https://jenkins.osmocom.org/jenkins/job/Osmocom_OBS_master/ws/scripts/obs/data/build_srcpkg.Dockerfile', 'https://jenkins.osmocom.org/jenkins/job/Osmocom_OBS_master/ws/scripts/obs/data'] #0 building with "default" instance using docker driver
#1 [internal] load build definition from build_srcpkg.Dockerfile #1 transferring dockerfile: 579B done #1 WARN: InvalidDefaultArgInFrom: Default value for ARG ${DISTRO_FROM} results in empty or invalid base image name (line 3) #1 DONE 0.0s
#2 [internal] load metadata for docker.io/library/debian:12 #2 DONE 0.9s
#3 [internal] load .dockerignore #3 transferring context: 2B done #3 DONE 0.0s
#4 [1/3] FROM docker.io/library/debian:12@sha256:18023f131f52fc3ea21973cabffe0b216c60b417fd2478e94d9d59981ebba6af #4 resolve docker.io/library/debian:12@sha256:18023f131f52fc3ea21973cabffe0b216c60b417fd2478e94d9d59981ebba6af 0.0s done #4 DONE 0.0s
#5 [2/3] RUN APT-GET update && apt-get upgrade -y && apt-get install -y --no-install-recommends ca-certificates colordiff debhelper dh-python dpkg-dev fakeroot git git-review gnupg2 libxml2-utils lsb-release meson osc python3-packaging python3-setuptools quilt rebar3 sed sphinx-common && apt-get clean #5 CACHED
#6 [3/3] RUN USERADD --uid=1000 -m user #6 CACHED
#7 exporting to image #7 exporting layers done #7 writing image sha256:bc6a5998c69e89ffa8b1575b367bf8e7e099cfb23989f67da73b87732b6acf83 done #7 naming to docker.io/library/debian-12-osmocom-obs-build-srcpkg #7 naming to docker.io/library/debian-12-osmocom-obs-build-srcpkg done #7 DONE 0.0s
[33m1 warning found (use docker --debug to expand): [0m - InvalidDefaultArgInFrom: Default value for ARG ${DISTRO_FROM} results in empty or invalid base image name (line 3) docker: running: update_obs_project.py inside docker OBS: getting packages in osmocom:master Traceback (most recent call last): File "/obs/update_obs_project.py", line 265, in <module>
ERROR: command failed unexpectedly
*** command *** ['osc', '-A', 'https://obs.osmocom.org', 'list', 'osmocom:master']
*** returncode *** 1
*** output *** Server returned an error: HTTP Error 503: Service Unavailable
Request: https://obs.osmocom.org/source/osmocom:master Headers: Server: nginx Date: Fri, 04 Apr 2025 06:52:18 GMT Content-Type: text/html; charset=UTF-8 Content-Length: 189 Connection: close cache-control: no-cache, no-store, must-revalidate Status: 503 Service Unavailable Cache-Control: public
*** python trace *** main() File "/obs/update_obs_project.py", line 257, in main pkgs_remote = lib.osc.get_remote_pkgs() ^^^^^^^^^^^^^^^^^^^^^^^^^ File "/obs/lib/osc.py", line 63, in get_remote_pkgs ret = run_osc(["list", proj]) ^^^^^^^^^^^^^^^^^^^^^^^ File "/obs/lib/osc.py", line 58, in run_osc return lib.run_cmd(cmd, *args, **kwargs) ^^^^^^^^^^^^^^^^^^^^^^^^^^^^^^^^^ File "/obs/lib/__init__.py", line 200, in run_cmd exit_error_cmd(p, "command failed unexpectedly") File "/obs/lib/__init__.py", line 161, in exit_error_cmd raise RuntimeError("shell command related error, find details right above" RuntimeError: shell command related error, find details right above this python trace Build step 'Execute shell' marked build as failure
See https://jenkins.osmocom.org/jenkins/job/Osmocom_OBS_master/93710/display/redirect
Changes:
------------------------------------------ Started by upstream project "master-osmo-hnbgw" build number 11426 originally caused by: Started by timer Running as SYSTEM Building remotely on build5-deb12build-ansible (ttcn3 obs osmo-gsm-tester-build ttcn3-ggsn-test-kernel-git ttcn3_with_linux_6.1_or_higher qemu io_uring osmocom-gerrit coverity osmocom-master) in workspace https://jenkins.osmocom.org/jenkins/job/Osmocom_OBS_master/ws/ The recommended git tool is: NONE No credentials specified Wiping out workspace first. Cloning the remote Git repository Cloning repository https://gerrit.osmocom.org/osmo-ci
git init https://jenkins.osmocom.org/jenkins/job/Osmocom_OBS_master/ws/ # timeout=10
Fetching upstream changes from https://gerrit.osmocom.org/osmo-ci
git --version # timeout=10 git --version # 'git version 2.39.5' git fetch --tags --force --progress -- https://gerrit.osmocom.org/osmo-ci +refs/heads/*:refs/remotes/origin/* # timeout=10 git config remote.origin.url https://gerrit.osmocom.org/osmo-ci # timeout=10 git config --add remote.origin.fetch +refs/heads/*:refs/remotes/origin/* # timeout=10
Avoid second fetch
git rev-parse refs/remotes/origin/refs/remotes/origin/master^{commit} # timeout=10 git rev-parse refs/remotes/origin/master^{commit} # timeout=10
Checking out Revision 9a18ebaa78fc255a0aea42186a2743829d69162e (refs/remotes/origin/master)
git config core.sparsecheckout # timeout=10 git checkout -f 9a18ebaa78fc255a0aea42186a2743829d69162e # timeout=10
Commit message: "obs: gerrit_binpkgs: set --allow-unknown-package"
git rev-list --no-walk 9a18ebaa78fc255a0aea42186a2743829d69162e # timeout=10
[Osmocom_OBS_master] $ /bin/sh -xe /tmp/jenkins12092748152821770076.sh + export PYTHONUNBUFFERED=1 + ./scripts/obs/update_obs_project.py --apiurl https://obs.osmocom.org --conflict-version --docker --feed master --meta osmocom:master docker: building image debian-12-osmocom-obs-build-srcpkg + run_in_docker_and_exit(): ['docker', 'build', '--build-arg', 'DISTRO=debian:12', '--build-arg', 'DISTRO_FROM=debian:12', '--build-arg', 'UID=1000', '-t', 'debian-12-osmocom-obs-build-srcpkg', '-f', 'https://jenkins.osmocom.org/jenkins/job/Osmocom_OBS_master/ws/scripts/obs/data/build_srcpkg.Dockerfile', 'https://jenkins.osmocom.org/jenkins/job/Osmocom_OBS_master/ws/scripts/obs/data'] #0 building with "default" instance using docker driver
#1 [internal] load build definition from build_srcpkg.Dockerfile #1 transferring dockerfile: 579B done #1 WARN: InvalidDefaultArgInFrom: Default value for ARG ${DISTRO_FROM} results in empty or invalid base image name (line 3) #1 DONE 0.0s
#2 [internal] load metadata for docker.io/library/debian:12 #2 DONE 0.8s
#3 [internal] load .dockerignore #3 transferring context: 2B done #3 DONE 0.0s
#4 [1/3] FROM docker.io/library/debian:12@sha256:18023f131f52fc3ea21973cabffe0b216c60b417fd2478e94d9d59981ebba6af #4 resolve docker.io/library/debian:12@sha256:18023f131f52fc3ea21973cabffe0b216c60b417fd2478e94d9d59981ebba6af 0.0s done #4 DONE 0.0s
#5 [2/3] RUN APT-GET update && apt-get upgrade -y && apt-get install -y --no-install-recommends ca-certificates colordiff debhelper dh-python dpkg-dev fakeroot git git-review gnupg2 libxml2-utils lsb-release meson osc python3-packaging python3-setuptools quilt rebar3 sed sphinx-common && apt-get clean #5 CACHED
#6 [3/3] RUN USERADD --uid=1000 -m user #6 CACHED
#7 exporting to image #7 exporting layers done #7 writing image sha256:bc6a5998c69e89ffa8b1575b367bf8e7e099cfb23989f67da73b87732b6acf83 done #7 naming to docker.io/library/debian-12-osmocom-obs-build-srcpkg #7 naming to docker.io/library/debian-12-osmocom-obs-build-srcpkg done #7 DONE 0.0s
[33m1 warning found (use docker --debug to expand): [0m - InvalidDefaultArgInFrom: Default value for ARG ${DISTRO_FROM} results in empty or invalid base image name (line 3) docker: running: update_obs_project.py inside docker OBS: getting packages in osmocom:master Traceback (most recent call last): File "/obs/update_obs_project.py", line 265, in <module> main() File "/obs/update_obs_project.py", line 257, in main
ERROR: command failed unexpectedly
*** command *** ['osc', '-A', 'https://obs.osmocom.org', 'list', 'osmocom:master']
*** returncode *** 1
*** output *** Server returned an error: HTTP Error 503: Service Unavailable
Request: https://obs.osmocom.org/source/osmocom:master Headers: Server: nginx Date: Fri, 04 Apr 2025 07:35:00 GMT Content-Type: text/html; charset=UTF-8 Content-Length: 189 Connection: close cache-control: no-cache, no-store, must-revalidate Status: 503 Service Unavailable Cache-Control: public
*** python trace *** pkgs_remote = lib.osc.get_remote_pkgs() ^^^^^^^^^^^^^^^^^^^^^^^^^ File "/obs/lib/osc.py", line 63, in get_remote_pkgs ret = run_osc(["list", proj]) ^^^^^^^^^^^^^^^^^^^^^^^ File "/obs/lib/osc.py", line 58, in run_osc return lib.run_cmd(cmd, *args, **kwargs) ^^^^^^^^^^^^^^^^^^^^^^^^^^^^^^^^^ File "/obs/lib/__init__.py", line 200, in run_cmd exit_error_cmd(p, "command failed unexpectedly") File "/obs/lib/__init__.py", line 161, in exit_error_cmd raise RuntimeError("shell command related error, find details right above" RuntimeError: shell command related error, find details right above this python trace Build step 'Execute shell' marked build as failure
See https://jenkins.osmocom.org/jenkins/job/Osmocom_OBS_master/93711/display/redirect
Changes:
------------------------------------------ Started by upstream project "master-libgtpnl" build number 2684 originally caused by: Started by timer Running as SYSTEM Building remotely on build5-deb12build-ansible (ttcn3 obs osmo-gsm-tester-build ttcn3-ggsn-test-kernel-git ttcn3_with_linux_6.1_or_higher qemu io_uring osmocom-gerrit coverity osmocom-master) in workspace https://jenkins.osmocom.org/jenkins/job/Osmocom_OBS_master/ws/ The recommended git tool is: NONE No credentials specified Wiping out workspace first. Cloning the remote Git repository Cloning repository https://gerrit.osmocom.org/osmo-ci
git init https://jenkins.osmocom.org/jenkins/job/Osmocom_OBS_master/ws/ # timeout=10
Fetching upstream changes from https://gerrit.osmocom.org/osmo-ci
git --version # timeout=10 git --version # 'git version 2.39.5' git fetch --tags --force --progress -- https://gerrit.osmocom.org/osmo-ci +refs/heads/*:refs/remotes/origin/* # timeout=10 git config remote.origin.url https://gerrit.osmocom.org/osmo-ci # timeout=10 git config --add remote.origin.fetch +refs/heads/*:refs/remotes/origin/* # timeout=10
Avoid second fetch
git rev-parse refs/remotes/origin/refs/remotes/origin/master^{commit} # timeout=10 git rev-parse refs/remotes/origin/master^{commit} # timeout=10
Checking out Revision 9a18ebaa78fc255a0aea42186a2743829d69162e (refs/remotes/origin/master)
git config core.sparsecheckout # timeout=10 git checkout -f 9a18ebaa78fc255a0aea42186a2743829d69162e # timeout=10
Commit message: "obs: gerrit_binpkgs: set --allow-unknown-package"
git rev-list --no-walk 9a18ebaa78fc255a0aea42186a2743829d69162e # timeout=10
[Osmocom_OBS_master] $ /bin/sh -xe /tmp/jenkins305916810715033836.sh + export PYTHONUNBUFFERED=1 + ./scripts/obs/update_obs_project.py --apiurl https://obs.osmocom.org --conflict-version --docker --feed master --meta osmocom:master docker: building image debian-12-osmocom-obs-build-srcpkg + run_in_docker_and_exit(): ['docker', 'build', '--build-arg', 'DISTRO=debian:12', '--build-arg', 'DISTRO_FROM=debian:12', '--build-arg', 'UID=1000', '-t', 'debian-12-osmocom-obs-build-srcpkg', '-f', 'https://jenkins.osmocom.org/jenkins/job/Osmocom_OBS_master/ws/scripts/obs/data/build_srcpkg.Dockerfile', 'https://jenkins.osmocom.org/jenkins/job/Osmocom_OBS_master/ws/scripts/obs/data'] #0 building with "default" instance using docker driver
#1 [internal] load build definition from build_srcpkg.Dockerfile #1 transferring dockerfile: 579B done #1 WARN: InvalidDefaultArgInFrom: Default value for ARG ${DISTRO_FROM} results in empty or invalid base image name (line 3) #1 DONE 0.0s
#2 [internal] load metadata for docker.io/library/debian:12 #2 DONE 0.4s
#3 [internal] load .dockerignore #3 transferring context: 2B done #3 DONE 0.0s
#4 [1/3] FROM docker.io/library/debian:12@sha256:18023f131f52fc3ea21973cabffe0b216c60b417fd2478e94d9d59981ebba6af #4 resolve docker.io/library/debian:12@sha256:18023f131f52fc3ea21973cabffe0b216c60b417fd2478e94d9d59981ebba6af 0.1s done #4 DONE 0.1s
#5 [2/3] RUN APT-GET update && apt-get upgrade -y && apt-get install -y --no-install-recommends ca-certificates colordiff debhelper dh-python dpkg-dev fakeroot git git-review gnupg2 libxml2-utils lsb-release meson osc python3-packaging python3-setuptools quilt rebar3 sed sphinx-common && apt-get clean #5 CACHED
#6 [3/3] RUN USERADD --uid=1000 -m user #6 CACHED
#7 exporting to image #7 exporting layers done #7 writing image sha256:bc6a5998c69e89ffa8b1575b367bf8e7e099cfb23989f67da73b87732b6acf83 done #7 naming to docker.io/library/debian-12-osmocom-obs-build-srcpkg #7 naming to docker.io/library/debian-12-osmocom-obs-build-srcpkg done #7 DONE 0.0s
[33m1 warning found (use docker --debug to expand): [0m - InvalidDefaultArgInFrom: Default value for ARG ${DISTRO_FROM} results in empty or invalid base image name (line 3) docker: running: update_obs_project.py inside docker OBS: getting packages in osmocom:master
ERROR: command failed unexpectedly
*** command *** ['osc', '-A', 'https://obs.osmocom.org', 'list', 'osmocom:master']
*** returncode *** 1
*** output *** Server returned an error: HTTP Error 503: Service Unavailable
Request: https://obs.osmocom.org/source/osmocom:master Headers: Server: nginx Date: Fri, 04 Apr 2025 07:36:25 GMT Content-Type: text/html; charset=UTF-8 Content-Length: 189 Connection: close cache-control: no-cache, no-store, must-revalidate Status: 503 Service Unavailable Cache-Control: public
*** python trace *** Traceback (most recent call last): File "/obs/update_obs_project.py", line 265, in <module> main() File "/obs/update_obs_project.py", line 257, in main pkgs_remote = lib.osc.get_remote_pkgs() ^^^^^^^^^^^^^^^^^^^^^^^^^ File "/obs/lib/osc.py", line 63, in get_remote_pkgs ret = run_osc(["list", proj]) ^^^^^^^^^^^^^^^^^^^^^^^ File "/obs/lib/osc.py", line 58, in run_osc return lib.run_cmd(cmd, *args, **kwargs) ^^^^^^^^^^^^^^^^^^^^^^^^^^^^^^^^^ File "/obs/lib/__init__.py", line 200, in run_cmd exit_error_cmd(p, "command failed unexpectedly") File "/obs/lib/__init__.py", line 161, in exit_error_cmd raise RuntimeError("shell command related error, find details right above" RuntimeError: shell command related error, find details right above this python trace Build step 'Execute shell' marked build as failure
See https://jenkins.osmocom.org/jenkins/job/Osmocom_OBS_master/93712/display/redirect
Changes:
------------------------------------------ Started by upstream project "master-osmo-ggsn" build number 9672 originally caused by: Started by upstream project "master-libgtpnl" build number 2684 originally caused by: Started by timer Running as SYSTEM Building remotely on build4-deb12build-ansible (ttcn3 obs osmo-gsm-tester-build ttcn3_with_linux_6.1_or_higher qemu io_uring osmocom-gerrit coverity osmocom-master) in workspace https://jenkins.osmocom.org/jenkins/job/Osmocom_OBS_master/ws/ The recommended git tool is: NONE No credentials specified Wiping out workspace first. Cloning the remote Git repository Cloning repository https://gerrit.osmocom.org/osmo-ci
git init https://jenkins.osmocom.org/jenkins/job/Osmocom_OBS_master/ws/ # timeout=10
Fetching upstream changes from https://gerrit.osmocom.org/osmo-ci
git --version # timeout=10 git --version # 'git version 2.39.5' git fetch --tags --force --progress -- https://gerrit.osmocom.org/osmo-ci +refs/heads/*:refs/remotes/origin/* # timeout=10 git config remote.origin.url https://gerrit.osmocom.org/osmo-ci # timeout=10 git config --add remote.origin.fetch +refs/heads/*:refs/remotes/origin/* # timeout=10
Avoid second fetch
git rev-parse refs/remotes/origin/refs/remotes/origin/master^{commit} # timeout=10 git rev-parse refs/remotes/origin/master^{commit} # timeout=10
Checking out Revision 9a18ebaa78fc255a0aea42186a2743829d69162e (refs/remotes/origin/master)
git config core.sparsecheckout # timeout=10 git checkout -f 9a18ebaa78fc255a0aea42186a2743829d69162e # timeout=10
Commit message: "obs: gerrit_binpkgs: set --allow-unknown-package"
git rev-list --no-walk 9a18ebaa78fc255a0aea42186a2743829d69162e # timeout=10
[Osmocom_OBS_master] $ /bin/sh -xe /tmp/jenkins14981614968118081969.sh + export PYTHONUNBUFFERED=1 + ./scripts/obs/update_obs_project.py --apiurl https://obs.osmocom.org --conflict-version --docker --feed master --meta osmocom:master docker: building image debian-12-osmocom-obs-build-srcpkg + run_in_docker_and_exit(): ['docker', 'build', '--build-arg', 'DISTRO=debian:12', '--build-arg', 'DISTRO_FROM=debian:12', '--build-arg', 'UID=1000', '-t', 'debian-12-osmocom-obs-build-srcpkg', '-f', 'https://jenkins.osmocom.org/jenkins/job/Osmocom_OBS_master/ws/scripts/obs/data/build_srcpkg.Dockerfile', 'https://jenkins.osmocom.org/jenkins/job/Osmocom_OBS_master/ws/scripts/obs/data'] #0 building with "default" instance using docker driver
#1 [internal] load build definition from build_srcpkg.Dockerfile #1 transferring dockerfile: 579B done #1 WARN: InvalidDefaultArgInFrom: Default value for ARG ${DISTRO_FROM} results in empty or invalid base image name (line 3) #1 DONE 0.0s
#2 [internal] load metadata for docker.io/library/debian:12 #2 DONE 0.8s
#3 [internal] load .dockerignore #3 transferring context: 2B done #3 DONE 0.0s
#4 [1/3] FROM docker.io/library/debian:12@sha256:18023f131f52fc3ea21973cabffe0b216c60b417fd2478e94d9d59981ebba6af #4 DONE 0.0s
#5 [2/3] RUN APT-GET update && apt-get upgrade -y && apt-get install -y --no-install-recommends ca-certificates colordiff debhelper dh-python dpkg-dev fakeroot git git-review gnupg2 libxml2-utils lsb-release meson osc python3-packaging python3-setuptools quilt rebar3 sed sphinx-common && apt-get clean #5 CACHED
#6 [3/3] RUN USERADD --uid=1000 -m user #6 CACHED
#7 exporting to image #7 exporting layers done #7 writing image sha256:2a9dd95b35028e4d71315e59c45ba43dc43f920d55d8b4980b221443515a5cd4 done #7 naming to docker.io/library/debian-12-osmocom-obs-build-srcpkg done #7 DONE 0.0s
[33m1 warning found (use docker --debug to expand): [0m - InvalidDefaultArgInFrom: Default value for ARG ${DISTRO_FROM} results in empty or invalid base image name (line 3) docker: running: update_obs_project.py inside docker OBS: getting packages in osmocom:master
ERROR: command failed unexpectedly
*** command *** ['osc', '-A', 'https://obs.osmocom.org', 'list', 'osmocom:master']
*** returncode *** 1
*** output *** Server returned an error: HTTP Error 503: Service Unavailable
Request: https://obs.osmocom.org/source/osmocom:master Headers: Server: nginx Date: Fri, 04 Apr 2025 07:37:15 GMT Content-Type: text/html; charset=UTF-8 Content-Length: 189 Connection: close cache-control: no-cache, no-store, must-revalidate Status: 503 Service Unavailable Cache-Control: public
*** python trace *** Traceback (most recent call last): File "/obs/update_obs_project.py", line 265, in <module> main() File "/obs/update_obs_project.py", line 257, in main pkgs_remote = lib.osc.get_remote_pkgs() ^^^^^^^^^^^^^^^^^^^^^^^^^ File "/obs/lib/osc.py", line 63, in get_remote_pkgs ret = run_osc(["list", proj]) ^^^^^^^^^^^^^^^^^^^^^^^ File "/obs/lib/osc.py", line 58, in run_osc return lib.run_cmd(cmd, *args, **kwargs) ^^^^^^^^^^^^^^^^^^^^^^^^^^^^^^^^^ File "/obs/lib/__init__.py", line 200, in run_cmd exit_error_cmd(p, "command failed unexpectedly") File "/obs/lib/__init__.py", line 161, in exit_error_cmd raise RuntimeError("shell command related error, find details right above" RuntimeError: shell command related error, find details right above this python trace Build step 'Execute shell' marked build as failure
See https://jenkins.osmocom.org/jenkins/job/Osmocom_OBS_master/93713/display/redirect
Changes:
------------------------------------------ Started by upstream project "master-osmo-upf" build number 5326 originally caused by: Started by upstream project "master-libgtpnl" build number 2684 originally caused by: Started by timer Running as SYSTEM Building remotely on build5-deb12build-ansible (ttcn3 obs osmo-gsm-tester-build ttcn3-ggsn-test-kernel-git ttcn3_with_linux_6.1_or_higher qemu io_uring osmocom-gerrit coverity osmocom-master) in workspace https://jenkins.osmocom.org/jenkins/job/Osmocom_OBS_master/ws/ The recommended git tool is: NONE No credentials specified Wiping out workspace first. Cloning the remote Git repository Cloning repository https://gerrit.osmocom.org/osmo-ci
git init https://jenkins.osmocom.org/jenkins/job/Osmocom_OBS_master/ws/ # timeout=10
Fetching upstream changes from https://gerrit.osmocom.org/osmo-ci
git --version # timeout=10 git --version # 'git version 2.39.5' git fetch --tags --force --progress -- https://gerrit.osmocom.org/osmo-ci +refs/heads/*:refs/remotes/origin/* # timeout=10 git config remote.origin.url https://gerrit.osmocom.org/osmo-ci # timeout=10 git config --add remote.origin.fetch +refs/heads/*:refs/remotes/origin/* # timeout=10
Avoid second fetch
git rev-parse refs/remotes/origin/refs/remotes/origin/master^{commit} # timeout=10 git rev-parse refs/remotes/origin/master^{commit} # timeout=10
Checking out Revision 9a18ebaa78fc255a0aea42186a2743829d69162e (refs/remotes/origin/master)
git config core.sparsecheckout # timeout=10 git checkout -f 9a18ebaa78fc255a0aea42186a2743829d69162e # timeout=10
Commit message: "obs: gerrit_binpkgs: set --allow-unknown-package"
git rev-list --no-walk 9a18ebaa78fc255a0aea42186a2743829d69162e # timeout=10
[Osmocom_OBS_master] $ /bin/sh -xe /tmp/jenkins13132521683345967394.sh + export PYTHONUNBUFFERED=1 + ./scripts/obs/update_obs_project.py --apiurl https://obs.osmocom.org --conflict-version --docker --feed master --meta osmocom:master docker: building image debian-12-osmocom-obs-build-srcpkg + run_in_docker_and_exit(): ['docker', 'build', '--build-arg', 'DISTRO=debian:12', '--build-arg', 'DISTRO_FROM=debian:12', '--build-arg', 'UID=1000', '-t', 'debian-12-osmocom-obs-build-srcpkg', '-f', 'https://jenkins.osmocom.org/jenkins/job/Osmocom_OBS_master/ws/scripts/obs/data/build_srcpkg.Dockerfile', 'https://jenkins.osmocom.org/jenkins/job/Osmocom_OBS_master/ws/scripts/obs/data'] #0 building with "default" instance using docker driver
#1 [internal] load build definition from build_srcpkg.Dockerfile #1 transferring dockerfile: 579B done #1 WARN: InvalidDefaultArgInFrom: Default value for ARG ${DISTRO_FROM} results in empty or invalid base image name (line 3) #1 DONE 0.0s
#2 [internal] load metadata for docker.io/library/debian:12 #2 DONE 0.4s
#3 [internal] load .dockerignore #3 transferring context: 2B done #3 DONE 0.0s
#4 [1/3] FROM docker.io/library/debian:12@sha256:18023f131f52fc3ea21973cabffe0b216c60b417fd2478e94d9d59981ebba6af #4 resolve docker.io/library/debian:12@sha256:18023f131f52fc3ea21973cabffe0b216c60b417fd2478e94d9d59981ebba6af 0.0s done #4 DONE 0.0s
#5 [2/3] RUN APT-GET update && apt-get upgrade -y && apt-get install -y --no-install-recommends ca-certificates colordiff debhelper dh-python dpkg-dev fakeroot git git-review gnupg2 libxml2-utils lsb-release meson osc python3-packaging python3-setuptools quilt rebar3 sed sphinx-common && apt-get clean #5 CACHED
#6 [3/3] RUN USERADD --uid=1000 -m user #6 CACHED
#7 exporting to image #7 exporting layers done #7 writing image sha256:bc6a5998c69e89ffa8b1575b367bf8e7e099cfb23989f67da73b87732b6acf83 done #7 naming to docker.io/library/debian-12-osmocom-obs-build-srcpkg #7 naming to docker.io/library/debian-12-osmocom-obs-build-srcpkg 0.0s done #7 DONE 0.0s
[33m1 warning found (use docker --debug to expand): [0m - InvalidDefaultArgInFrom: Default value for ARG ${DISTRO_FROM} results in empty or invalid base image name (line 3) docker: running: update_obs_project.py inside docker OBS: getting packages in osmocom:master Traceback (most recent call last): File "/obs/update_obs_project.py", line 265, in <module> main()
ERROR: command failed unexpectedly
*** command *** ['osc', '-A', 'https://obs.osmocom.org', 'list', 'osmocom:master']
*** returncode *** 1
*** output *** Server returned an error: HTTP Error 503: Service Unavailable
Request: https://obs.osmocom.org/source/osmocom:master Headers: Server: nginx Date: Fri, 04 Apr 2025 07:37:50 GMT Content-Type: text/html; charset=UTF-8 Content-Length: 189 Connection: close cache-control: no-cache, no-store, must-revalidate Status: 503 Service Unavailable Cache-Control: public
*** python trace *** File "/obs/update_obs_project.py", line 257, in main pkgs_remote = lib.osc.get_remote_pkgs() ^^^^^^^^^^^^^^^^^^^^^^^^^ File "/obs/lib/osc.py", line 63, in get_remote_pkgs ret = run_osc(["list", proj]) ^^^^^^^^^^^^^^^^^^^^^^^ File "/obs/lib/osc.py", line 58, in run_osc return lib.run_cmd(cmd, *args, **kwargs) ^^^^^^^^^^^^^^^^^^^^^^^^^^^^^^^^^ File "/obs/lib/__init__.py", line 200, in run_cmd exit_error_cmd(p, "command failed unexpectedly") File "/obs/lib/__init__.py", line 161, in exit_error_cmd raise RuntimeError("shell command related error, find details right above" RuntimeError: shell command related error, find details right above this python trace Build step 'Execute shell' marked build as failure
See https://jenkins.osmocom.org/jenkins/job/Osmocom_OBS_master/93714/display/redirect
Changes:
------------------------------------------ Started by upstream project "master-osmo-sgsn" build number 52764 originally caused by: Started by timer Running as SYSTEM Building remotely on build5-deb12build-ansible (ttcn3 obs osmo-gsm-tester-build ttcn3-ggsn-test-kernel-git ttcn3_with_linux_6.1_or_higher qemu io_uring osmocom-gerrit coverity osmocom-master) in workspace https://jenkins.osmocom.org/jenkins/job/Osmocom_OBS_master/ws/ The recommended git tool is: NONE No credentials specified Wiping out workspace first. Cloning the remote Git repository Cloning repository https://gerrit.osmocom.org/osmo-ci
git init https://jenkins.osmocom.org/jenkins/job/Osmocom_OBS_master/ws/ # timeout=10
Fetching upstream changes from https://gerrit.osmocom.org/osmo-ci
git --version # timeout=10 git --version # 'git version 2.39.5' git fetch --tags --force --progress -- https://gerrit.osmocom.org/osmo-ci +refs/heads/*:refs/remotes/origin/* # timeout=10 git config remote.origin.url https://gerrit.osmocom.org/osmo-ci # timeout=10 git config --add remote.origin.fetch +refs/heads/*:refs/remotes/origin/* # timeout=10
Avoid second fetch
git rev-parse refs/remotes/origin/refs/remotes/origin/master^{commit} # timeout=10 git rev-parse refs/remotes/origin/master^{commit} # timeout=10
Checking out Revision 9a18ebaa78fc255a0aea42186a2743829d69162e (refs/remotes/origin/master)
git config core.sparsecheckout # timeout=10 git checkout -f 9a18ebaa78fc255a0aea42186a2743829d69162e # timeout=10
Commit message: "obs: gerrit_binpkgs: set --allow-unknown-package"
git rev-list --no-walk 9a18ebaa78fc255a0aea42186a2743829d69162e # timeout=10
[Osmocom_OBS_master] $ /bin/sh -xe /tmp/jenkins4186685266438799354.sh + export PYTHONUNBUFFERED=1 + ./scripts/obs/update_obs_project.py --apiurl https://obs.osmocom.org --conflict-version --docker --feed master --meta osmocom:master docker: building image debian-12-osmocom-obs-build-srcpkg + run_in_docker_and_exit(): ['docker', 'build', '--build-arg', 'DISTRO=debian:12', '--build-arg', 'DISTRO_FROM=debian:12', '--build-arg', 'UID=1000', '-t', 'debian-12-osmocom-obs-build-srcpkg', '-f', 'https://jenkins.osmocom.org/jenkins/job/Osmocom_OBS_master/ws/scripts/obs/data/build_srcpkg.Dockerfile', 'https://jenkins.osmocom.org/jenkins/job/Osmocom_OBS_master/ws/scripts/obs/data'] #0 building with "default" instance using docker driver
#1 [internal] load build definition from build_srcpkg.Dockerfile #1 transferring dockerfile: 579B done #1 WARN: InvalidDefaultArgInFrom: Default value for ARG ${DISTRO_FROM} results in empty or invalid base image name (line 3) #1 DONE 0.0s
#2 [internal] load metadata for docker.io/library/debian:12 #2 DONE 0.4s
#3 [internal] load .dockerignore #3 transferring context: 2B done #3 DONE 0.0s
#4 [1/3] FROM docker.io/library/debian:12@sha256:18023f131f52fc3ea21973cabffe0b216c60b417fd2478e94d9d59981ebba6af #4 resolve docker.io/library/debian:12@sha256:18023f131f52fc3ea21973cabffe0b216c60b417fd2478e94d9d59981ebba6af 0.1s done #4 DONE 0.1s
#5 [2/3] RUN APT-GET update && apt-get upgrade -y && apt-get install -y --no-install-recommends ca-certificates colordiff debhelper dh-python dpkg-dev fakeroot git git-review gnupg2 libxml2-utils lsb-release meson osc python3-packaging python3-setuptools quilt rebar3 sed sphinx-common && apt-get clean #5 CACHED
#6 [3/3] RUN USERADD --uid=1000 -m user #6 CACHED
#7 exporting to image #7 exporting layers done #7 writing image sha256:bc6a5998c69e89ffa8b1575b367bf8e7e099cfb23989f67da73b87732b6acf83 done #7 naming to docker.io/library/debian-12-osmocom-obs-build-srcpkg 0.0s done #7 DONE 0.0s
[33m1 warning found (use docker --debug to expand): [0m - InvalidDefaultArgInFrom: Default value for ARG ${DISTRO_FROM} results in empty or invalid base image name (line 3) docker: running: update_obs_project.py inside docker OBS: getting packages in osmocom:master Traceback (most recent call last): File "/obs/update_obs_project.py", line 265, in <module> main() File "/obs/update_obs_project.py", line 257, in main pkgs_remote = lib.osc.get_remote_pkgs() ^^^^^^^^^^^^^^^^^^^^^^^^^ File "/obs/lib/osc.py", line 63, in get_remote_pkgs ret = run_osc(["list", proj]) ^^^^^^^^^^^^^^^^^^^^^^^ File "/obs/lib/osc.py", line 58, in run_osc return lib.run_cmd(cmd, *args, **kwargs) ^^^^^^^^^^^^^^^^^^^^^^^^^^^^^^^^^ File "/obs/lib/__init__.py", line 200, in run_cmd
ERROR: command failed unexpectedly
*** command *** ['osc', '-A', 'https://obs.osmocom.org', 'list', 'osmocom:master']
*** returncode *** 1
*** output *** Server returned an error: HTTP Error 503: Service Unavailable
Request: https://obs.osmocom.org/source/osmocom:master Headers: Server: nginx Date: Fri, 04 Apr 2025 07:38:25 GMT Content-Type: text/html; charset=UTF-8 Content-Length: 189 Connection: close cache-control: no-cache, no-store, must-revalidate Status: 503 Service Unavailable Cache-Control: public
*** python trace *** exit_error_cmd(p, "command failed unexpectedly") File "/obs/lib/__init__.py", line 161, in exit_error_cmd raise RuntimeError("shell command related error, find details right above" RuntimeError: shell command related error, find details right above this python trace Build step 'Execute shell' marked build as failure
See https://jenkins.osmocom.org/jenkins/job/Osmocom_OBS_master/93715/display/redirect
Changes:
------------------------------------------ Started by upstream project "master-osmo-sgsn" build number 52765 originally caused by: Started by upstream project "master-osmo-ggsn" build number 9672 originally caused by: Started by upstream project "master-libgtpnl" build number 2684 originally caused by: Started by timer Running as SYSTEM Building remotely on build5-deb12build-ansible (ttcn3 obs osmo-gsm-tester-build ttcn3-ggsn-test-kernel-git ttcn3_with_linux_6.1_or_higher qemu io_uring osmocom-gerrit coverity osmocom-master) in workspace https://jenkins.osmocom.org/jenkins/job/Osmocom_OBS_master/ws/ The recommended git tool is: NONE No credentials specified Wiping out workspace first. Cloning the remote Git repository Cloning repository https://gerrit.osmocom.org/osmo-ci
git init https://jenkins.osmocom.org/jenkins/job/Osmocom_OBS_master/ws/ # timeout=10
Fetching upstream changes from https://gerrit.osmocom.org/osmo-ci
git --version # timeout=10 git --version # 'git version 2.39.5' git fetch --tags --force --progress -- https://gerrit.osmocom.org/osmo-ci +refs/heads/*:refs/remotes/origin/* # timeout=10 git config remote.origin.url https://gerrit.osmocom.org/osmo-ci # timeout=10 git config --add remote.origin.fetch +refs/heads/*:refs/remotes/origin/* # timeout=10
Avoid second fetch
git rev-parse refs/remotes/origin/refs/remotes/origin/master^{commit} # timeout=10 git rev-parse refs/remotes/origin/master^{commit} # timeout=10
Checking out Revision 9a18ebaa78fc255a0aea42186a2743829d69162e (refs/remotes/origin/master)
git config core.sparsecheckout # timeout=10 git checkout -f 9a18ebaa78fc255a0aea42186a2743829d69162e # timeout=10
Commit message: "obs: gerrit_binpkgs: set --allow-unknown-package"
git rev-list --no-walk 9a18ebaa78fc255a0aea42186a2743829d69162e # timeout=10
[Osmocom_OBS_master] $ /bin/sh -xe /tmp/jenkins8292312997991210262.sh + export PYTHONUNBUFFERED=1 + ./scripts/obs/update_obs_project.py --apiurl https://obs.osmocom.org --conflict-version --docker --feed master --meta osmocom:master docker: building image debian-12-osmocom-obs-build-srcpkg + run_in_docker_and_exit(): ['docker', 'build', '--build-arg', 'DISTRO=debian:12', '--build-arg', 'DISTRO_FROM=debian:12', '--build-arg', 'UID=1000', '-t', 'debian-12-osmocom-obs-build-srcpkg', '-f', 'https://jenkins.osmocom.org/jenkins/job/Osmocom_OBS_master/ws/scripts/obs/data/build_srcpkg.Dockerfile', 'https://jenkins.osmocom.org/jenkins/job/Osmocom_OBS_master/ws/scripts/obs/data'] #0 building with "default" instance using docker driver
#1 [internal] load build definition from build_srcpkg.Dockerfile #1 transferring dockerfile: 579B done #1 WARN: InvalidDefaultArgInFrom: Default value for ARG ${DISTRO_FROM} results in empty or invalid base image name (line 3) #1 DONE 0.0s
#2 [internal] load metadata for docker.io/library/debian:12 #2 DONE 0.8s
#3 [internal] load .dockerignore #3 transferring context: 2B done #3 DONE 0.0s
#4 [1/3] FROM docker.io/library/debian:12@sha256:18023f131f52fc3ea21973cabffe0b216c60b417fd2478e94d9d59981ebba6af #4 resolve docker.io/library/debian:12@sha256:18023f131f52fc3ea21973cabffe0b216c60b417fd2478e94d9d59981ebba6af 0.0s done #4 DONE 0.0s
#5 [2/3] RUN APT-GET update && apt-get upgrade -y && apt-get install -y --no-install-recommends ca-certificates colordiff debhelper dh-python dpkg-dev fakeroot git git-review gnupg2 libxml2-utils lsb-release meson osc python3-packaging python3-setuptools quilt rebar3 sed sphinx-common && apt-get clean #5 CACHED
#6 [3/3] RUN USERADD --uid=1000 -m user #6 CACHED
#7 exporting to image #7 exporting layers done #7 writing image sha256:bc6a5998c69e89ffa8b1575b367bf8e7e099cfb23989f67da73b87732b6acf83 0.0s done #7 naming to docker.io/library/debian-12-osmocom-obs-build-srcpkg done #7 DONE 0.0s
[33m1 warning found (use docker --debug to expand): [0m - InvalidDefaultArgInFrom: Default value for ARG ${DISTRO_FROM} results in empty or invalid base image name (line 3) docker: running: update_obs_project.py inside docker OBS: getting packages in osmocom:master Traceback (most recent call last): File "/obs/update_obs_project.py", line 265, in <module> main() File "/obs/update_obs_project.py", line 257, in main pkgs_remote = lib.osc.get_remote_pkgs() ^^^^^^^^^^^^^^^^^^^^^^^^^ File "/obs/lib/osc.py", line 63, in get_remote_pkgs
ERROR: command failed unexpectedly
*** command *** ['osc', '-A', 'https://obs.osmocom.org', 'list', 'osmocom:master']
*** returncode *** 1
*** output *** Server returned an error: HTTP Error 503: Service Unavailable
Request: https://obs.osmocom.org/source/osmocom:master Headers: Server: nginx Date: Fri, 04 Apr 2025 07:40:35 GMT Content-Type: text/html; charset=UTF-8 Content-Length: 189 Connection: close cache-control: no-cache, no-store, must-revalidate Status: 503 Service Unavailable Cache-Control: public
*** python trace *** ret = run_osc(["list", proj]) ^^^^^^^^^^^^^^^^^^^^^^^ File "/obs/lib/osc.py", line 58, in run_osc return lib.run_cmd(cmd, *args, **kwargs) ^^^^^^^^^^^^^^^^^^^^^^^^^^^^^^^^^ File "/obs/lib/__init__.py", line 200, in run_cmd exit_error_cmd(p, "command failed unexpectedly") File "/obs/lib/__init__.py", line 161, in exit_error_cmd raise RuntimeError("shell command related error, find details right above" RuntimeError: shell command related error, find details right above this python trace Build step 'Execute shell' marked build as failure
See https://jenkins.osmocom.org/jenkins/job/Osmocom_OBS_master/93716/display/redirect
Changes:
------------------------------------------ Started by upstream project "master-osmo-pcu" build number 7320 originally caused by: Started by timer Running as SYSTEM Building remotely on build5-deb12build-ansible (ttcn3 obs osmo-gsm-tester-build ttcn3-ggsn-test-kernel-git ttcn3_with_linux_6.1_or_higher qemu io_uring osmocom-gerrit coverity osmocom-master) in workspace https://jenkins.osmocom.org/jenkins/job/Osmocom_OBS_master/ws/ The recommended git tool is: NONE No credentials specified Wiping out workspace first. Cloning the remote Git repository Cloning repository https://gerrit.osmocom.org/osmo-ci
git init https://jenkins.osmocom.org/jenkins/job/Osmocom_OBS_master/ws/ # timeout=10
Fetching upstream changes from https://gerrit.osmocom.org/osmo-ci
git --version # timeout=10 git --version # 'git version 2.39.5' git fetch --tags --force --progress -- https://gerrit.osmocom.org/osmo-ci +refs/heads/*:refs/remotes/origin/* # timeout=10 git config remote.origin.url https://gerrit.osmocom.org/osmo-ci # timeout=10 git config --add remote.origin.fetch +refs/heads/*:refs/remotes/origin/* # timeout=10
Avoid second fetch
git rev-parse refs/remotes/origin/refs/remotes/origin/master^{commit} # timeout=10 git rev-parse refs/remotes/origin/master^{commit} # timeout=10
Checking out Revision 9a18ebaa78fc255a0aea42186a2743829d69162e (refs/remotes/origin/master)
git config core.sparsecheckout # timeout=10 git checkout -f 9a18ebaa78fc255a0aea42186a2743829d69162e # timeout=10
Commit message: "obs: gerrit_binpkgs: set --allow-unknown-package"
git rev-list --no-walk 9a18ebaa78fc255a0aea42186a2743829d69162e # timeout=10
[Osmocom_OBS_master] $ /bin/sh -xe /tmp/jenkins9353049326720511429.sh + export PYTHONUNBUFFERED=1 + ./scripts/obs/update_obs_project.py --apiurl https://obs.osmocom.org --conflict-version --docker --feed master --meta osmocom:master docker: building image debian-12-osmocom-obs-build-srcpkg + run_in_docker_and_exit(): ['docker', 'build', '--build-arg', 'DISTRO=debian:12', '--build-arg', 'DISTRO_FROM=debian:12', '--build-arg', 'UID=1000', '-t', 'debian-12-osmocom-obs-build-srcpkg', '-f', 'https://jenkins.osmocom.org/jenkins/job/Osmocom_OBS_master/ws/scripts/obs/data/build_srcpkg.Dockerfile', 'https://jenkins.osmocom.org/jenkins/job/Osmocom_OBS_master/ws/scripts/obs/data'] #0 building with "default" instance using docker driver
#1 [internal] load build definition from build_srcpkg.Dockerfile #1 transferring dockerfile: 579B done #1 WARN: InvalidDefaultArgInFrom: Default value for ARG ${DISTRO_FROM} results in empty or invalid base image name (line 3) #1 DONE 0.0s
#2 [internal] load metadata for docker.io/library/debian:12 #2 DONE 0.4s
#3 [internal] load .dockerignore #3 transferring context: 2B done #3 DONE 0.0s
#4 [1/3] FROM docker.io/library/debian:12@sha256:18023f131f52fc3ea21973cabffe0b216c60b417fd2478e94d9d59981ebba6af #4 resolve docker.io/library/debian:12@sha256:18023f131f52fc3ea21973cabffe0b216c60b417fd2478e94d9d59981ebba6af 0.1s done #4 DONE 0.1s
#5 [2/3] RUN APT-GET update && apt-get upgrade -y && apt-get install -y --no-install-recommends ca-certificates colordiff debhelper dh-python dpkg-dev fakeroot git git-review gnupg2 libxml2-utils lsb-release meson osc python3-packaging python3-setuptools quilt rebar3 sed sphinx-common && apt-get clean #5 CACHED
#6 [3/3] RUN USERADD --uid=1000 -m user #6 CACHED
#7 exporting to image #7 exporting layers done #7 writing image sha256:bc6a5998c69e89ffa8b1575b367bf8e7e099cfb23989f67da73b87732b6acf83 done #7 naming to docker.io/library/debian-12-osmocom-obs-build-srcpkg done #7 DONE 0.0s
[33m1 warning found (use docker --debug to expand): [0m - InvalidDefaultArgInFrom: Default value for ARG ${DISTRO_FROM} results in empty or invalid base image name (line 3) docker: running: update_obs_project.py inside docker OBS: getting packages in osmocom:master
ERROR: command failed unexpectedly
*** command *** ['osc', '-A', 'https://obs.osmocom.org', 'list', 'osmocom:master']
*** returncode *** 1
*** output *** Server returned an error: HTTP Error 503: Service Unavailable
Request: https://obs.osmocom.org/source/osmocom:master Headers: Server: nginx Date: Fri, 04 Apr 2025 07:41:05 GMT Content-Type: text/html; charset=UTF-8 Content-Length: 189 Connection: close cache-control: no-cache, no-store, must-revalidate Status: 503 Service Unavailable Cache-Control: public
*** python trace *** Traceback (most recent call last): File "/obs/update_obs_project.py", line 265, in <module> main() File "/obs/update_obs_project.py", line 257, in main pkgs_remote = lib.osc.get_remote_pkgs() ^^^^^^^^^^^^^^^^^^^^^^^^^ File "/obs/lib/osc.py", line 63, in get_remote_pkgs ret = run_osc(["list", proj]) ^^^^^^^^^^^^^^^^^^^^^^^ File "/obs/lib/osc.py", line 58, in run_osc return lib.run_cmd(cmd, *args, **kwargs) ^^^^^^^^^^^^^^^^^^^^^^^^^^^^^^^^^ File "/obs/lib/__init__.py", line 200, in run_cmd exit_error_cmd(p, "command failed unexpectedly") File "/obs/lib/__init__.py", line 161, in exit_error_cmd raise RuntimeError("shell command related error, find details right above" RuntimeError: shell command related error, find details right above this python trace Build step 'Execute shell' marked build as failure
jenkins-notifications@lists.osmocom.org