See https://jenkins.osmocom.org/jenkins/job/Osmocom_OBS_master/93645/display/redirect
Changes:
------------------------------------------ Started by upstream project "master-libosmo-netif" build number 9925 originally caused by: Started by timer Running as SYSTEM Building remotely on build5-deb12build-ansible (ttcn3 obs osmo-gsm-tester-build ttcn3-ggsn-test-kernel-git ttcn3_with_linux_6.1_or_higher qemu io_uring osmocom-gerrit coverity osmocom-master) in workspace https://jenkins.osmocom.org/jenkins/job/Osmocom_OBS_master/ws/ The recommended git tool is: NONE No credentials specified Wiping out workspace first. Cloning the remote Git repository Cloning repository https://gerrit.osmocom.org/osmo-ci
git init https://jenkins.osmocom.org/jenkins/job/Osmocom_OBS_master/ws/ # timeout=10
Fetching upstream changes from https://gerrit.osmocom.org/osmo-ci
git --version # timeout=10 git --version # 'git version 2.39.5' git fetch --tags --force --progress -- https://gerrit.osmocom.org/osmo-ci +refs/heads/*:refs/remotes/origin/* # timeout=10 git config remote.origin.url https://gerrit.osmocom.org/osmo-ci # timeout=10 git config --add remote.origin.fetch +refs/heads/*:refs/remotes/origin/* # timeout=10
Avoid second fetch
git rev-parse refs/remotes/origin/refs/remotes/origin/master^{commit} # timeout=10 git rev-parse refs/remotes/origin/master^{commit} # timeout=10
Checking out Revision 9a18ebaa78fc255a0aea42186a2743829d69162e (refs/remotes/origin/master)
git config core.sparsecheckout # timeout=10 git checkout -f 9a18ebaa78fc255a0aea42186a2743829d69162e # timeout=10
Commit message: "obs: gerrit_binpkgs: set --allow-unknown-package"
git rev-list --no-walk 9a18ebaa78fc255a0aea42186a2743829d69162e # timeout=10
[Osmocom_OBS_master] $ /bin/sh -xe /tmp/jenkins8542952165556061840.sh + export PYTHONUNBUFFERED=1 + ./scripts/obs/update_obs_project.py --apiurl https://obs.osmocom.org --conflict-version --docker --feed master --meta osmocom:master docker: building image debian-12-osmocom-obs-build-srcpkg + run_in_docker_and_exit(): ['docker', 'build', '--build-arg', 'DISTRO=debian:12', '--build-arg', 'DISTRO_FROM=debian:12', '--build-arg', 'UID=1000', '-t', 'debian-12-osmocom-obs-build-srcpkg', '-f', 'https://jenkins.osmocom.org/jenkins/job/Osmocom_OBS_master/ws/scripts/obs/data/build_srcpkg.Dockerfile', 'https://jenkins.osmocom.org/jenkins/job/Osmocom_OBS_master/ws/scripts/obs/data'] #0 building with "default" instance using docker driver
#1 [internal] load build definition from build_srcpkg.Dockerfile #1 transferring dockerfile: 579B done #1 WARN: InvalidDefaultArgInFrom: Default value for ARG ${DISTRO_FROM} results in empty or invalid base image name (line 3) #1 DONE 0.1s
#2 [internal] load metadata for docker.io/library/debian:12 #2 DONE 1.2s
#3 [internal] load .dockerignore #3 transferring context: 2B done #3 DONE 0.1s
#4 [1/3] FROM docker.io/library/debian:12@sha256:18023f131f52fc3ea21973cabffe0b216c60b417fd2478e94d9d59981ebba6af #4 resolve docker.io/library/debian:12@sha256:18023f131f52fc3ea21973cabffe0b216c60b417fd2478e94d9d59981ebba6af 0.0s done #4 DONE 0.0s
#5 [2/3] RUN APT-GET update && apt-get upgrade -y && apt-get install -y --no-install-recommends ca-certificates colordiff debhelper dh-python dpkg-dev fakeroot git git-review gnupg2 libxml2-utils lsb-release meson osc python3-packaging python3-setuptools quilt rebar3 sed sphinx-common && apt-get clean #5 CACHED
#6 [3/3] RUN USERADD --uid=1000 -m user #6 CACHED
#7 exporting to image #7 exporting layers done #7 writing image sha256:bc6a5998c69e89ffa8b1575b367bf8e7e099cfb23989f67da73b87732b6acf83 done #7 naming to docker.io/library/debian-12-osmocom-obs-build-srcpkg done #7 DONE 0.0s
[33m1 warning found (use docker --debug to expand): [0m - InvalidDefaultArgInFrom: Default value for ARG ${DISTRO_FROM} results in empty or invalid base image name (line 3) docker: running: update_obs_project.py inside docker OBS: getting packages in osmocom:master
ERROR: command failed unexpectedly
*** command *** ['osc', '-A', 'https://obs.osmocom.org', 'list', 'osmocom:master']
*** returncode *** 1
*** output *** Server returned an error: HTTP Error 504: Gateway Time-out
Request: https://obs.osmocom.org/source/osmocom:master Headers: Server: nginx Date: Thu, 03 Apr 2025 16:10:54 GMT Content-Type: text/html Content-Length: 160 Connection: close
*** python trace *** Traceback (most recent call last): File "/obs/update_obs_project.py", line 265, in <module> main() File "/obs/update_obs_project.py", line 257, in main pkgs_remote = lib.osc.get_remote_pkgs() ^^^^^^^^^^^^^^^^^^^^^^^^^ File "/obs/lib/osc.py", line 63, in get_remote_pkgs ret = run_osc(["list", proj]) ^^^^^^^^^^^^^^^^^^^^^^^ File "/obs/lib/osc.py", line 58, in run_osc return lib.run_cmd(cmd, *args, **kwargs) ^^^^^^^^^^^^^^^^^^^^^^^^^^^^^^^^^ File "/obs/lib/__init__.py", line 200, in run_cmd exit_error_cmd(p, "command failed unexpectedly") File "/obs/lib/__init__.py", line 161, in exit_error_cmd raise RuntimeError("shell command related error, find details right above" RuntimeError: shell command related error, find details right above this python trace Build step 'Execute shell' marked build as failure
See https://jenkins.osmocom.org/jenkins/job/Osmocom_OBS_master/93646/display/redirect
Changes:
------------------------------------------ Started by upstream project "master-osmo-hlr" build number 12528 originally caused by: Started by timer Running as SYSTEM Building remotely on build4-deb12build-ansible (ttcn3 obs osmo-gsm-tester-build ttcn3_with_linux_6.1_or_higher qemu io_uring osmocom-gerrit coverity osmocom-master) in workspace https://jenkins.osmocom.org/jenkins/job/Osmocom_OBS_master/ws/ The recommended git tool is: NONE No credentials specified Wiping out workspace first. Cloning the remote Git repository Cloning repository https://gerrit.osmocom.org/osmo-ci
git init https://jenkins.osmocom.org/jenkins/job/Osmocom_OBS_master/ws/ # timeout=10
Fetching upstream changes from https://gerrit.osmocom.org/osmo-ci
git --version # timeout=10 git --version # 'git version 2.39.5' git fetch --tags --force --progress -- https://gerrit.osmocom.org/osmo-ci +refs/heads/*:refs/remotes/origin/* # timeout=10 git config remote.origin.url https://gerrit.osmocom.org/osmo-ci # timeout=10 git config --add remote.origin.fetch +refs/heads/*:refs/remotes/origin/* # timeout=10
Avoid second fetch
git rev-parse refs/remotes/origin/refs/remotes/origin/master^{commit} # timeout=10 git rev-parse refs/remotes/origin/master^{commit} # timeout=10
Checking out Revision 9a18ebaa78fc255a0aea42186a2743829d69162e (refs/remotes/origin/master)
git config core.sparsecheckout # timeout=10 git checkout -f 9a18ebaa78fc255a0aea42186a2743829d69162e # timeout=10
Commit message: "obs: gerrit_binpkgs: set --allow-unknown-package"
git rev-list --no-walk 9a18ebaa78fc255a0aea42186a2743829d69162e # timeout=10
[Osmocom_OBS_master] $ /bin/sh -xe /tmp/jenkins4630752516934020220.sh + export PYTHONUNBUFFERED=1 + ./scripts/obs/update_obs_project.py --apiurl https://obs.osmocom.org --conflict-version --docker --feed master --meta osmocom:master docker: building image debian-12-osmocom-obs-build-srcpkg + run_in_docker_and_exit(): ['docker', 'build', '--build-arg', 'DISTRO=debian:12', '--build-arg', 'DISTRO_FROM=debian:12', '--build-arg', 'UID=1000', '-t', 'debian-12-osmocom-obs-build-srcpkg', '-f', 'https://jenkins.osmocom.org/jenkins/job/Osmocom_OBS_master/ws/scripts/obs/data/build_srcpkg.Dockerfile', 'https://jenkins.osmocom.org/jenkins/job/Osmocom_OBS_master/ws/scripts/obs/data'] #0 building with "default" instance using docker driver
#1 [internal] load build definition from build_srcpkg.Dockerfile #1 transferring dockerfile: 579B done #1 WARN: InvalidDefaultArgInFrom: Default value for ARG ${DISTRO_FROM} results in empty or invalid base image name (line 3) #1 DONE 0.0s
#2 [internal] load metadata for docker.io/library/debian:12 #2 DONE 0.8s
#3 [internal] load .dockerignore #3 transferring context: 2B done #3 DONE 0.0s
#4 [1/3] FROM docker.io/library/debian:12@sha256:18023f131f52fc3ea21973cabffe0b216c60b417fd2478e94d9d59981ebba6af #4 DONE 0.0s
#5 [2/3] RUN APT-GET update && apt-get upgrade -y && apt-get install -y --no-install-recommends ca-certificates colordiff debhelper dh-python dpkg-dev fakeroot git git-review gnupg2 libxml2-utils lsb-release meson osc python3-packaging python3-setuptools quilt rebar3 sed sphinx-common && apt-get clean #5 CACHED
#6 [3/3] RUN USERADD --uid=1000 -m user #6 CACHED
#7 exporting to image #7 exporting layers done #7 writing image sha256:2a9dd95b35028e4d71315e59c45ba43dc43f920d55d8b4980b221443515a5cd4 0.0s done #7 naming to docker.io/library/debian-12-osmocom-obs-build-srcpkg 0.0s done #7 DONE 0.0s
[33m1 warning found (use docker --debug to expand): [0m - InvalidDefaultArgInFrom: Default value for ARG ${DISTRO_FROM} results in empty or invalid base image name (line 3) docker: running: update_obs_project.py inside docker OBS: getting packages in osmocom:master
ERROR: command failed unexpectedly
*** command *** ['osc', '-A', 'https://obs.osmocom.org', 'list', 'osmocom:master']
*** returncode *** 1
*** output *** Server returned an error: HTTP Error 503: Service Unavailable
Request: https://obs.osmocom.org/source/osmocom:master Headers: Server: nginx Date: Thu, 03 Apr 2025 16:36:09 GMT Content-Type: text/html; charset=UTF-8 Content-Length: 189 Connection: close cache-control: no-cache, no-store, must-revalidate Status: 503 Service Unavailable Cache-Control: public
*** python trace *** Traceback (most recent call last): File "/obs/update_obs_project.py", line 265, in <module> main() File "/obs/update_obs_project.py", line 257, in main pkgs_remote = lib.osc.get_remote_pkgs() ^^^^^^^^^^^^^^^^^^^^^^^^^ File "/obs/lib/osc.py", line 63, in get_remote_pkgs ret = run_osc(["list", proj]) ^^^^^^^^^^^^^^^^^^^^^^^ File "/obs/lib/osc.py", line 58, in run_osc return lib.run_cmd(cmd, *args, **kwargs) ^^^^^^^^^^^^^^^^^^^^^^^^^^^^^^^^^ File "/obs/lib/__init__.py", line 200, in run_cmd exit_error_cmd(p, "command failed unexpectedly") File "/obs/lib/__init__.py", line 161, in exit_error_cmd raise RuntimeError("shell command related error, find details right above" RuntimeError: shell command related error, find details right above this python trace Build step 'Execute shell' marked build as failure
See https://jenkins.osmocom.org/jenkins/job/Osmocom_OBS_master/93647/display/redirect
Changes:
------------------------------------------ Started by upstream project "master-osmo-bsc-nat" build number 6229 originally caused by: Started by timer Running as SYSTEM Building remotely on build5-deb12build-ansible (ttcn3 obs osmo-gsm-tester-build ttcn3-ggsn-test-kernel-git ttcn3_with_linux_6.1_or_higher qemu io_uring osmocom-gerrit coverity osmocom-master) in workspace https://jenkins.osmocom.org/jenkins/job/Osmocom_OBS_master/ws/ The recommended git tool is: NONE No credentials specified Wiping out workspace first. Cloning the remote Git repository Cloning repository https://gerrit.osmocom.org/osmo-ci
git init https://jenkins.osmocom.org/jenkins/job/Osmocom_OBS_master/ws/ # timeout=10
Fetching upstream changes from https://gerrit.osmocom.org/osmo-ci
git --version # timeout=10 git --version # 'git version 2.39.5' git fetch --tags --force --progress -- https://gerrit.osmocom.org/osmo-ci +refs/heads/*:refs/remotes/origin/* # timeout=10 git config remote.origin.url https://gerrit.osmocom.org/osmo-ci # timeout=10 git config --add remote.origin.fetch +refs/heads/*:refs/remotes/origin/* # timeout=10
Avoid second fetch
git rev-parse refs/remotes/origin/refs/remotes/origin/master^{commit} # timeout=10 git rev-parse refs/remotes/origin/master^{commit} # timeout=10
Checking out Revision 9a18ebaa78fc255a0aea42186a2743829d69162e (refs/remotes/origin/master)
git config core.sparsecheckout # timeout=10 git checkout -f 9a18ebaa78fc255a0aea42186a2743829d69162e # timeout=10
Commit message: "obs: gerrit_binpkgs: set --allow-unknown-package"
git rev-list --no-walk 9a18ebaa78fc255a0aea42186a2743829d69162e # timeout=10
[Osmocom_OBS_master] $ /bin/sh -xe /tmp/jenkins18309048635119473389.sh + export PYTHONUNBUFFERED=1 + ./scripts/obs/update_obs_project.py --apiurl https://obs.osmocom.org --conflict-version --docker --feed master --meta osmocom:master docker: building image debian-12-osmocom-obs-build-srcpkg + run_in_docker_and_exit(): ['docker', 'build', '--build-arg', 'DISTRO=debian:12', '--build-arg', 'DISTRO_FROM=debian:12', '--build-arg', 'UID=1000', '-t', 'debian-12-osmocom-obs-build-srcpkg', '-f', 'https://jenkins.osmocom.org/jenkins/job/Osmocom_OBS_master/ws/scripts/obs/data/build_srcpkg.Dockerfile', 'https://jenkins.osmocom.org/jenkins/job/Osmocom_OBS_master/ws/scripts/obs/data'] #0 building with "default" instance using docker driver
#1 [internal] load build definition from build_srcpkg.Dockerfile #1 transferring dockerfile: 579B done #1 WARN: InvalidDefaultArgInFrom: Default value for ARG ${DISTRO_FROM} results in empty or invalid base image name (line 3) #1 DONE 0.0s
#2 [internal] load metadata for docker.io/library/debian:12 #2 DONE 0.9s
#3 [internal] load .dockerignore #3 transferring context: 2B done #3 DONE 0.0s
#4 [1/3] FROM docker.io/library/debian:12@sha256:18023f131f52fc3ea21973cabffe0b216c60b417fd2478e94d9d59981ebba6af #4 resolve docker.io/library/debian:12@sha256:18023f131f52fc3ea21973cabffe0b216c60b417fd2478e94d9d59981ebba6af 0.0s done #4 DONE 0.0s
#5 [2/3] RUN APT-GET update && apt-get upgrade -y && apt-get install -y --no-install-recommends ca-certificates colordiff debhelper dh-python dpkg-dev fakeroot git git-review gnupg2 libxml2-utils lsb-release meson osc python3-packaging python3-setuptools quilt rebar3 sed sphinx-common && apt-get clean #5 CACHED
#6 [3/3] RUN USERADD --uid=1000 -m user #6 CACHED
#7 exporting to image #7 exporting layers done #7 writing image sha256:bc6a5998c69e89ffa8b1575b367bf8e7e099cfb23989f67da73b87732b6acf83 done #7 naming to docker.io/library/debian-12-osmocom-obs-build-srcpkg done #7 DONE 0.0s
[33m1 warning found (use docker --debug to expand): [0m - InvalidDefaultArgInFrom: Default value for ARG ${DISTRO_FROM} results in empty or invalid base image name (line 3) docker: running: update_obs_project.py inside docker OBS: getting packages in osmocom:master Traceback (most recent call last): File "/obs/update_obs_project.py", line 265, in <module>
ERROR: command failed unexpectedly
*** command *** ['osc', '-A', 'https://obs.osmocom.org', 'list', 'osmocom:master']
*** returncode *** 1
*** output *** Server returned an error: HTTP Error 503: Service Unavailable
Request: https://obs.osmocom.org/source/osmocom:master Headers: Server: nginx Date: Thu, 03 Apr 2025 17:09:59 GMT Content-Type: text/html; charset=UTF-8 Content-Length: 189 Connection: close cache-control: no-cache, no-store, must-revalidate Status: 503 Service Unavailable Cache-Control: public
*** python trace *** main() File "/obs/update_obs_project.py", line 257, in main pkgs_remote = lib.osc.get_remote_pkgs() ^^^^^^^^^^^^^^^^^^^^^^^^^ File "/obs/lib/osc.py", line 63, in get_remote_pkgs ret = run_osc(["list", proj]) ^^^^^^^^^^^^^^^^^^^^^^^ File "/obs/lib/osc.py", line 58, in run_osc return lib.run_cmd(cmd, *args, **kwargs) ^^^^^^^^^^^^^^^^^^^^^^^^^^^^^^^^^ File "/obs/lib/__init__.py", line 200, in run_cmd exit_error_cmd(p, "command failed unexpectedly") File "/obs/lib/__init__.py", line 161, in exit_error_cmd raise RuntimeError("shell command related error, find details right above" RuntimeError: shell command related error, find details right above this python trace Build step 'Execute shell' marked build as failure
See https://jenkins.osmocom.org/jenkins/job/Osmocom_OBS_master/93648/display/redirect
Changes:
------------------------------------------ Started by upstream project "master-aram-applet" build number 54 originally caused by: Started by timer Running as SYSTEM Building remotely on build4-deb12build-ansible (ttcn3 obs osmo-gsm-tester-build ttcn3_with_linux_6.1_or_higher qemu io_uring osmocom-gerrit coverity osmocom-master) in workspace https://jenkins.osmocom.org/jenkins/job/Osmocom_OBS_master/ws/ The recommended git tool is: NONE No credentials specified Wiping out workspace first. Cloning the remote Git repository Cloning repository https://gerrit.osmocom.org/osmo-ci
git init https://jenkins.osmocom.org/jenkins/job/Osmocom_OBS_master/ws/ # timeout=10
Fetching upstream changes from https://gerrit.osmocom.org/osmo-ci
git --version # timeout=10 git --version # 'git version 2.39.5' git fetch --tags --force --progress -- https://gerrit.osmocom.org/osmo-ci +refs/heads/*:refs/remotes/origin/* # timeout=10 git config remote.origin.url https://gerrit.osmocom.org/osmo-ci # timeout=10 git config --add remote.origin.fetch +refs/heads/*:refs/remotes/origin/* # timeout=10
Avoid second fetch
git rev-parse refs/remotes/origin/refs/remotes/origin/master^{commit} # timeout=10 git rev-parse refs/remotes/origin/master^{commit} # timeout=10
Checking out Revision 9a18ebaa78fc255a0aea42186a2743829d69162e (refs/remotes/origin/master)
git config core.sparsecheckout # timeout=10 git checkout -f 9a18ebaa78fc255a0aea42186a2743829d69162e # timeout=10
Commit message: "obs: gerrit_binpkgs: set --allow-unknown-package"
git rev-list --no-walk 9a18ebaa78fc255a0aea42186a2743829d69162e # timeout=10
[Osmocom_OBS_master] $ /bin/sh -xe /tmp/jenkins16253158990126398073.sh + export PYTHONUNBUFFERED=1 + ./scripts/obs/update_obs_project.py --apiurl https://obs.osmocom.org --conflict-version --docker --feed master --meta osmocom:master docker: building image debian-12-osmocom-obs-build-srcpkg + run_in_docker_and_exit(): ['docker', 'build', '--build-arg', 'DISTRO=debian:12', '--build-arg', 'DISTRO_FROM=debian:12', '--build-arg', 'UID=1000', '-t', 'debian-12-osmocom-obs-build-srcpkg', '-f', 'https://jenkins.osmocom.org/jenkins/job/Osmocom_OBS_master/ws/scripts/obs/data/build_srcpkg.Dockerfile', 'https://jenkins.osmocom.org/jenkins/job/Osmocom_OBS_master/ws/scripts/obs/data'] #0 building with "default" instance using docker driver
#1 [internal] load build definition from build_srcpkg.Dockerfile #1 transferring dockerfile: 579B done #1 WARN: InvalidDefaultArgInFrom: Default value for ARG ${DISTRO_FROM} results in empty or invalid base image name (line 3) #1 DONE 0.0s
#2 [internal] load metadata for docker.io/library/debian:12 #2 DONE 0.8s
#3 [internal] load .dockerignore #3 transferring context: 2B done #3 DONE 0.0s
#4 [1/3] FROM docker.io/library/debian:12@sha256:18023f131f52fc3ea21973cabffe0b216c60b417fd2478e94d9d59981ebba6af #4 DONE 0.0s
#5 [2/3] RUN APT-GET update && apt-get upgrade -y && apt-get install -y --no-install-recommends ca-certificates colordiff debhelper dh-python dpkg-dev fakeroot git git-review gnupg2 libxml2-utils lsb-release meson osc python3-packaging python3-setuptools quilt rebar3 sed sphinx-common && apt-get clean #5 CACHED
#6 [3/3] RUN USERADD --uid=1000 -m user #6 CACHED
#7 exporting to image #7 exporting layers done #7 writing image sha256:2a9dd95b35028e4d71315e59c45ba43dc43f920d55d8b4980b221443515a5cd4 done #7 naming to docker.io/library/debian-12-osmocom-obs-build-srcpkg done #7 DONE 0.0s
[33m1 warning found (use docker --debug to expand): [0m - InvalidDefaultArgInFrom: Default value for ARG ${DISTRO_FROM} results in empty or invalid base image name (line 3) docker: running: update_obs_project.py inside docker OBS: getting packages in osmocom:master Traceback (most recent call last): File "/obs/update_obs_project.py", line 265, in <module> main() File "/obs/update_obs_project.py", line 257, in main pkgs_remote = lib.osc.get_remote_pkgs() ^^^^^^^^^^^^^^^^^^^^^^^^^ File "/obs/lib/osc.py", line 63, in get_remote_pkgs
ERROR: command failed unexpectedly
*** command *** ['osc', '-A', 'https://obs.osmocom.org', 'list', 'osmocom:master']
*** returncode *** 1
*** output *** Server returned an error: HTTP Error 503: Service Unavailable
Request: https://obs.osmocom.org/source/osmocom:master Headers: Server: nginx Date: Thu, 03 Apr 2025 17:56:19 GMT Content-Type: text/html; charset=UTF-8 Content-Length: 189 Connection: close cache-control: no-cache, no-store, must-revalidate Status: 503 Service Unavailable Cache-Control: public
*** python trace *** ret = run_osc(["list", proj]) ^^^^^^^^^^^^^^^^^^^^^^^ File "/obs/lib/osc.py", line 58, in run_osc return lib.run_cmd(cmd, *args, **kwargs) ^^^^^^^^^^^^^^^^^^^^^^^^^^^^^^^^^ File "/obs/lib/__init__.py", line 200, in run_cmd exit_error_cmd(p, "command failed unexpectedly") File "/obs/lib/__init__.py", line 161, in exit_error_cmd raise RuntimeError("shell command related error, find details right above" RuntimeError: shell command related error, find details right above this python trace Build step 'Execute shell' marked build as failure
See https://jenkins.osmocom.org/jenkins/job/Osmocom_OBS_master/93649/display/redirect
Changes:
------------------------------------------ Started by upstream project "master-osmo-ir77" build number 586 originally caused by: Started by timer Running as SYSTEM Building remotely on build4-deb12build-ansible (ttcn3 obs osmo-gsm-tester-build ttcn3_with_linux_6.1_or_higher qemu io_uring osmocom-gerrit coverity osmocom-master) in workspace https://jenkins.osmocom.org/jenkins/job/Osmocom_OBS_master/ws/ The recommended git tool is: NONE No credentials specified Wiping out workspace first. Cloning the remote Git repository Cloning repository https://gerrit.osmocom.org/osmo-ci
git init https://jenkins.osmocom.org/jenkins/job/Osmocom_OBS_master/ws/ # timeout=10
Fetching upstream changes from https://gerrit.osmocom.org/osmo-ci
git --version # timeout=10 git --version # 'git version 2.39.5' git fetch --tags --force --progress -- https://gerrit.osmocom.org/osmo-ci +refs/heads/*:refs/remotes/origin/* # timeout=10 git config remote.origin.url https://gerrit.osmocom.org/osmo-ci # timeout=10 git config --add remote.origin.fetch +refs/heads/*:refs/remotes/origin/* # timeout=10
Avoid second fetch
git rev-parse refs/remotes/origin/refs/remotes/origin/master^{commit} # timeout=10 git rev-parse refs/remotes/origin/master^{commit} # timeout=10
Checking out Revision 9a18ebaa78fc255a0aea42186a2743829d69162e (refs/remotes/origin/master)
git config core.sparsecheckout # timeout=10 git checkout -f 9a18ebaa78fc255a0aea42186a2743829d69162e # timeout=10
Commit message: "obs: gerrit_binpkgs: set --allow-unknown-package"
git rev-list --no-walk 9a18ebaa78fc255a0aea42186a2743829d69162e # timeout=10
[Osmocom_OBS_master] $ /bin/sh -xe /tmp/jenkins5439551872907353522.sh + export PYTHONUNBUFFERED=1 + ./scripts/obs/update_obs_project.py --apiurl https://obs.osmocom.org --conflict-version --docker --feed master --meta osmocom:master docker: building image debian-12-osmocom-obs-build-srcpkg + run_in_docker_and_exit(): ['docker', 'build', '--build-arg', 'DISTRO=debian:12', '--build-arg', 'DISTRO_FROM=debian:12', '--build-arg', 'UID=1000', '-t', 'debian-12-osmocom-obs-build-srcpkg', '-f', 'https://jenkins.osmocom.org/jenkins/job/Osmocom_OBS_master/ws/scripts/obs/data/build_srcpkg.Dockerfile', 'https://jenkins.osmocom.org/jenkins/job/Osmocom_OBS_master/ws/scripts/obs/data'] #0 building with "default" instance using docker driver
#1 [internal] load build definition from build_srcpkg.Dockerfile #1 transferring dockerfile: 579B done #1 WARN: InvalidDefaultArgInFrom: Default value for ARG ${DISTRO_FROM} results in empty or invalid base image name (line 3) #1 DONE 0.0s
#2 [internal] load metadata for docker.io/library/debian:12 #2 DONE 0.7s
#3 [internal] load .dockerignore #3 transferring context: 2B done #3 DONE 0.0s
#4 [1/3] FROM docker.io/library/debian:12@sha256:18023f131f52fc3ea21973cabffe0b216c60b417fd2478e94d9d59981ebba6af #4 DONE 0.0s
#5 [2/3] RUN APT-GET update && apt-get upgrade -y && apt-get install -y --no-install-recommends ca-certificates colordiff debhelper dh-python dpkg-dev fakeroot git git-review gnupg2 libxml2-utils lsb-release meson osc python3-packaging python3-setuptools quilt rebar3 sed sphinx-common && apt-get clean #5 CACHED
#6 [3/3] RUN USERADD --uid=1000 -m user #6 CACHED
#7 exporting to image #7 exporting layers done #7 writing image sha256:2a9dd95b35028e4d71315e59c45ba43dc43f920d55d8b4980b221443515a5cd4 0.0s done #7 naming to docker.io/library/debian-12-osmocom-obs-build-srcpkg 0.0s done #7 DONE 0.0s
[33m1 warning found (use docker --debug to expand): [0m - InvalidDefaultArgInFrom: Default value for ARG ${DISTRO_FROM} results in empty or invalid base image name (line 3) docker: running: update_obs_project.py inside docker OBS: getting packages in osmocom:master Traceback (most recent call last): File "/obs/update_obs_project.py", line 265, in <module>
ERROR: command failed unexpectedly
*** command *** ['osc', '-A', 'https://obs.osmocom.org', 'list', 'osmocom:master']
*** returncode *** 1
*** output *** Server returned an error: HTTP Error 503: Service Unavailable
Request: https://obs.osmocom.org/source/osmocom:master Headers: Server: nginx Date: Thu, 03 Apr 2025 18:25:34 GMT Content-Type: text/html; charset=UTF-8 Content-Length: 189 Connection: close cache-control: no-cache, no-store, must-revalidate Status: 503 Service Unavailable Cache-Control: public
*** python trace *** main() File "/obs/update_obs_project.py", line 257, in main pkgs_remote = lib.osc.get_remote_pkgs() ^^^^^^^^^^^^^^^^^^^^^^^^^ File "/obs/lib/osc.py", line 63, in get_remote_pkgs ret = run_osc(["list", proj]) ^^^^^^^^^^^^^^^^^^^^^^^ File "/obs/lib/osc.py", line 58, in run_osc return lib.run_cmd(cmd, *args, **kwargs) ^^^^^^^^^^^^^^^^^^^^^^^^^^^^^^^^^ File "/obs/lib/__init__.py", line 200, in run_cmd exit_error_cmd(p, "command failed unexpectedly") File "/obs/lib/__init__.py", line 161, in exit_error_cmd raise RuntimeError("shell command related error, find details right above" RuntimeError: shell command related error, find details right above this python trace Build step 'Execute shell' marked build as failure
See https://jenkins.osmocom.org/jenkins/job/Osmocom_OBS_master/93650/display/redirect
Changes:
------------------------------------------ Started by upstream project "master-osmocom-android-binaries" build number 132 originally caused by: Started by timer Running as SYSTEM Building remotely on build4-deb12build-ansible (ttcn3 obs osmo-gsm-tester-build ttcn3_with_linux_6.1_or_higher qemu io_uring osmocom-gerrit coverity osmocom-master) in workspace https://jenkins.osmocom.org/jenkins/job/Osmocom_OBS_master/ws/ The recommended git tool is: NONE No credentials specified Wiping out workspace first. Cloning the remote Git repository Cloning repository https://gerrit.osmocom.org/osmo-ci
git init https://jenkins.osmocom.org/jenkins/job/Osmocom_OBS_master/ws/ # timeout=10
Fetching upstream changes from https://gerrit.osmocom.org/osmo-ci
git --version # timeout=10 git --version # 'git version 2.39.5' git fetch --tags --force --progress -- https://gerrit.osmocom.org/osmo-ci +refs/heads/*:refs/remotes/origin/* # timeout=10 git config remote.origin.url https://gerrit.osmocom.org/osmo-ci # timeout=10 git config --add remote.origin.fetch +refs/heads/*:refs/remotes/origin/* # timeout=10
Avoid second fetch
git rev-parse refs/remotes/origin/refs/remotes/origin/master^{commit} # timeout=10 git rev-parse refs/remotes/origin/master^{commit} # timeout=10
Checking out Revision 9a18ebaa78fc255a0aea42186a2743829d69162e (refs/remotes/origin/master)
git config core.sparsecheckout # timeout=10 git checkout -f 9a18ebaa78fc255a0aea42186a2743829d69162e # timeout=10
Commit message: "obs: gerrit_binpkgs: set --allow-unknown-package"
git rev-list --no-walk 9a18ebaa78fc255a0aea42186a2743829d69162e # timeout=10
[Osmocom_OBS_master] $ /bin/sh -xe /tmp/jenkins14884338378359024512.sh + export PYTHONUNBUFFERED=1 + ./scripts/obs/update_obs_project.py --apiurl https://obs.osmocom.org --conflict-version --docker --feed master --meta osmocom:master docker: building image debian-12-osmocom-obs-build-srcpkg + run_in_docker_and_exit(): ['docker', 'build', '--build-arg', 'DISTRO=debian:12', '--build-arg', 'DISTRO_FROM=debian:12', '--build-arg', 'UID=1000', '-t', 'debian-12-osmocom-obs-build-srcpkg', '-f', 'https://jenkins.osmocom.org/jenkins/job/Osmocom_OBS_master/ws/scripts/obs/data/build_srcpkg.Dockerfile', 'https://jenkins.osmocom.org/jenkins/job/Osmocom_OBS_master/ws/scripts/obs/data'] #0 building with "default" instance using docker driver
#1 [internal] load build definition from build_srcpkg.Dockerfile #1 transferring dockerfile: 579B done #1 WARN: InvalidDefaultArgInFrom: Default value for ARG ${DISTRO_FROM} results in empty or invalid base image name (line 3) #1 DONE 0.0s
#2 [internal] load metadata for docker.io/library/debian:12 #2 DONE 0.4s
#3 [internal] load .dockerignore #3 transferring context: 2B done #3 DONE 0.0s
#4 [1/3] FROM docker.io/library/debian:12@sha256:18023f131f52fc3ea21973cabffe0b216c60b417fd2478e94d9d59981ebba6af #4 DONE 0.0s
#5 [2/3] RUN APT-GET update && apt-get upgrade -y && apt-get install -y --no-install-recommends ca-certificates colordiff debhelper dh-python dpkg-dev fakeroot git git-review gnupg2 libxml2-utils lsb-release meson osc python3-packaging python3-setuptools quilt rebar3 sed sphinx-common && apt-get clean #5 CACHED
#6 [3/3] RUN USERADD --uid=1000 -m user #6 CACHED
#7 exporting to image #7 exporting layers done #7 writing image sha256:2a9dd95b35028e4d71315e59c45ba43dc43f920d55d8b4980b221443515a5cd4 0.0s done #7 naming to docker.io/library/debian-12-osmocom-obs-build-srcpkg 0.0s done #7 DONE 0.0s
[33m1 warning found (use docker --debug to expand): [0m - InvalidDefaultArgInFrom: Default value for ARG ${DISTRO_FROM} results in empty or invalid base image name (line 3) docker: running: update_obs_project.py inside docker OBS: getting packages in osmocom:master
ERROR: command failed unexpectedly
*** command *** ['osc', '-A', 'https://obs.osmocom.org', 'list', 'osmocom:master']
*** returncode *** 1
*** output *** Server returned an error: HTTP Error 503: Service Unavailable
Request: https://obs.osmocom.org/source/osmocom:master Headers: Server: nginx Date: Thu, 03 Apr 2025 18:26:14 GMT Content-Type: text/html; charset=UTF-8 Content-Length: 189 Connection: close cache-control: no-cache, no-store, must-revalidate Status: 503 Service Unavailable Cache-Control: public
*** python trace *** Traceback (most recent call last): File "/obs/update_obs_project.py", line 265, in <module> main() File "/obs/update_obs_project.py", line 257, in main pkgs_remote = lib.osc.get_remote_pkgs() ^^^^^^^^^^^^^^^^^^^^^^^^^ File "/obs/lib/osc.py", line 63, in get_remote_pkgs ret = run_osc(["list", proj]) ^^^^^^^^^^^^^^^^^^^^^^^ File "/obs/lib/osc.py", line 58, in run_osc return lib.run_cmd(cmd, *args, **kwargs) ^^^^^^^^^^^^^^^^^^^^^^^^^^^^^^^^^ File "/obs/lib/__init__.py", line 200, in run_cmd exit_error_cmd(p, "command failed unexpectedly") File "/obs/lib/__init__.py", line 161, in exit_error_cmd raise RuntimeError("shell command related error, find details right above" RuntimeError: shell command related error, find details right above this python trace Build step 'Execute shell' marked build as failure
See https://jenkins.osmocom.org/jenkins/job/Osmocom_OBS_master/93651/display/redirect
Changes:
------------------------------------------ Started by upstream project "master-osmo-opencm3-projects" build number 1072 originally caused by: Started by timer Running as SYSTEM Building remotely on build4-deb12build-ansible (ttcn3 obs osmo-gsm-tester-build ttcn3_with_linux_6.1_or_higher qemu io_uring osmocom-gerrit coverity osmocom-master) in workspace https://jenkins.osmocom.org/jenkins/job/Osmocom_OBS_master/ws/ The recommended git tool is: NONE No credentials specified Wiping out workspace first. Cloning the remote Git repository Cloning repository https://gerrit.osmocom.org/osmo-ci
git init https://jenkins.osmocom.org/jenkins/job/Osmocom_OBS_master/ws/ # timeout=10
Fetching upstream changes from https://gerrit.osmocom.org/osmo-ci
git --version # timeout=10 git --version # 'git version 2.39.5' git fetch --tags --force --progress -- https://gerrit.osmocom.org/osmo-ci +refs/heads/*:refs/remotes/origin/* # timeout=10 git config remote.origin.url https://gerrit.osmocom.org/osmo-ci # timeout=10 git config --add remote.origin.fetch +refs/heads/*:refs/remotes/origin/* # timeout=10
Avoid second fetch
git rev-parse refs/remotes/origin/refs/remotes/origin/master^{commit} # timeout=10 git rev-parse refs/remotes/origin/master^{commit} # timeout=10
Checking out Revision 9a18ebaa78fc255a0aea42186a2743829d69162e (refs/remotes/origin/master)
git config core.sparsecheckout # timeout=10 git checkout -f 9a18ebaa78fc255a0aea42186a2743829d69162e # timeout=10
Commit message: "obs: gerrit_binpkgs: set --allow-unknown-package"
git rev-list --no-walk 9a18ebaa78fc255a0aea42186a2743829d69162e # timeout=10
[Osmocom_OBS_master] $ /bin/sh -xe /tmp/jenkins15707183325165988989.sh + export PYTHONUNBUFFERED=1 + ./scripts/obs/update_obs_project.py --apiurl https://obs.osmocom.org --conflict-version --docker --feed master --meta osmocom:master docker: building image debian-12-osmocom-obs-build-srcpkg + run_in_docker_and_exit(): ['docker', 'build', '--build-arg', 'DISTRO=debian:12', '--build-arg', 'DISTRO_FROM=debian:12', '--build-arg', 'UID=1000', '-t', 'debian-12-osmocom-obs-build-srcpkg', '-f', 'https://jenkins.osmocom.org/jenkins/job/Osmocom_OBS_master/ws/scripts/obs/data/build_srcpkg.Dockerfile', 'https://jenkins.osmocom.org/jenkins/job/Osmocom_OBS_master/ws/scripts/obs/data'] #0 building with "default" instance using docker driver
#1 [internal] load build definition from build_srcpkg.Dockerfile #1 transferring dockerfile: 579B done #1 WARN: InvalidDefaultArgInFrom: Default value for ARG ${DISTRO_FROM} results in empty or invalid base image name (line 3) #1 DONE 0.0s
#2 [internal] load metadata for docker.io/library/debian:12 #2 DONE 0.9s
#3 [internal] load .dockerignore #3 transferring context: 2B done #3 DONE 0.0s
#4 [1/3] FROM docker.io/library/debian:12@sha256:18023f131f52fc3ea21973cabffe0b216c60b417fd2478e94d9d59981ebba6af #4 DONE 0.0s
#5 [2/3] RUN APT-GET update && apt-get upgrade -y && apt-get install -y --no-install-recommends ca-certificates colordiff debhelper dh-python dpkg-dev fakeroot git git-review gnupg2 libxml2-utils lsb-release meson osc python3-packaging python3-setuptools quilt rebar3 sed sphinx-common && apt-get clean #5 CACHED
#6 [3/3] RUN USERADD --uid=1000 -m user #6 CACHED
#7 exporting to image #7 exporting layers done #7 writing image sha256:2a9dd95b35028e4d71315e59c45ba43dc43f920d55d8b4980b221443515a5cd4 done #7 naming to docker.io/library/debian-12-osmocom-obs-build-srcpkg done #7 DONE 0.0s
[33m1 warning found (use docker --debug to expand): [0m - InvalidDefaultArgInFrom: Default value for ARG ${DISTRO_FROM} results in empty or invalid base image name (line 3) docker: running: update_obs_project.py inside docker OBS: getting packages in osmocom:master Traceback (most recent call last): File "/obs/update_obs_project.py", line 265, in <module> main() File "/obs/update_obs_project.py", line 257, in main pkgs_remote = lib.osc.get_remote_pkgs() ^^^^^^^^^^^^^^^^^^^^^^^^^ File "/obs/lib/osc.py", line 63, in get_remote_pkgs ret = run_osc(["list", proj])
ERROR: command failed unexpectedly
*** command *** ['osc', '-A', 'https://obs.osmocom.org', 'list', 'osmocom:master']
*** returncode *** 1
*** output *** Server returned an error: HTTP Error 503: Service Unavailable
Request: https://obs.osmocom.org/source/osmocom:master Headers: Server: nginx Date: Thu, 03 Apr 2025 18:45:39 GMT Content-Type: text/html; charset=UTF-8 Content-Length: 189 Connection: close cache-control: no-cache, no-store, must-revalidate Status: 503 Service Unavailable Cache-Control: public
*** python trace *** ^^^^^^^^^^^^^^^^^^^^^^^ File "/obs/lib/osc.py", line 58, in run_osc return lib.run_cmd(cmd, *args, **kwargs) ^^^^^^^^^^^^^^^^^^^^^^^^^^^^^^^^^ File "/obs/lib/__init__.py", line 200, in run_cmd exit_error_cmd(p, "command failed unexpectedly") File "/obs/lib/__init__.py", line 161, in exit_error_cmd raise RuntimeError("shell command related error, find details right above" RuntimeError: shell command related error, find details right above this python trace Build step 'Execute shell' marked build as failure
See https://jenkins.osmocom.org/jenkins/job/Osmocom_OBS_master/93652/display/redirect
Changes:
------------------------------------------ Started by upstream project "master-libtelnet" build number 2643 originally caused by: Started by timer Running as SYSTEM Building remotely on build4-deb12build-ansible (ttcn3 obs osmo-gsm-tester-build ttcn3_with_linux_6.1_or_higher qemu io_uring osmocom-gerrit coverity osmocom-master) in workspace https://jenkins.osmocom.org/jenkins/job/Osmocom_OBS_master/ws/ The recommended git tool is: NONE No credentials specified Wiping out workspace first. Cloning the remote Git repository Cloning repository https://gerrit.osmocom.org/osmo-ci
git init https://jenkins.osmocom.org/jenkins/job/Osmocom_OBS_master/ws/ # timeout=10
Fetching upstream changes from https://gerrit.osmocom.org/osmo-ci
git --version # timeout=10 git --version # 'git version 2.39.5' git fetch --tags --force --progress -- https://gerrit.osmocom.org/osmo-ci +refs/heads/*:refs/remotes/origin/* # timeout=10 git config remote.origin.url https://gerrit.osmocom.org/osmo-ci # timeout=10 git config --add remote.origin.fetch +refs/heads/*:refs/remotes/origin/* # timeout=10
Avoid second fetch
git rev-parse refs/remotes/origin/refs/remotes/origin/master^{commit} # timeout=10 git rev-parse refs/remotes/origin/master^{commit} # timeout=10
Checking out Revision 9a18ebaa78fc255a0aea42186a2743829d69162e (refs/remotes/origin/master)
git config core.sparsecheckout # timeout=10 git checkout -f 9a18ebaa78fc255a0aea42186a2743829d69162e # timeout=10
Commit message: "obs: gerrit_binpkgs: set --allow-unknown-package"
git rev-list --no-walk 9a18ebaa78fc255a0aea42186a2743829d69162e # timeout=10
[Osmocom_OBS_master] $ /bin/sh -xe /tmp/jenkins3874081962747089462.sh + export PYTHONUNBUFFERED=1 + ./scripts/obs/update_obs_project.py --apiurl https://obs.osmocom.org --conflict-version --docker --feed master --meta osmocom:master docker: building image debian-12-osmocom-obs-build-srcpkg + run_in_docker_and_exit(): ['docker', 'build', '--build-arg', 'DISTRO=debian:12', '--build-arg', 'DISTRO_FROM=debian:12', '--build-arg', 'UID=1000', '-t', 'debian-12-osmocom-obs-build-srcpkg', '-f', 'https://jenkins.osmocom.org/jenkins/job/Osmocom_OBS_master/ws/scripts/obs/data/build_srcpkg.Dockerfile', 'https://jenkins.osmocom.org/jenkins/job/Osmocom_OBS_master/ws/scripts/obs/data'] #0 building with "default" instance using docker driver
#1 [internal] load build definition from build_srcpkg.Dockerfile #1 transferring dockerfile: 579B done #1 WARN: InvalidDefaultArgInFrom: Default value for ARG ${DISTRO_FROM} results in empty or invalid base image name (line 3) #1 DONE 0.0s
#2 [internal] load metadata for docker.io/library/debian:12 #2 DONE 0.8s
#3 [internal] load .dockerignore #3 transferring context: 2B done #3 DONE 0.0s
#4 [1/3] FROM docker.io/library/debian:12@sha256:18023f131f52fc3ea21973cabffe0b216c60b417fd2478e94d9d59981ebba6af #4 DONE 0.0s
#5 [2/3] RUN APT-GET update && apt-get upgrade -y && apt-get install -y --no-install-recommends ca-certificates colordiff debhelper dh-python dpkg-dev fakeroot git git-review gnupg2 libxml2-utils lsb-release meson osc python3-packaging python3-setuptools quilt rebar3 sed sphinx-common && apt-get clean #5 CACHED
#6 [3/3] RUN USERADD --uid=1000 -m user #6 CACHED
#7 exporting to image #7 exporting layers done #7 writing image sha256:2a9dd95b35028e4d71315e59c45ba43dc43f920d55d8b4980b221443515a5cd4 0.0s done #7 naming to docker.io/library/debian-12-osmocom-obs-build-srcpkg done #7 DONE 0.0s
[33m1 warning found (use docker --debug to expand): [0m - InvalidDefaultArgInFrom: Default value for ARG ${DISTRO_FROM} results in empty or invalid base image name (line 3) docker: running: update_obs_project.py inside docker OBS: getting packages in osmocom:master Traceback (most recent call last): File "/obs/update_obs_project.py", line 265, in <module> main() File "/obs/update_obs_project.py", line 257, in main pkgs_remote = lib.osc.get_remote_pkgs() ^^^^^^^^^^^^^^^^^^^^^^^^^ File "/obs/lib/osc.py", line 63, in get_remote_pkgs
ERROR: command failed unexpectedly
*** command *** ['osc', '-A', 'https://obs.osmocom.org', 'list', 'osmocom:master']
*** returncode *** 1
*** output *** Server returned an error: HTTP Error 503: Service Unavailable
Request: https://obs.osmocom.org/source/osmocom:master Headers: Server: nginx Date: Thu, 03 Apr 2025 19:08:24 GMT Content-Type: text/html; charset=UTF-8 Content-Length: 189 Connection: close cache-control: no-cache, no-store, must-revalidate Status: 503 Service Unavailable Cache-Control: public
*** python trace *** ret = run_osc(["list", proj]) ^^^^^^^^^^^^^^^^^^^^^^^ File "/obs/lib/osc.py", line 58, in run_osc return lib.run_cmd(cmd, *args, **kwargs) ^^^^^^^^^^^^^^^^^^^^^^^^^^^^^^^^^ File "/obs/lib/__init__.py", line 200, in run_cmd exit_error_cmd(p, "command failed unexpectedly") File "/obs/lib/__init__.py", line 161, in exit_error_cmd raise RuntimeError("shell command related error, find details right above" RuntimeError: shell command related error, find details right above this python trace Build step 'Execute shell' marked build as failure
See https://jenkins.osmocom.org/jenkins/job/Osmocom_OBS_master/93653/display/redirect
Changes:
------------------------------------------ Started by upstream project "master-libosmo-dsp" build number 2646 originally caused by: Started by timer Running as SYSTEM Building remotely on build4-deb12build-ansible (ttcn3 obs osmo-gsm-tester-build ttcn3_with_linux_6.1_or_higher qemu io_uring osmocom-gerrit coverity osmocom-master) in workspace https://jenkins.osmocom.org/jenkins/job/Osmocom_OBS_master/ws/ The recommended git tool is: NONE No credentials specified Wiping out workspace first. Cloning the remote Git repository Cloning repository https://gerrit.osmocom.org/osmo-ci
git init https://jenkins.osmocom.org/jenkins/job/Osmocom_OBS_master/ws/ # timeout=10
Fetching upstream changes from https://gerrit.osmocom.org/osmo-ci
git --version # timeout=10 git --version # 'git version 2.39.5' git fetch --tags --force --progress -- https://gerrit.osmocom.org/osmo-ci +refs/heads/*:refs/remotes/origin/* # timeout=10 git config remote.origin.url https://gerrit.osmocom.org/osmo-ci # timeout=10 git config --add remote.origin.fetch +refs/heads/*:refs/remotes/origin/* # timeout=10
Avoid second fetch
git rev-parse refs/remotes/origin/refs/remotes/origin/master^{commit} # timeout=10 git rev-parse refs/remotes/origin/master^{commit} # timeout=10
Checking out Revision 9a18ebaa78fc255a0aea42186a2743829d69162e (refs/remotes/origin/master)
git config core.sparsecheckout # timeout=10 git checkout -f 9a18ebaa78fc255a0aea42186a2743829d69162e # timeout=10
Commit message: "obs: gerrit_binpkgs: set --allow-unknown-package"
git rev-list --no-walk 9a18ebaa78fc255a0aea42186a2743829d69162e # timeout=10
[Osmocom_OBS_master] $ /bin/sh -xe /tmp/jenkins489979367173823030.sh + export PYTHONUNBUFFERED=1 + ./scripts/obs/update_obs_project.py --apiurl https://obs.osmocom.org --conflict-version --docker --feed master --meta osmocom:master docker: building image debian-12-osmocom-obs-build-srcpkg + run_in_docker_and_exit(): ['docker', 'build', '--build-arg', 'DISTRO=debian:12', '--build-arg', 'DISTRO_FROM=debian:12', '--build-arg', 'UID=1000', '-t', 'debian-12-osmocom-obs-build-srcpkg', '-f', 'https://jenkins.osmocom.org/jenkins/job/Osmocom_OBS_master/ws/scripts/obs/data/build_srcpkg.Dockerfile', 'https://jenkins.osmocom.org/jenkins/job/Osmocom_OBS_master/ws/scripts/obs/data'] #0 building with "default" instance using docker driver
#1 [internal] load build definition from build_srcpkg.Dockerfile #1 transferring dockerfile: 579B done #1 WARN: InvalidDefaultArgInFrom: Default value for ARG ${DISTRO_FROM} results in empty or invalid base image name (line 3) #1 DONE 0.0s
#2 [internal] load metadata for docker.io/library/debian:12 #2 DONE 0.7s
#3 [internal] load .dockerignore #3 transferring context: 2B done #3 DONE 0.0s
#4 [1/3] FROM docker.io/library/debian:12@sha256:18023f131f52fc3ea21973cabffe0b216c60b417fd2478e94d9d59981ebba6af #4 DONE 0.0s
#5 [2/3] RUN APT-GET update && apt-get upgrade -y && apt-get install -y --no-install-recommends ca-certificates colordiff debhelper dh-python dpkg-dev fakeroot git git-review gnupg2 libxml2-utils lsb-release meson osc python3-packaging python3-setuptools quilt rebar3 sed sphinx-common && apt-get clean #5 CACHED
#6 [3/3] RUN USERADD --uid=1000 -m user #6 CACHED
#7 exporting to image #7 exporting layers done #7 writing image sha256:2a9dd95b35028e4d71315e59c45ba43dc43f920d55d8b4980b221443515a5cd4 done #7 naming to docker.io/library/debian-12-osmocom-obs-build-srcpkg done #7 DONE 0.0s
[33m1 warning found (use docker --debug to expand): [0m - InvalidDefaultArgInFrom: Default value for ARG ${DISTRO_FROM} results in empty or invalid base image name (line 3) docker: running: update_obs_project.py inside docker OBS: getting packages in osmocom:master Traceback (most recent call last): File "/obs/update_obs_project.py", line 265, in <module> main() File "/obs/update_obs_project.py", line 257, in main pkgs_remote = lib.osc.get_remote_pkgs() ^^^^^^^^^^^^^^^^^^^^^^^^^ File "/obs/lib/osc.py", line 63, in get_remote_pkgs
ERROR: command failed unexpectedly
*** command *** ['osc', '-A', 'https://obs.osmocom.org', 'list', 'osmocom:master']
*** returncode *** 1
*** output *** Server returned an error: HTTP Error 503: Service Unavailable
Request: https://obs.osmocom.org/source/osmocom:master Headers: Server: nginx Date: Thu, 03 Apr 2025 19:19:29 GMT Content-Type: text/html; charset=UTF-8 Content-Length: 189 Connection: close cache-control: no-cache, no-store, must-revalidate Status: 503 Service Unavailable Cache-Control: public
*** python trace *** ret = run_osc(["list", proj]) ^^^^^^^^^^^^^^^^^^^^^^^ File "/obs/lib/osc.py", line 58, in run_osc return lib.run_cmd(cmd, *args, **kwargs) ^^^^^^^^^^^^^^^^^^^^^^^^^^^^^^^^^ File "/obs/lib/__init__.py", line 200, in run_cmd exit_error_cmd(p, "command failed unexpectedly") File "/obs/lib/__init__.py", line 161, in exit_error_cmd raise RuntimeError("shell command related error, find details right above" RuntimeError: shell command related error, find details right above this python trace Build step 'Execute shell' marked build as failure
See https://jenkins.osmocom.org/jenkins/job/Osmocom_OBS_master/93654/display/redirect
Changes:
------------------------------------------ Started by upstream project "master-osmo-gmr" build number 9527 originally caused by: Started by upstream project "master-libosmo-dsp" build number 2646 originally caused by: Started by timer Running as SYSTEM Building remotely on build4-deb12build-ansible (ttcn3 obs osmo-gsm-tester-build ttcn3_with_linux_6.1_or_higher qemu io_uring osmocom-gerrit coverity osmocom-master) in workspace https://jenkins.osmocom.org/jenkins/job/Osmocom_OBS_master/ws/ The recommended git tool is: NONE No credentials specified Wiping out workspace first. Cloning the remote Git repository Cloning repository https://gerrit.osmocom.org/osmo-ci
git init https://jenkins.osmocom.org/jenkins/job/Osmocom_OBS_master/ws/ # timeout=10
Fetching upstream changes from https://gerrit.osmocom.org/osmo-ci
git --version # timeout=10 git --version # 'git version 2.39.5' git fetch --tags --force --progress -- https://gerrit.osmocom.org/osmo-ci +refs/heads/*:refs/remotes/origin/* # timeout=10 git config remote.origin.url https://gerrit.osmocom.org/osmo-ci # timeout=10 git config --add remote.origin.fetch +refs/heads/*:refs/remotes/origin/* # timeout=10
Avoid second fetch
git rev-parse refs/remotes/origin/refs/remotes/origin/master^{commit} # timeout=10 git rev-parse refs/remotes/origin/master^{commit} # timeout=10
Checking out Revision 9a18ebaa78fc255a0aea42186a2743829d69162e (refs/remotes/origin/master)
git config core.sparsecheckout # timeout=10 git checkout -f 9a18ebaa78fc255a0aea42186a2743829d69162e # timeout=10
Commit message: "obs: gerrit_binpkgs: set --allow-unknown-package"
git rev-list --no-walk 9a18ebaa78fc255a0aea42186a2743829d69162e # timeout=10
[Osmocom_OBS_master] $ /bin/sh -xe /tmp/jenkins3521229977537815750.sh + export PYTHONUNBUFFERED=1 + ./scripts/obs/update_obs_project.py --apiurl https://obs.osmocom.org --conflict-version --docker --feed master --meta osmocom:master docker: building image debian-12-osmocom-obs-build-srcpkg + run_in_docker_and_exit(): ['docker', 'build', '--build-arg', 'DISTRO=debian:12', '--build-arg', 'DISTRO_FROM=debian:12', '--build-arg', 'UID=1000', '-t', 'debian-12-osmocom-obs-build-srcpkg', '-f', 'https://jenkins.osmocom.org/jenkins/job/Osmocom_OBS_master/ws/scripts/obs/data/build_srcpkg.Dockerfile', 'https://jenkins.osmocom.org/jenkins/job/Osmocom_OBS_master/ws/scripts/obs/data'] #0 building with "default" instance using docker driver
#1 [internal] load build definition from build_srcpkg.Dockerfile #1 transferring dockerfile: 579B done #1 WARN: InvalidDefaultArgInFrom: Default value for ARG ${DISTRO_FROM} results in empty or invalid base image name (line 3) #1 DONE 0.0s
#2 [internal] load metadata for docker.io/library/debian:12 #2 DONE 0.4s
#3 [internal] load .dockerignore #3 transferring context: 2B done #3 DONE 0.0s
#4 [1/3] FROM docker.io/library/debian:12@sha256:18023f131f52fc3ea21973cabffe0b216c60b417fd2478e94d9d59981ebba6af #4 DONE 0.0s
#5 [2/3] RUN APT-GET update && apt-get upgrade -y && apt-get install -y --no-install-recommends ca-certificates colordiff debhelper dh-python dpkg-dev fakeroot git git-review gnupg2 libxml2-utils lsb-release meson osc python3-packaging python3-setuptools quilt rebar3 sed sphinx-common && apt-get clean #5 CACHED
#6 [3/3] RUN USERADD --uid=1000 -m user #6 CACHED
#7 exporting to image #7 exporting layers done #7 writing image sha256:2a9dd95b35028e4d71315e59c45ba43dc43f920d55d8b4980b221443515a5cd4 0.0s done #7 naming to docker.io/library/debian-12-osmocom-obs-build-srcpkg 0.0s done #7 DONE 0.0s
[33m1 warning found (use docker --debug to expand): [0m - InvalidDefaultArgInFrom: Default value for ARG ${DISTRO_FROM} results in empty or invalid base image name (line 3) docker: running: update_obs_project.py inside docker OBS: getting packages in osmocom:master Traceback (most recent call last): File "/obs/update_obs_project.py", line 265, in <module> main() File "/obs/update_obs_project.py", line 257, in main pkgs_remote = lib.osc.get_remote_pkgs() ^^^^^^^^^^^^^^^^^^^^^^^^^ File "/obs/lib/osc.py", line 63, in get_remote_pkgs
ERROR: command failed unexpectedly
*** command *** ['osc', '-A', 'https://obs.osmocom.org', 'list', 'osmocom:master']
*** returncode *** 1
*** output *** Server returned an error: HTTP Error 503: Service Unavailable
Request: https://obs.osmocom.org/source/osmocom:master Headers: Server: nginx Date: Thu, 03 Apr 2025 19:20:34 GMT Content-Type: text/html; charset=UTF-8 Content-Length: 189 Connection: close cache-control: no-cache, no-store, must-revalidate Status: 503 Service Unavailable Cache-Control: public
*** python trace *** ret = run_osc(["list", proj]) ^^^^^^^^^^^^^^^^^^^^^^^ File "/obs/lib/osc.py", line 58, in run_osc return lib.run_cmd(cmd, *args, **kwargs) ^^^^^^^^^^^^^^^^^^^^^^^^^^^^^^^^^ File "/obs/lib/__init__.py", line 200, in run_cmd exit_error_cmd(p, "command failed unexpectedly") File "/obs/lib/__init__.py", line 161, in exit_error_cmd raise RuntimeError("shell command related error, find details right above" RuntimeError: shell command related error, find details right above this python trace Build step 'Execute shell' marked build as failure
See https://jenkins.osmocom.org/jenkins/job/Osmocom_OBS_master/93655/display/redirect
Changes:
------------------------------------------ Started by upstream project "master-ice40-usbtrace" build number 910 originally caused by: Started by timer Running as SYSTEM Building remotely on build4-deb12build-ansible (ttcn3 obs osmo-gsm-tester-build ttcn3_with_linux_6.1_or_higher qemu io_uring osmocom-gerrit coverity osmocom-master) in workspace https://jenkins.osmocom.org/jenkins/job/Osmocom_OBS_master/ws/ The recommended git tool is: NONE No credentials specified Wiping out workspace first. Cloning the remote Git repository Cloning repository https://gerrit.osmocom.org/osmo-ci
git init https://jenkins.osmocom.org/jenkins/job/Osmocom_OBS_master/ws/ # timeout=10
Fetching upstream changes from https://gerrit.osmocom.org/osmo-ci
git --version # timeout=10 git --version # 'git version 2.39.5' git fetch --tags --force --progress -- https://gerrit.osmocom.org/osmo-ci +refs/heads/*:refs/remotes/origin/* # timeout=10 git config remote.origin.url https://gerrit.osmocom.org/osmo-ci # timeout=10 git config --add remote.origin.fetch +refs/heads/*:refs/remotes/origin/* # timeout=10
Avoid second fetch
git rev-parse refs/remotes/origin/refs/remotes/origin/master^{commit} # timeout=10 git rev-parse refs/remotes/origin/master^{commit} # timeout=10
Checking out Revision 9a18ebaa78fc255a0aea42186a2743829d69162e (refs/remotes/origin/master)
git config core.sparsecheckout # timeout=10 git checkout -f 9a18ebaa78fc255a0aea42186a2743829d69162e # timeout=10
Commit message: "obs: gerrit_binpkgs: set --allow-unknown-package"
git rev-list --no-walk 9a18ebaa78fc255a0aea42186a2743829d69162e # timeout=10
[Osmocom_OBS_master] $ /bin/sh -xe /tmp/jenkins14326219022813330097.sh + export PYTHONUNBUFFERED=1 + ./scripts/obs/update_obs_project.py --apiurl https://obs.osmocom.org --conflict-version --docker --feed master --meta osmocom:master docker: building image debian-12-osmocom-obs-build-srcpkg + run_in_docker_and_exit(): ['docker', 'build', '--build-arg', 'DISTRO=debian:12', '--build-arg', 'DISTRO_FROM=debian:12', '--build-arg', 'UID=1000', '-t', 'debian-12-osmocom-obs-build-srcpkg', '-f', 'https://jenkins.osmocom.org/jenkins/job/Osmocom_OBS_master/ws/scripts/obs/data/build_srcpkg.Dockerfile', 'https://jenkins.osmocom.org/jenkins/job/Osmocom_OBS_master/ws/scripts/obs/data'] #0 building with "default" instance using docker driver
#1 [internal] load build definition from build_srcpkg.Dockerfile #1 transferring dockerfile: 579B done #1 WARN: InvalidDefaultArgInFrom: Default value for ARG ${DISTRO_FROM} results in empty or invalid base image name (line 3) #1 DONE 0.0s
#2 [internal] load metadata for docker.io/library/debian:12 #2 DONE 0.4s
#3 [internal] load .dockerignore #3 transferring context: 2B done #3 DONE 0.0s
#4 [1/3] FROM docker.io/library/debian:12@sha256:18023f131f52fc3ea21973cabffe0b216c60b417fd2478e94d9d59981ebba6af #4 DONE 0.0s
#5 [2/3] RUN APT-GET update && apt-get upgrade -y && apt-get install -y --no-install-recommends ca-certificates colordiff debhelper dh-python dpkg-dev fakeroot git git-review gnupg2 libxml2-utils lsb-release meson osc python3-packaging python3-setuptools quilt rebar3 sed sphinx-common && apt-get clean #5 CACHED
#6 [3/3] RUN USERADD --uid=1000 -m user #6 CACHED
#7 exporting to image #7 exporting layers done #7 writing image sha256:2a9dd95b35028e4d71315e59c45ba43dc43f920d55d8b4980b221443515a5cd4 0.0s done #7 naming to docker.io/library/debian-12-osmocom-obs-build-srcpkg done #7 DONE 0.0s
[33m1 warning found (use docker --debug to expand): [0m - InvalidDefaultArgInFrom: Default value for ARG ${DISTRO_FROM} results in empty or invalid base image name (line 3) docker: running: update_obs_project.py inside docker OBS: getting packages in osmocom:master Traceback (most recent call last): File "/obs/update_obs_project.py", line 265, in <module> main() File "/obs/update_obs_project.py", line 257, in main pkgs_remote = lib.osc.get_remote_pkgs() ^^^^^^^^^^^^^^^^^^^^^^^^^ File "/obs/lib/osc.py", line 63, in get_remote_pkgs ret = run_osc(["list", proj]) ^^^^^^^^^^^^^^^ ERROR: command failed unexpectedly
*** command *** ['osc', '-A', 'https://obs.osmocom.org', 'list', 'osmocom:master']
*** returncode *** 1
*** output *** Server returned an error: HTTP Error 503: Service Unavailable
Request: https://obs.osmocom.org/source/osmocom:master Headers: Server: nginx Date: Thu, 03 Apr 2025 20:30:19 GMT Content-Type: text/html; charset=UTF-8 Content-Length: 189 Connection: close cache-control: no-cache, no-store, must-revalidate Status: 503 Service Unavailable Cache-Control: public
*** python trace *** ^^^^^^^^ File "/obs/lib/osc.py", line 58, in run_osc return lib.run_cmd(cmd, *args, **kwargs) ^^^^^^^^^^^^^^^^^^^^^^^^^^^^^^^^^ File "/obs/lib/__init__.py", line 200, in run_cmd exit_error_cmd(p, "command failed unexpectedly") File "/obs/lib/__init__.py", line 161, in exit_error_cmd raise RuntimeError("shell command related error, find details right above" RuntimeError: shell command related error, find details right above this python trace Build step 'Execute shell' marked build as failure
See https://jenkins.osmocom.org/jenkins/job/Osmocom_OBS_master/93656/display/redirect
Changes:
------------------------------------------ Started by upstream project "master-osmo-ggsn" build number 9670 originally caused by: Started by timer Running as SYSTEM Building remotely on build4-deb12build-ansible (ttcn3 obs osmo-gsm-tester-build ttcn3_with_linux_6.1_or_higher qemu io_uring osmocom-gerrit coverity osmocom-master) in workspace https://jenkins.osmocom.org/jenkins/job/Osmocom_OBS_master/ws/ The recommended git tool is: NONE No credentials specified Wiping out workspace first. Cloning the remote Git repository Cloning repository https://gerrit.osmocom.org/osmo-ci
git init https://jenkins.osmocom.org/jenkins/job/Osmocom_OBS_master/ws/ # timeout=10
Fetching upstream changes from https://gerrit.osmocom.org/osmo-ci
git --version # timeout=10 git --version # 'git version 2.39.5' git fetch --tags --force --progress -- https://gerrit.osmocom.org/osmo-ci +refs/heads/*:refs/remotes/origin/* # timeout=10 git config remote.origin.url https://gerrit.osmocom.org/osmo-ci # timeout=10 git config --add remote.origin.fetch +refs/heads/*:refs/remotes/origin/* # timeout=10
Avoid second fetch
git rev-parse refs/remotes/origin/refs/remotes/origin/master^{commit} # timeout=10 git rev-parse refs/remotes/origin/master^{commit} # timeout=10
Checking out Revision 9a18ebaa78fc255a0aea42186a2743829d69162e (refs/remotes/origin/master)
git config core.sparsecheckout # timeout=10 git checkout -f 9a18ebaa78fc255a0aea42186a2743829d69162e # timeout=10
Commit message: "obs: gerrit_binpkgs: set --allow-unknown-package"
git rev-list --no-walk 9a18ebaa78fc255a0aea42186a2743829d69162e # timeout=10
[Osmocom_OBS_master] $ /bin/sh -xe /tmp/jenkins15557923638305379547.sh + export PYTHONUNBUFFERED=1 + ./scripts/obs/update_obs_project.py --apiurl https://obs.osmocom.org --conflict-version --docker --feed master --meta osmocom:master docker: building image debian-12-osmocom-obs-build-srcpkg + run_in_docker_and_exit(): ['docker', 'build', '--build-arg', 'DISTRO=debian:12', '--build-arg', 'DISTRO_FROM=debian:12', '--build-arg', 'UID=1000', '-t', 'debian-12-osmocom-obs-build-srcpkg', '-f', 'https://jenkins.osmocom.org/jenkins/job/Osmocom_OBS_master/ws/scripts/obs/data/build_srcpkg.Dockerfile', 'https://jenkins.osmocom.org/jenkins/job/Osmocom_OBS_master/ws/scripts/obs/data'] #0 building with "default" instance using docker driver
#1 [internal] load build definition from build_srcpkg.Dockerfile #1 transferring dockerfile: 579B done #1 WARN: InvalidDefaultArgInFrom: Default value for ARG ${DISTRO_FROM} results in empty or invalid base image name (line 3) #1 DONE 0.0s
#2 [internal] load metadata for docker.io/library/debian:12 #2 DONE 0.8s
#3 [internal] load .dockerignore #3 transferring context: 2B done #3 DONE 0.0s
#4 [1/3] FROM docker.io/library/debian:12@sha256:18023f131f52fc3ea21973cabffe0b216c60b417fd2478e94d9d59981ebba6af #4 DONE 0.0s
#5 [2/3] RUN APT-GET update && apt-get upgrade -y && apt-get install -y --no-install-recommends ca-certificates colordiff debhelper dh-python dpkg-dev fakeroot git git-review gnupg2 libxml2-utils lsb-release meson osc python3-packaging python3-setuptools quilt rebar3 sed sphinx-common && apt-get clean #5 CACHED
#6 [3/3] RUN USERADD --uid=1000 -m user #6 CACHED
#7 exporting to image #7 exporting layers done #7 writing image sha256:2a9dd95b35028e4d71315e59c45ba43dc43f920d55d8b4980b221443515a5cd4 done #7 naming to docker.io/library/debian-12-osmocom-obs-build-srcpkg done #7 DONE 0.0s
[33m1 warning found (use docker --debug to expand): [0m - InvalidDefaultArgInFrom: Default value for ARG ${DISTRO_FROM} results in empty or invalid base image name (line 3) docker: running: update_obs_project.py inside docker OBS: getting packages in osmocom:master
ERROR: command failed unexpectedly
*** command *** ['osc', '-A', 'https://obs.osmocom.org', 'list', 'osmocom:master']
*** returncode *** 1
*** output *** Server returned an error: HTTP Error 503: Service Unavailable
Request: https://obs.osmocom.org/source/osmocom:master Headers: Server: nginx Date: Thu, 03 Apr 2025 20:42:15 GMT Content-Type: text/html; charset=UTF-8 Content-Length: 189 Connection: close cache-control: no-cache, no-store, must-revalidate Status: 503 Service Unavailable Cache-Control: public
*** python trace *** Traceback (most recent call last): File "/obs/update_obs_project.py", line 265, in <module> main() File "/obs/update_obs_project.py", line 257, in main pkgs_remote = lib.osc.get_remote_pkgs() ^^^^^^^^^^^^^^^^^^^^^^^^^ File "/obs/lib/osc.py", line 63, in get_remote_pkgs ret = run_osc(["list", proj]) ^^^^^^^^^^^^^^^^^^^^^^^ File "/obs/lib/osc.py", line 58, in run_osc return lib.run_cmd(cmd, *args, **kwargs) ^^^^^^^^^^^^^^^^^^^^^^^^^^^^^^^^^ File "/obs/lib/__init__.py", line 200, in run_cmd exit_error_cmd(p, "command failed unexpectedly") File "/obs/lib/__init__.py", line 161, in exit_error_cmd raise RuntimeError("shell command related error, find details right above" RuntimeError: shell command related error, find details right above this python trace Build step 'Execute shell' marked build as failure
See https://jenkins.osmocom.org/jenkins/job/Osmocom_OBS_master/93657/display/redirect
Changes:
------------------------------------------ Started by upstream project "master-osmo-sgsn" build number 52760 originally caused by: Started by upstream project "master-osmo-ggsn" build number 9670 originally caused by: Started by timer Running as SYSTEM Building remotely on build4-deb12build-ansible (ttcn3 obs osmo-gsm-tester-build ttcn3_with_linux_6.1_or_higher qemu io_uring osmocom-gerrit coverity osmocom-master) in workspace https://jenkins.osmocom.org/jenkins/job/Osmocom_OBS_master/ws/ The recommended git tool is: NONE No credentials specified Wiping out workspace first. Cloning the remote Git repository Cloning repository https://gerrit.osmocom.org/osmo-ci
git init https://jenkins.osmocom.org/jenkins/job/Osmocom_OBS_master/ws/ # timeout=10
Fetching upstream changes from https://gerrit.osmocom.org/osmo-ci
git --version # timeout=10 git --version # 'git version 2.39.5' git fetch --tags --force --progress -- https://gerrit.osmocom.org/osmo-ci +refs/heads/*:refs/remotes/origin/* # timeout=10 git config remote.origin.url https://gerrit.osmocom.org/osmo-ci # timeout=10 git config --add remote.origin.fetch +refs/heads/*:refs/remotes/origin/* # timeout=10
Avoid second fetch
git rev-parse refs/remotes/origin/refs/remotes/origin/master^{commit} # timeout=10 git rev-parse refs/remotes/origin/master^{commit} # timeout=10
Checking out Revision 9a18ebaa78fc255a0aea42186a2743829d69162e (refs/remotes/origin/master)
git config core.sparsecheckout # timeout=10 git checkout -f 9a18ebaa78fc255a0aea42186a2743829d69162e # timeout=10
Commit message: "obs: gerrit_binpkgs: set --allow-unknown-package"
git rev-list --no-walk 9a18ebaa78fc255a0aea42186a2743829d69162e # timeout=10
[Osmocom_OBS_master] $ /bin/sh -xe /tmp/jenkins2811261944333580003.sh + export PYTHONUNBUFFERED=1 + ./scripts/obs/update_obs_project.py --apiurl https://obs.osmocom.org --conflict-version --docker --feed master --meta osmocom:master docker: building image debian-12-osmocom-obs-build-srcpkg + run_in_docker_and_exit(): ['docker', 'build', '--build-arg', 'DISTRO=debian:12', '--build-arg', 'DISTRO_FROM=debian:12', '--build-arg', 'UID=1000', '-t', 'debian-12-osmocom-obs-build-srcpkg', '-f', 'https://jenkins.osmocom.org/jenkins/job/Osmocom_OBS_master/ws/scripts/obs/data/build_srcpkg.Dockerfile', 'https://jenkins.osmocom.org/jenkins/job/Osmocom_OBS_master/ws/scripts/obs/data'] #0 building with "default" instance using docker driver
#1 [internal] load build definition from build_srcpkg.Dockerfile #1 transferring dockerfile: 579B done #1 WARN: InvalidDefaultArgInFrom: Default value for ARG ${DISTRO_FROM} results in empty or invalid base image name (line 3) #1 DONE 0.0s
#2 [internal] load metadata for docker.io/library/debian:12 #2 DONE 0.4s
#3 [internal] load .dockerignore #3 transferring context: 2B done #3 DONE 0.0s
#4 [1/3] FROM docker.io/library/debian:12@sha256:18023f131f52fc3ea21973cabffe0b216c60b417fd2478e94d9d59981ebba6af #4 DONE 0.0s
#5 [2/3] RUN APT-GET update && apt-get upgrade -y && apt-get install -y --no-install-recommends ca-certificates colordiff debhelper dh-python dpkg-dev fakeroot git git-review gnupg2 libxml2-utils lsb-release meson osc python3-packaging python3-setuptools quilt rebar3 sed sphinx-common && apt-get clean #5 CACHED
#6 [3/3] RUN USERADD --uid=1000 -m user #6 CACHED
#7 exporting to image #7 exporting layers done #7 writing image sha256:2a9dd95b35028e4d71315e59c45ba43dc43f920d55d8b4980b221443515a5cd4 0.0s done #7 naming to docker.io/library/debian-12-osmocom-obs-build-srcpkg done #7 DONE 0.0s
[33m1 warning found (use docker --debug to expand): [0m - InvalidDefaultArgInFrom: Default value for ARG ${DISTRO_FROM} results in empty or invalid base image name (line 3) docker: running: update_obs_project.py inside docker OBS: getting packages in osmocom:master
ERROR: command failed unexpectedly
*** command *** ['osc', '-A', 'https://obs.osmocom.org', 'list', 'osmocom:master']
*** returncode *** 1
*** output *** Server returned an error: HTTP Error 503: Service Unavailable
Request: https://obs.osmocom.org/source/osmocom:master Headers: Server: nginx Date: Thu, 03 Apr 2025 20:45:54 GMT Content-Type: text/html; charset=UTF-8 Content-Length: 189 Connection: close cache-control: no-cache, no-store, must-revalidate Status: 503 Service Unavailable Cache-Control: public
*** python trace *** Traceback (most recent call last): File "/obs/update_obs_project.py", line 265, in <module> main() File "/obs/update_obs_project.py", line 257, in main pkgs_remote = lib.osc.get_remote_pkgs() ^^^^^^^^^^^^^^^^^^^^^^^^^ File "/obs/lib/osc.py", line 63, in get_remote_pkgs ret = run_osc(["list", proj]) ^^^^^^^^^^^^^^^^^^^^^^^ File "/obs/lib/osc.py", line 58, in run_osc return lib.run_cmd(cmd, *args, **kwargs) ^^^^^^^^^^^^^^^^^^^^^^^^^^^^^^^^^ File "/obs/lib/__init__.py", line 200, in run_cmd exit_error_cmd(p, "command failed unexpectedly") File "/obs/lib/__init__.py", line 161, in exit_error_cmd raise RuntimeError("shell command related error, find details right above" RuntimeError: shell command related error, find details right above this python trace Build step 'Execute shell' marked build as failure
See https://jenkins.osmocom.org/jenkins/job/Osmocom_OBS_master/93658/display/redirect
Changes:
------------------------------------------ Started by timer Running as SYSTEM Building remotely on build4-deb12build-ansible (ttcn3 obs osmo-gsm-tester-build ttcn3_with_linux_6.1_or_higher qemu io_uring osmocom-gerrit coverity osmocom-master) in workspace https://jenkins.osmocom.org/jenkins/job/Osmocom_OBS_master/ws/ The recommended git tool is: NONE No credentials specified Wiping out workspace first. Cloning the remote Git repository Cloning repository https://gerrit.osmocom.org/osmo-ci
git init https://jenkins.osmocom.org/jenkins/job/Osmocom_OBS_master/ws/ # timeout=10
Fetching upstream changes from https://gerrit.osmocom.org/osmo-ci
git --version # timeout=10 git --version # 'git version 2.39.5' git fetch --tags --force --progress -- https://gerrit.osmocom.org/osmo-ci +refs/heads/*:refs/remotes/origin/* # timeout=10 git config remote.origin.url https://gerrit.osmocom.org/osmo-ci # timeout=10 git config --add remote.origin.fetch +refs/heads/*:refs/remotes/origin/* # timeout=10
Avoid second fetch
git rev-parse refs/remotes/origin/refs/remotes/origin/master^{commit} # timeout=10 git rev-parse refs/remotes/origin/master^{commit} # timeout=10
Checking out Revision 9a18ebaa78fc255a0aea42186a2743829d69162e (refs/remotes/origin/master)
git config core.sparsecheckout # timeout=10 git checkout -f 9a18ebaa78fc255a0aea42186a2743829d69162e # timeout=10
Commit message: "obs: gerrit_binpkgs: set --allow-unknown-package"
git rev-list --no-walk 9a18ebaa78fc255a0aea42186a2743829d69162e # timeout=10
[Osmocom_OBS_master] $ /bin/sh -xe /tmp/jenkins10828266411817387734.sh + export PYTHONUNBUFFERED=1 + ./scripts/obs/update_obs_project.py --apiurl https://obs.osmocom.org --conflict-version --docker --feed master --meta osmocom:master docker: building image debian-12-osmocom-obs-build-srcpkg + run_in_docker_and_exit(): ['docker', 'build', '--build-arg', 'DISTRO=debian:12', '--build-arg', 'DISTRO_FROM=debian:12', '--build-arg', 'UID=1000', '-t', 'debian-12-osmocom-obs-build-srcpkg', '-f', 'https://jenkins.osmocom.org/jenkins/job/Osmocom_OBS_master/ws/scripts/obs/data/build_srcpkg.Dockerfile', 'https://jenkins.osmocom.org/jenkins/job/Osmocom_OBS_master/ws/scripts/obs/data'] #0 building with "default" instance using docker driver
#1 [internal] load build definition from build_srcpkg.Dockerfile #1 transferring dockerfile: 579B done #1 WARN: InvalidDefaultArgInFrom: Default value for ARG ${DISTRO_FROM} results in empty or invalid base image name (line 3) #1 DONE 0.0s
#2 [internal] load metadata for docker.io/library/debian:12 #2 DONE 0.4s
#3 [internal] load .dockerignore #3 transferring context: 2B done #3 DONE 0.0s
#4 [1/3] FROM docker.io/library/debian:12@sha256:18023f131f52fc3ea21973cabffe0b216c60b417fd2478e94d9d59981ebba6af #4 DONE 0.0s
#5 [2/3] RUN APT-GET update && apt-get upgrade -y && apt-get install -y --no-install-recommends ca-certificates colordiff debhelper dh-python dpkg-dev fakeroot git git-review gnupg2 libxml2-utils lsb-release meson osc python3-packaging python3-setuptools quilt rebar3 sed sphinx-common && apt-get clean #5 CACHED
#6 [3/3] RUN USERADD --uid=1000 -m user #6 CACHED
#7 exporting to image #7 exporting layers done #7 writing image sha256:2a9dd95b35028e4d71315e59c45ba43dc43f920d55d8b4980b221443515a5cd4 done #7 naming to docker.io/library/debian-12-osmocom-obs-build-srcpkg 0.0s done #7 DONE 0.0s
[33m1 warning found (use docker --debug to expand): [0m - InvalidDefaultArgInFrom: Default value for ARG ${DISTRO_FROM} results in empty or invalid base image name (line 3) docker: running: update_obs_project.py inside docker OBS: getting packages in osmocom:master Traceback (most recent call last): File "/obs/update_obs_project.py", line 265, in <module> main() File "/obs/update_obs_project.py", line 257, in main
ERROR: command failed unexpectedly
*** command *** ['osc', '-A', 'https://obs.osmocom.org', 'list', 'osmocom:master']
*** returncode *** 1
*** output *** Server returned an error: HTTP Error 503: Service Unavailable
Request: https://obs.osmocom.org/source/osmocom:master Headers: Server: nginx Date: Thu, 03 Apr 2025 20:46:02 GMT Content-Type: text/html; charset=UTF-8 Content-Length: 189 Connection: close cache-control: no-cache, no-store, must-revalidate Status: 503 Service Unavailable Cache-Control: public
*** python trace *** pkgs_remote = lib.osc.get_remote_pkgs() ^^^^^^^^^^^^^^^^^^^^^^^^^ File "/obs/lib/osc.py", line 63, in get_remote_pkgs ret = run_osc(["list", proj]) ^^^^^^^^^^^^^^^^^^^^^^^ File "/obs/lib/osc.py", line 58, in run_osc return lib.run_cmd(cmd, *args, **kwargs) ^^^^^^^^^^^^^^^^^^^^^^^^^^^^^^^^^ File "/obs/lib/__init__.py", line 200, in run_cmd exit_error_cmd(p, "command failed unexpectedly") File "/obs/lib/__init__.py", line 161, in exit_error_cmd raise RuntimeError("shell command related error, find details right above" RuntimeError: shell command related error, find details right above this python trace Build step 'Execute shell' marked build as failure
See https://jenkins.osmocom.org/jenkins/job/Osmocom_OBS_master/93659/display/redirect
Changes:
------------------------------------------ Started by upstream project "master-osmo-gbproxy" build number 3823 originally caused by: Started by timer Running as SYSTEM Building remotely on build4-deb12build-ansible (ttcn3 obs osmo-gsm-tester-build ttcn3_with_linux_6.1_or_higher qemu io_uring osmocom-gerrit coverity osmocom-master) in workspace https://jenkins.osmocom.org/jenkins/job/Osmocom_OBS_master/ws/ The recommended git tool is: NONE No credentials specified Wiping out workspace first. Cloning the remote Git repository Cloning repository https://gerrit.osmocom.org/osmo-ci
git init https://jenkins.osmocom.org/jenkins/job/Osmocom_OBS_master/ws/ # timeout=10
Fetching upstream changes from https://gerrit.osmocom.org/osmo-ci
git --version # timeout=10 git --version # 'git version 2.39.5' git fetch --tags --force --progress -- https://gerrit.osmocom.org/osmo-ci +refs/heads/*:refs/remotes/origin/* # timeout=10 git config remote.origin.url https://gerrit.osmocom.org/osmo-ci # timeout=10 git config --add remote.origin.fetch +refs/heads/*:refs/remotes/origin/* # timeout=10
Avoid second fetch
git rev-parse refs/remotes/origin/refs/remotes/origin/master^{commit} # timeout=10 git rev-parse refs/remotes/origin/master^{commit} # timeout=10
Checking out Revision 9a18ebaa78fc255a0aea42186a2743829d69162e (refs/remotes/origin/master)
git config core.sparsecheckout # timeout=10 git checkout -f 9a18ebaa78fc255a0aea42186a2743829d69162e # timeout=10
Commit message: "obs: gerrit_binpkgs: set --allow-unknown-package"
git rev-list --no-walk 9a18ebaa78fc255a0aea42186a2743829d69162e # timeout=10
[Osmocom_OBS_master] $ /bin/sh -xe /tmp/jenkins14110253983225793556.sh + export PYTHONUNBUFFERED=1 + ./scripts/obs/update_obs_project.py --apiurl https://obs.osmocom.org --conflict-version --docker --feed master --meta osmocom:master docker: building image debian-12-osmocom-obs-build-srcpkg + run_in_docker_and_exit(): ['docker', 'build', '--build-arg', 'DISTRO=debian:12', '--build-arg', 'DISTRO_FROM=debian:12', '--build-arg', 'UID=1000', '-t', 'debian-12-osmocom-obs-build-srcpkg', '-f', 'https://jenkins.osmocom.org/jenkins/job/Osmocom_OBS_master/ws/scripts/obs/data/build_srcpkg.Dockerfile', 'https://jenkins.osmocom.org/jenkins/job/Osmocom_OBS_master/ws/scripts/obs/data'] #0 building with "default" instance using docker driver
#1 [internal] load build definition from build_srcpkg.Dockerfile #1 transferring dockerfile: 579B done #1 DONE 0.1s
#2 [internal] load metadata for docker.io/library/debian:12 #2 DONE 0.8s
#3 [internal] load .dockerignore #3 transferring context: 2B done #3 DONE 0.1s
#4 [1/3] FROM docker.io/library/debian:12@sha256:18023f131f52fc3ea21973cabffe0b216c60b417fd2478e94d9d59981ebba6af #4 DONE 0.0s
#5 [2/3] RUN APT-GET update && apt-get upgrade -y && apt-get install -y --no-install-recommends ca-certificates colordiff debhelper dh-python dpkg-dev fakeroot git git-review gnupg2 libxml2-utils lsb-release meson osc python3-packaging python3-setuptools quilt rebar3 sed sphinx-common && apt-get clean #5 CACHED
#6 [3/3] RUN USERADD --uid=1000 -m user #6 CACHED
#7 exporting to image #7 exporting layers done #7 writing image sha256:2a9dd95b35028e4d71315e59c45ba43dc43f920d55d8b4980b221443515a5cd4 done #7 naming to docker.io/library/debian-12-osmocom-obs-build-srcpkg #7 naming to docker.io/library/debian-12-osmocom-obs-build-srcpkg done #7 DONE 0.0s
[33m1 warning found (use docker --debug to expand): [0m - InvalidDefaultArgInFrom: Default value for ARG ${DISTRO_FROM} results in empty or invalid base image name (line 3) docker: running: update_obs_project.py inside docker OBS: getting packages in osmocom:master Traceback (most recent call last): File "/obs/update_obs_project.py", line 265, in <module> main() File "/obs/update_obs_project.py", line 257, in main pkgs_remote = lib.osc.get_remote_pkgs() ^^^^^^^^^^^^^^^^^^^^^^^^^ File "/obs/lib/osc.py", line 63, in get_remote_pkgs ret = run_osc(["list", proj]) ^^^^^^^^^^^^^^^^^^^^^^^ File "/obs/lib/osc.py", line 58, in run_osc
ERROR: command failed unexpectedly
*** command *** ['osc', '-A', 'https://obs.osmocom.org', 'list', 'osmocom:master']
*** returncode *** 1
*** output *** Server returned an error: HTTP Error 503: Service Unavailable
Request: https://obs.osmocom.org/source/osmocom:master Headers: Server: nginx Date: Thu, 03 Apr 2025 21:16:25 GMT Content-Type: text/html; charset=UTF-8 Content-Length: 189 Connection: close cache-control: no-cache, no-store, must-revalidate Status: 503 Service Unavailable Cache-Control: public
*** python trace *** return lib.run_cmd(cmd, *args, **kwargs) ^^^^^^^^^^^^^^^^^^^^^^^^^^^^^^^^^ File "/obs/lib/__init__.py", line 200, in run_cmd exit_error_cmd(p, "command failed unexpectedly") File "/obs/lib/__init__.py", line 161, in exit_error_cmd raise RuntimeError("shell command related error, find details right above" RuntimeError: shell command related error, find details right above this python trace Build step 'Execute shell' marked build as failure
See https://jenkins.osmocom.org/jenkins/job/Osmocom_OBS_master/93660/display/redirect
Changes:
------------------------------------------ Started by upstream project "master-osmocom-bb" build number 7399 originally caused by: Started by timer Running as SYSTEM Building remotely on build4-deb12build-ansible (ttcn3 obs osmo-gsm-tester-build ttcn3_with_linux_6.1_or_higher qemu io_uring osmocom-gerrit coverity osmocom-master) in workspace https://jenkins.osmocom.org/jenkins/job/Osmocom_OBS_master/ws/ The recommended git tool is: NONE No credentials specified Wiping out workspace first. Cloning the remote Git repository Cloning repository https://gerrit.osmocom.org/osmo-ci
git init https://jenkins.osmocom.org/jenkins/job/Osmocom_OBS_master/ws/ # timeout=10
Fetching upstream changes from https://gerrit.osmocom.org/osmo-ci
git --version # timeout=10 git --version # 'git version 2.39.5' git fetch --tags --force --progress -- https://gerrit.osmocom.org/osmo-ci +refs/heads/*:refs/remotes/origin/* # timeout=10 git config remote.origin.url https://gerrit.osmocom.org/osmo-ci # timeout=10 git config --add remote.origin.fetch +refs/heads/*:refs/remotes/origin/* # timeout=10
Avoid second fetch
git rev-parse refs/remotes/origin/refs/remotes/origin/master^{commit} # timeout=10 git rev-parse refs/remotes/origin/master^{commit} # timeout=10
Checking out Revision 9a18ebaa78fc255a0aea42186a2743829d69162e (refs/remotes/origin/master)
git config core.sparsecheckout # timeout=10 git checkout -f 9a18ebaa78fc255a0aea42186a2743829d69162e # timeout=10
Commit message: "obs: gerrit_binpkgs: set --allow-unknown-package"
git rev-list --no-walk 9a18ebaa78fc255a0aea42186a2743829d69162e # timeout=10
[Osmocom_OBS_master] $ /bin/sh -xe /tmp/jenkins16848580526630114371.sh + export PYTHONUNBUFFERED=1 + ./scripts/obs/update_obs_project.py --apiurl https://obs.osmocom.org --conflict-version --docker --feed master --meta osmocom:master docker: building image debian-12-osmocom-obs-build-srcpkg + run_in_docker_and_exit(): ['docker', 'build', '--build-arg', 'DISTRO=debian:12', '--build-arg', 'DISTRO_FROM=debian:12', '--build-arg', 'UID=1000', '-t', 'debian-12-osmocom-obs-build-srcpkg', '-f', 'https://jenkins.osmocom.org/jenkins/job/Osmocom_OBS_master/ws/scripts/obs/data/build_srcpkg.Dockerfile', 'https://jenkins.osmocom.org/jenkins/job/Osmocom_OBS_master/ws/scripts/obs/data'] #0 building with "default" instance using docker driver
#1 [internal] load build definition from build_srcpkg.Dockerfile #1 transferring dockerfile: 579B done #1 WARN: InvalidDefaultArgInFrom: Default value for ARG ${DISTRO_FROM} results in empty or invalid base image name (line 3) #1 DONE 0.0s
#2 [internal] load metadata for docker.io/library/debian:12 #2 DONE 0.4s
#3 [internal] load .dockerignore #3 transferring context: 2B done #3 DONE 0.0s
#4 [1/3] FROM docker.io/library/debian:12@sha256:18023f131f52fc3ea21973cabffe0b216c60b417fd2478e94d9d59981ebba6af #4 DONE 0.0s
#5 [2/3] RUN APT-GET update && apt-get upgrade -y && apt-get install -y --no-install-recommends ca-certificates colordiff debhelper dh-python dpkg-dev fakeroot git git-review gnupg2 libxml2-utils lsb-release meson osc python3-packaging python3-setuptools quilt rebar3 sed sphinx-common && apt-get clean #5 CACHED
#6 [3/3] RUN USERADD --uid=1000 -m user #6 CACHED
#7 exporting to image #7 exporting layers done #7 writing image sha256:2a9dd95b35028e4d71315e59c45ba43dc43f920d55d8b4980b221443515a5cd4 0.0s done #7 naming to docker.io/library/debian-12-osmocom-obs-build-srcpkg 0.0s done #7 DONE 0.0s
[33m1 warning found (use docker --debug to expand): [0m - InvalidDefaultArgInFrom: Default value for ARG ${DISTRO_FROM} results in empty or invalid base image name (line 3) docker: running: update_obs_project.py inside docker OBS: getting packages in osmocom:master
ERROR: command failed unexpectedly
*** command *** ['osc', '-A', 'https://obs.osmocom.org', 'list', 'osmocom:master']
*** returncode *** 1
*** output *** Server returned an error: HTTP Error 503: Service Unavailable
Request: https://obs.osmocom.org/source/osmocom:master Headers: Server: nginx Date: Thu, 03 Apr 2025 21:16:49 GMT Content-Type: text/html; charset=UTF-8 Content-Length: 189 Connection: close cache-control: no-cache, no-store, must-revalidate Status: 503 Service Unavailable Cache-Control: public
*** python trace *** Traceback (most recent call last): File "/obs/update_obs_project.py", line 265, in <module> main() File "/obs/update_obs_project.py", line 257, in main pkgs_remote = lib.osc.get_remote_pkgs() ^^^^^^^^^^^^^^^^^^^^^^^^^ File "/obs/lib/osc.py", line 63, in get_remote_pkgs ret = run_osc(["list", proj]) ^^^^^^^^^^^^^^^^^^^^^^^ File "/obs/lib/osc.py", line 58, in run_osc return lib.run_cmd(cmd, *args, **kwargs) ^^^^^^^^^^^^^^^^^^^^^^^^^^^^^^^^^ File "/obs/lib/__init__.py", line 200, in run_cmd exit_error_cmd(p, "command failed unexpectedly") File "/obs/lib/__init__.py", line 161, in exit_error_cmd raise RuntimeError("shell command related error, find details right above" RuntimeError: shell command related error, find details right above this python trace Build step 'Execute shell' marked build as failure
See https://jenkins.osmocom.org/jenkins/job/Osmocom_OBS_master/93661/display/redirect
Changes:
------------------------------------------ Started by upstream project "master-osmo-gmr" build number 9528 originally caused by: Started by timer Running as SYSTEM Building remotely on build4-deb12build-ansible (ttcn3 obs osmo-gsm-tester-build ttcn3_with_linux_6.1_or_higher qemu io_uring osmocom-gerrit coverity osmocom-master) in workspace https://jenkins.osmocom.org/jenkins/job/Osmocom_OBS_master/ws/ The recommended git tool is: NONE No credentials specified Wiping out workspace first. Cloning the remote Git repository Cloning repository https://gerrit.osmocom.org/osmo-ci
git init https://jenkins.osmocom.org/jenkins/job/Osmocom_OBS_master/ws/ # timeout=10
Fetching upstream changes from https://gerrit.osmocom.org/osmo-ci
git --version # timeout=10 git --version # 'git version 2.39.5' git fetch --tags --force --progress -- https://gerrit.osmocom.org/osmo-ci +refs/heads/*:refs/remotes/origin/* # timeout=10 git config remote.origin.url https://gerrit.osmocom.org/osmo-ci # timeout=10 git config --add remote.origin.fetch +refs/heads/*:refs/remotes/origin/* # timeout=10
Avoid second fetch
git rev-parse refs/remotes/origin/refs/remotes/origin/master^{commit} # timeout=10 git rev-parse refs/remotes/origin/master^{commit} # timeout=10
Checking out Revision 9a18ebaa78fc255a0aea42186a2743829d69162e (refs/remotes/origin/master)
git config core.sparsecheckout # timeout=10 git checkout -f 9a18ebaa78fc255a0aea42186a2743829d69162e # timeout=10
Commit message: "obs: gerrit_binpkgs: set --allow-unknown-package"
git rev-list --no-walk 9a18ebaa78fc255a0aea42186a2743829d69162e # timeout=10
[Osmocom_OBS_master] $ /bin/sh -xe /tmp/jenkins16425211755711746581.sh + export PYTHONUNBUFFERED=1 + ./scripts/obs/update_obs_project.py --apiurl https://obs.osmocom.org --conflict-version --docker --feed master --meta osmocom:master docker: building image debian-12-osmocom-obs-build-srcpkg + run_in_docker_and_exit(): ['docker', 'build', '--build-arg', 'DISTRO=debian:12', '--build-arg', 'DISTRO_FROM=debian:12', '--build-arg', 'UID=1000', '-t', 'debian-12-osmocom-obs-build-srcpkg', '-f', 'https://jenkins.osmocom.org/jenkins/job/Osmocom_OBS_master/ws/scripts/obs/data/build_srcpkg.Dockerfile', 'https://jenkins.osmocom.org/jenkins/job/Osmocom_OBS_master/ws/scripts/obs/data'] #0 building with "default" instance using docker driver
#1 [internal] load build definition from build_srcpkg.Dockerfile #1 transferring dockerfile: 579B done #1 WARN: InvalidDefaultArgInFrom: Default value for ARG ${DISTRO_FROM} results in empty or invalid base image name (line 3) #1 DONE 0.0s
#2 [internal] load metadata for docker.io/library/debian:12 #2 DONE 0.7s
#3 [internal] load .dockerignore #3 transferring context: 2B done #3 DONE 0.0s
#4 [1/3] FROM docker.io/library/debian:12@sha256:18023f131f52fc3ea21973cabffe0b216c60b417fd2478e94d9d59981ebba6af #4 DONE 0.0s
#5 [2/3] RUN APT-GET update && apt-get upgrade -y && apt-get install -y --no-install-recommends ca-certificates colordiff debhelper dh-python dpkg-dev fakeroot git git-review gnupg2 libxml2-utils lsb-release meson osc python3-packaging python3-setuptools quilt rebar3 sed sphinx-common && apt-get clean #5 CACHED
#6 [3/3] RUN USERADD --uid=1000 -m user #6 CACHED
#7 exporting to image #7 exporting layers done #7 writing image sha256:2a9dd95b35028e4d71315e59c45ba43dc43f920d55d8b4980b221443515a5cd4 0.0s done #7 naming to docker.io/library/debian-12-osmocom-obs-build-srcpkg done #7 DONE 0.0s
[33m1 warning found (use docker --debug to expand): [0m - InvalidDefaultArgInFrom: Default value for ARG ${DISTRO_FROM} results in empty or invalid base image name (line 3) docker: running: update_obs_project.py inside docker OBS: getting packages in osmocom:master Traceback (most recent call last): File "/obs/update_obs_project.py", line 265, in <module> main()
ERROR: command failed unexpectedly
*** command *** ['osc', '-A', 'https://obs.osmocom.org', 'list', 'osmocom:master']
*** returncode *** 1
*** output *** Server returned an error: HTTP Error 503: Service Unavailable
Request: https://obs.osmocom.org/source/osmocom:master Headers: Server: nginx Date: Thu, 03 Apr 2025 21:24:05 GMT Content-Type: text/html; charset=UTF-8 Content-Length: 189 Connection: close cache-control: no-cache, no-store, must-revalidate Status: 503 Service Unavailable Cache-Control: public
*** python trace *** File "/obs/update_obs_project.py", line 257, in main pkgs_remote = lib.osc.get_remote_pkgs() ^^^^^^^^^^^^^^^^^^^^^^^^^ File "/obs/lib/osc.py", line 63, in get_remote_pkgs ret = run_osc(["list", proj]) ^^^^^^^^^^^^^^^^^^^^^^^ File "/obs/lib/osc.py", line 58, in run_osc return lib.run_cmd(cmd, *args, **kwargs) ^^^^^^^^^^^^^^^^^^^^^^^^^^^^^^^^^ File "/obs/lib/__init__.py", line 200, in run_cmd exit_error_cmd(p, "command failed unexpectedly") File "/obs/lib/__init__.py", line 161, in exit_error_cmd raise RuntimeError("shell command related error, find details right above" RuntimeError: shell command related error, find details right above this python trace Build step 'Execute shell' marked build as failure
See https://jenkins.osmocom.org/jenkins/job/Osmocom_OBS_master/93662/display/redirect
Changes:
------------------------------------------ Started by upstream project "master-rtl-sdr" build number 2604 originally caused by: Started by timer Running as SYSTEM Building remotely on build4-deb12build-ansible (ttcn3 obs osmo-gsm-tester-build ttcn3_with_linux_6.1_or_higher qemu io_uring osmocom-gerrit coverity osmocom-master) in workspace https://jenkins.osmocom.org/jenkins/job/Osmocom_OBS_master/ws/ The recommended git tool is: NONE No credentials specified Wiping out workspace first. Cloning the remote Git repository Cloning repository https://gerrit.osmocom.org/osmo-ci
git init https://jenkins.osmocom.org/jenkins/job/Osmocom_OBS_master/ws/ # timeout=10
Fetching upstream changes from https://gerrit.osmocom.org/osmo-ci
git --version # timeout=10 git --version # 'git version 2.39.5' git fetch --tags --force --progress -- https://gerrit.osmocom.org/osmo-ci +refs/heads/*:refs/remotes/origin/* # timeout=10 git config remote.origin.url https://gerrit.osmocom.org/osmo-ci # timeout=10 git config --add remote.origin.fetch +refs/heads/*:refs/remotes/origin/* # timeout=10
Avoid second fetch
git rev-parse refs/remotes/origin/refs/remotes/origin/master^{commit} # timeout=10 git rev-parse refs/remotes/origin/master^{commit} # timeout=10
Checking out Revision 9a18ebaa78fc255a0aea42186a2743829d69162e (refs/remotes/origin/master)
git config core.sparsecheckout # timeout=10 git checkout -f 9a18ebaa78fc255a0aea42186a2743829d69162e # timeout=10
Commit message: "obs: gerrit_binpkgs: set --allow-unknown-package"
git rev-list --no-walk 9a18ebaa78fc255a0aea42186a2743829d69162e # timeout=10
[Osmocom_OBS_master] $ /bin/sh -xe /tmp/jenkins8732259796084889250.sh + export PYTHONUNBUFFERED=1 + ./scripts/obs/update_obs_project.py --apiurl https://obs.osmocom.org --conflict-version --docker --feed master --meta osmocom:master docker: building image debian-12-osmocom-obs-build-srcpkg + run_in_docker_and_exit(): ['docker', 'build', '--build-arg', 'DISTRO=debian:12', '--build-arg', 'DISTRO_FROM=debian:12', '--build-arg', 'UID=1000', '-t', 'debian-12-osmocom-obs-build-srcpkg', '-f', 'https://jenkins.osmocom.org/jenkins/job/Osmocom_OBS_master/ws/scripts/obs/data/build_srcpkg.Dockerfile', 'https://jenkins.osmocom.org/jenkins/job/Osmocom_OBS_master/ws/scripts/obs/data'] #0 building with "default" instance using docker driver
#1 [internal] load build definition from build_srcpkg.Dockerfile #1 transferring dockerfile: 579B done #1 WARN: InvalidDefaultArgInFrom: Default value for ARG ${DISTRO_FROM} results in empty or invalid base image name (line 3) #1 DONE 0.0s
#2 [internal] load metadata for docker.io/library/debian:12 #2 DONE 0.8s
#3 [internal] load .dockerignore #3 transferring context: 2B done #3 DONE 0.0s
#4 [1/3] FROM docker.io/library/debian:12@sha256:18023f131f52fc3ea21973cabffe0b216c60b417fd2478e94d9d59981ebba6af #4 DONE 0.0s
#5 [2/3] RUN APT-GET update && apt-get upgrade -y && apt-get install -y --no-install-recommends ca-certificates colordiff debhelper dh-python dpkg-dev fakeroot git git-review gnupg2 libxml2-utils lsb-release meson osc python3-packaging python3-setuptools quilt rebar3 sed sphinx-common && apt-get clean #5 CACHED
#6 [3/3] RUN USERADD --uid=1000 -m user #6 CACHED
#7 exporting to image #7 exporting layers done #7 writing image sha256:2a9dd95b35028e4d71315e59c45ba43dc43f920d55d8b4980b221443515a5cd4 0.0s done #7 naming to docker.io/library/debian-12-osmocom-obs-build-srcpkg done #7 DONE 0.0s
[33m1 warning found (use docker --debug to expand): [0m - InvalidDefaultArgInFrom: Default value for ARG ${DISTRO_FROM} results in empty or invalid base image name (line 3) docker: running: update_obs_project.py inside docker OBS: getting packages in osmocom:master Traceback (most recent call last): File "/obs/update_obs_project.py", line 265, in <module> main() File "/obs/update_obs_project.py", line 257, in main pkgs_remote = lib.osc.get_remote_pkgs() ^^^^^^^^^^^^^^^^^^^^^^^^^ File "/obs/lib/osc.py", line 63, in get_remote_pkgs
ERROR: command failed unexpectedly
*** command *** ['osc', '-A', 'https://obs.osmocom.org', 'list', 'osmocom:master']
*** returncode *** 1
*** output *** Server returned an error: HTTP Error 503: Service Unavailable
Request: https://obs.osmocom.org/source/osmocom:master Headers: Server: nginx Date: Thu, 03 Apr 2025 22:41:30 GMT Content-Type: text/html; charset=UTF-8 Content-Length: 189 Connection: close cache-control: no-cache, no-store, must-revalidate Status: 503 Service Unavailable Cache-Control: public
*** python trace *** ret = run_osc(["list", proj]) ^^^^^^^^^^^^^^^^^^^^^^^ File "/obs/lib/osc.py", line 58, in run_osc return lib.run_cmd(cmd, *args, **kwargs) ^^^^^^^^^^^^^^^^^^^^^^^^^^^^^^^^^ File "/obs/lib/__init__.py", line 200, in run_cmd exit_error_cmd(p, "command failed unexpectedly") File "/obs/lib/__init__.py", line 161, in exit_error_cmd raise RuntimeError("shell command related error, find details right above" RuntimeError: shell command related error, find details right above this python trace Build step 'Execute shell' marked build as failure
See https://jenkins.osmocom.org/jenkins/job/Osmocom_OBS_master/93663/display/redirect
Changes:
------------------------------------------ Started by upstream project "master-osmo-msc" build number 47786 originally caused by: Started by timer Running as SYSTEM Building remotely on build4-deb12build-ansible (ttcn3 obs osmo-gsm-tester-build ttcn3_with_linux_6.1_or_higher qemu io_uring osmocom-gerrit coverity osmocom-master) in workspace https://jenkins.osmocom.org/jenkins/job/Osmocom_OBS_master/ws/ The recommended git tool is: NONE No credentials specified Wiping out workspace first. Cloning the remote Git repository Cloning repository https://gerrit.osmocom.org/osmo-ci
git init https://jenkins.osmocom.org/jenkins/job/Osmocom_OBS_master/ws/ # timeout=10
Fetching upstream changes from https://gerrit.osmocom.org/osmo-ci
git --version # timeout=10 git --version # 'git version 2.39.5' git fetch --tags --force --progress -- https://gerrit.osmocom.org/osmo-ci +refs/heads/*:refs/remotes/origin/* # timeout=10 git config remote.origin.url https://gerrit.osmocom.org/osmo-ci # timeout=10 git config --add remote.origin.fetch +refs/heads/*:refs/remotes/origin/* # timeout=10
Avoid second fetch
git rev-parse refs/remotes/origin/refs/remotes/origin/master^{commit} # timeout=10 git rev-parse refs/remotes/origin/master^{commit} # timeout=10
Checking out Revision 9a18ebaa78fc255a0aea42186a2743829d69162e (refs/remotes/origin/master)
git config core.sparsecheckout # timeout=10 git checkout -f 9a18ebaa78fc255a0aea42186a2743829d69162e # timeout=10
Commit message: "obs: gerrit_binpkgs: set --allow-unknown-package"
git rev-list --no-walk 9a18ebaa78fc255a0aea42186a2743829d69162e # timeout=10
[Osmocom_OBS_master] $ /bin/sh -xe /tmp/jenkins1651806740183646961.sh + export PYTHONUNBUFFERED=1 + ./scripts/obs/update_obs_project.py --apiurl https://obs.osmocom.org --conflict-version --docker --feed master --meta osmocom:master docker: building image debian-12-osmocom-obs-build-srcpkg + run_in_docker_and_exit(): ['docker', 'build', '--build-arg', 'DISTRO=debian:12', '--build-arg', 'DISTRO_FROM=debian:12', '--build-arg', 'UID=1000', '-t', 'debian-12-osmocom-obs-build-srcpkg', '-f', 'https://jenkins.osmocom.org/jenkins/job/Osmocom_OBS_master/ws/scripts/obs/data/build_srcpkg.Dockerfile', 'https://jenkins.osmocom.org/jenkins/job/Osmocom_OBS_master/ws/scripts/obs/data'] #0 building with "default" instance using docker driver
#1 [internal] load build definition from build_srcpkg.Dockerfile #1 transferring dockerfile: 579B done #1 WARN: InvalidDefaultArgInFrom: Default value for ARG ${DISTRO_FROM} results in empty or invalid base image name (line 3) #1 DONE 0.0s
#2 [internal] load metadata for docker.io/library/debian:12 #2 DONE 0.9s
#3 [internal] load .dockerignore #3 transferring context: 2B done #3 DONE 0.0s
#4 [1/3] FROM docker.io/library/debian:12@sha256:18023f131f52fc3ea21973cabffe0b216c60b417fd2478e94d9d59981ebba6af #4 DONE 0.0s
#5 [2/3] RUN APT-GET update && apt-get upgrade -y && apt-get install -y --no-install-recommends ca-certificates colordiff debhelper dh-python dpkg-dev fakeroot git git-review gnupg2 libxml2-utils lsb-release meson osc python3-packaging python3-setuptools quilt rebar3 sed sphinx-common && apt-get clean #5 CACHED
#6 [3/3] RUN USERADD --uid=1000 -m user #6 CACHED
#7 exporting to image #7 exporting layers done #7 writing image sha256:2a9dd95b35028e4d71315e59c45ba43dc43f920d55d8b4980b221443515a5cd4 0.0s done #7 naming to docker.io/library/debian-12-osmocom-obs-build-srcpkg done #7 DONE 0.0s
[33m1 warning found (use docker --debug to expand): [0m - InvalidDefaultArgInFrom: Default value for ARG ${DISTRO_FROM} results in empty or invalid base image name (line 3) docker: running: update_obs_project.py inside docker OBS: getting packages in osmocom:master
ERROR: command failed unexpectedly
*** command *** ['osc', '-A', 'https://obs.osmocom.org', 'list', 'osmocom:master']
*** returncode *** 1
*** output *** Server returned an error: HTTP Error 503: Service Unavailable
Request: https://obs.osmocom.org/source/osmocom:master Headers: Server: nginx Date: Thu, 03 Apr 2025 23:05:50 GMT Content-Type: text/html; charset=UTF-8 Content-Length: 189 Connection: close cache-control: no-cache, no-store, must-revalidate Status: 503 Service Unavailable Cache-Control: public
*** python trace *** Traceback (most recent call last): File "/obs/update_obs_project.py", line 265, in <module> main() File "/obs/update_obs_project.py", line 257, in main pkgs_remote = lib.osc.get_remote_pkgs() ^^^^^^^^^^^^^^^^^^^^^^^^^ File "/obs/lib/osc.py", line 63, in get_remote_pkgs ret = run_osc(["list", proj]) ^^^^^^^^^^^^^^^^^^^^^^^ File "/obs/lib/osc.py", line 58, in run_osc return lib.run_cmd(cmd, *args, **kwargs) ^^^^^^^^^^^^^^^^^^^^^^^^^^^^^^^^^ File "/obs/lib/__init__.py", line 200, in run_cmd exit_error_cmd(p, "command failed unexpectedly") File "/obs/lib/__init__.py", line 161, in exit_error_cmd raise RuntimeError("shell command related error, find details right above" RuntimeError: shell command related error, find details right above this python trace Build step 'Execute shell' marked build as failure
See https://jenkins.osmocom.org/jenkins/job/Osmocom_OBS_master/93664/display/redirect
Changes:
------------------------------------------ Started by upstream project "master-osmo-bts" build number 10631 originally caused by: Started by timer Running as SYSTEM Building remotely on build4-deb12build-ansible (ttcn3 obs osmo-gsm-tester-build ttcn3_with_linux_6.1_or_higher qemu io_uring osmocom-gerrit coverity osmocom-master) in workspace https://jenkins.osmocom.org/jenkins/job/Osmocom_OBS_master/ws/ The recommended git tool is: NONE No credentials specified Wiping out workspace first. Cloning the remote Git repository Cloning repository https://gerrit.osmocom.org/osmo-ci
git init https://jenkins.osmocom.org/jenkins/job/Osmocom_OBS_master/ws/ # timeout=10
Fetching upstream changes from https://gerrit.osmocom.org/osmo-ci
git --version # timeout=10 git --version # 'git version 2.39.5' git fetch --tags --force --progress -- https://gerrit.osmocom.org/osmo-ci +refs/heads/*:refs/remotes/origin/* # timeout=10 git config remote.origin.url https://gerrit.osmocom.org/osmo-ci # timeout=10 git config --add remote.origin.fetch +refs/heads/*:refs/remotes/origin/* # timeout=10
Avoid second fetch
git rev-parse refs/remotes/origin/refs/remotes/origin/master^{commit} # timeout=10 git rev-parse refs/remotes/origin/master^{commit} # timeout=10
Checking out Revision 9a18ebaa78fc255a0aea42186a2743829d69162e (refs/remotes/origin/master)
git config core.sparsecheckout # timeout=10 git checkout -f 9a18ebaa78fc255a0aea42186a2743829d69162e # timeout=10
Commit message: "obs: gerrit_binpkgs: set --allow-unknown-package"
git rev-list --no-walk 9a18ebaa78fc255a0aea42186a2743829d69162e # timeout=10
[Osmocom_OBS_master] $ /bin/sh -xe /tmp/jenkins12915699464761694908.sh + export PYTHONUNBUFFERED=1 + ./scripts/obs/update_obs_project.py --apiurl https://obs.osmocom.org --conflict-version --docker --feed master --meta osmocom:master docker: building image debian-12-osmocom-obs-build-srcpkg + run_in_docker_and_exit(): ['docker', 'build', '--build-arg', 'DISTRO=debian:12', '--build-arg', 'DISTRO_FROM=debian:12', '--build-arg', 'UID=1000', '-t', 'debian-12-osmocom-obs-build-srcpkg', '-f', 'https://jenkins.osmocom.org/jenkins/job/Osmocom_OBS_master/ws/scripts/obs/data/build_srcpkg.Dockerfile', 'https://jenkins.osmocom.org/jenkins/job/Osmocom_OBS_master/ws/scripts/obs/data'] #0 building with "default" instance using docker driver
#1 [internal] load build definition from build_srcpkg.Dockerfile #1 transferring dockerfile: 579B done #1 WARN: InvalidDefaultArgInFrom: Default value for ARG ${DISTRO_FROM} results in empty or invalid base image name (line 3) #1 DONE 0.0s
#2 [internal] load metadata for docker.io/library/debian:12 #2 DONE 0.8s
#3 [internal] load .dockerignore #3 transferring context: 2B done #3 DONE 0.0s
#4 [1/3] FROM docker.io/library/debian:12@sha256:18023f131f52fc3ea21973cabffe0b216c60b417fd2478e94d9d59981ebba6af #4 DONE 0.0s
#5 [2/3] RUN APT-GET update && apt-get upgrade -y && apt-get install -y --no-install-recommends ca-certificates colordiff debhelper dh-python dpkg-dev fakeroot git git-review gnupg2 libxml2-utils lsb-release meson osc python3-packaging python3-setuptools quilt rebar3 sed sphinx-common && apt-get clean #5 CACHED
#6 [3/3] RUN USERADD --uid=1000 -m user #6 CACHED
#7 exporting to image #7 exporting layers done #7 writing image sha256:2a9dd95b35028e4d71315e59c45ba43dc43f920d55d8b4980b221443515a5cd4 done #7 naming to docker.io/library/debian-12-osmocom-obs-build-srcpkg 0.0s done #7 DONE 0.0s
[33m1 warning found (use docker --debug to expand): [0m - InvalidDefaultArgInFrom: Default value for ARG ${DISTRO_FROM} results in empty or invalid base image name (line 3) docker: running: update_obs_project.py inside docker OBS: getting packages in osmocom:master Traceback (most recent call last): File "/obs/update_obs_project.py", line 265, in <module>
ERROR: command failed unexpectedly
*** command *** ['osc', '-A', 'https://obs.osmocom.org', 'list', 'osmocom:master']
*** returncode *** 1
*** output *** Server returned an error: HTTP Error 503: Service Unavailable
Request: https://obs.osmocom.org/source/osmocom:master Headers: Server: nginx Date: Thu, 03 Apr 2025 23:21:40 GMT Content-Type: text/html; charset=UTF-8 Content-Length: 189 Connection: close cache-control: no-cache, no-store, must-revalidate Status: 503 Service Unavailable Cache-Control: public
*** python trace *** main() File "/obs/update_obs_project.py", line 257, in main pkgs_remote = lib.osc.get_remote_pkgs() ^^^^^^^^^^^^^^^^^^^^^^^^^ File "/obs/lib/osc.py", line 63, in get_remote_pkgs ret = run_osc(["list", proj]) ^^^^^^^^^^^^^^^^^^^^^^^ File "/obs/lib/osc.py", line 58, in run_osc return lib.run_cmd(cmd, *args, **kwargs) ^^^^^^^^^^^^^^^^^^^^^^^^^^^^^^^^^ File "/obs/lib/__init__.py", line 200, in run_cmd exit_error_cmd(p, "command failed unexpectedly") File "/obs/lib/__init__.py", line 161, in exit_error_cmd raise RuntimeError("shell command related error, find details right above" RuntimeError: shell command related error, find details right above this python trace Build step 'Execute shell' marked build as failure
See https://jenkins.osmocom.org/jenkins/job/Osmocom_OBS_master/93665/display/redirect
Changes:
------------------------------------------ Started by upstream project "master-libsmpp34" build number 2671 originally caused by: Started by timer Running as SYSTEM Building remotely on build4-deb12build-ansible (ttcn3 obs osmo-gsm-tester-build ttcn3_with_linux_6.1_or_higher qemu io_uring osmocom-gerrit coverity osmocom-master) in workspace https://jenkins.osmocom.org/jenkins/job/Osmocom_OBS_master/ws/ The recommended git tool is: NONE No credentials specified Wiping out workspace first. Cloning the remote Git repository Cloning repository https://gerrit.osmocom.org/osmo-ci
git init https://jenkins.osmocom.org/jenkins/job/Osmocom_OBS_master/ws/ # timeout=10
Fetching upstream changes from https://gerrit.osmocom.org/osmo-ci
git --version # timeout=10 git --version # 'git version 2.39.5' git fetch --tags --force --progress -- https://gerrit.osmocom.org/osmo-ci +refs/heads/*:refs/remotes/origin/* # timeout=10 git config remote.origin.url https://gerrit.osmocom.org/osmo-ci # timeout=10 git config --add remote.origin.fetch +refs/heads/*:refs/remotes/origin/* # timeout=10
Avoid second fetch
git rev-parse refs/remotes/origin/refs/remotes/origin/master^{commit} # timeout=10 git rev-parse refs/remotes/origin/master^{commit} # timeout=10
Checking out Revision 9a18ebaa78fc255a0aea42186a2743829d69162e (refs/remotes/origin/master)
git config core.sparsecheckout # timeout=10 git checkout -f 9a18ebaa78fc255a0aea42186a2743829d69162e # timeout=10
Commit message: "obs: gerrit_binpkgs: set --allow-unknown-package"
git rev-list --no-walk 9a18ebaa78fc255a0aea42186a2743829d69162e # timeout=10
[Osmocom_OBS_master] $ /bin/sh -xe /tmp/jenkins815339068027666789.sh + export PYTHONUNBUFFERED=1 + ./scripts/obs/update_obs_project.py --apiurl https://obs.osmocom.org --conflict-version --docker --feed master --meta osmocom:master docker: building image debian-12-osmocom-obs-build-srcpkg + run_in_docker_and_exit(): ['docker', 'build', '--build-arg', 'DISTRO=debian:12', '--build-arg', 'DISTRO_FROM=debian:12', '--build-arg', 'UID=1000', '-t', 'debian-12-osmocom-obs-build-srcpkg', '-f', 'https://jenkins.osmocom.org/jenkins/job/Osmocom_OBS_master/ws/scripts/obs/data/build_srcpkg.Dockerfile', 'https://jenkins.osmocom.org/jenkins/job/Osmocom_OBS_master/ws/scripts/obs/data'] #0 building with "default" instance using docker driver
#1 [internal] load build definition from build_srcpkg.Dockerfile #1 transferring dockerfile: 579B done #1 WARN: InvalidDefaultArgInFrom: Default value for ARG ${DISTRO_FROM} results in empty or invalid base image name (line 3) #1 DONE 0.0s
#2 [internal] load metadata for docker.io/library/debian:12 #2 DONE 0.8s
#3 [internal] load .dockerignore #3 transferring context: 2B done #3 DONE 0.0s
#4 [1/3] FROM docker.io/library/debian:12@sha256:18023f131f52fc3ea21973cabffe0b216c60b417fd2478e94d9d59981ebba6af #4 DONE 0.0s
#5 [2/3] RUN APT-GET update && apt-get upgrade -y && apt-get install -y --no-install-recommends ca-certificates colordiff debhelper dh-python dpkg-dev fakeroot git git-review gnupg2 libxml2-utils lsb-release meson osc python3-packaging python3-setuptools quilt rebar3 sed sphinx-common && apt-get clean #5 CACHED
#6 [3/3] RUN USERADD --uid=1000 -m user #6 CACHED
#7 exporting to image #7 exporting layers done #7 writing image sha256:2a9dd95b35028e4d71315e59c45ba43dc43f920d55d8b4980b221443515a5cd4 0.0s done #7 naming to docker.io/library/debian-12-osmocom-obs-build-srcpkg 0.0s done #7 DONE 0.0s
[33m1 warning found (use docker --debug to expand): [0m - InvalidDefaultArgInFrom: Default value for ARG ${DISTRO_FROM} results in empty or invalid base image name (line 3) docker: running: update_obs_project.py inside docker OBS: getting packages in osmocom:master
ERROR: command failed unexpectedly
*** command *** ['osc', '-A', 'https://obs.osmocom.org', 'list', 'osmocom:master']
*** returncode *** 1
*** output *** Server returned an error: HTTP Error 503: Service Unavailable
Request: https://obs.osmocom.org/source/osmocom:master Headers: Server: nginx Date: Thu, 03 Apr 2025 23:55:25 GMT Content-Type: text/html; charset=UTF-8 Content-Length: 189 Connection: close cache-control: no-cache, no-store, must-revalidate Status: 503 Service Unavailable Cache-Control: public
*** python trace *** Traceback (most recent call last): File "/obs/update_obs_project.py", line 265, in <module> main() File "/obs/update_obs_project.py", line 257, in main pkgs_remote = lib.osc.get_remote_pkgs() ^^^^^^^^^^^^^^^^^^^^^^^^^ File "/obs/lib/osc.py", line 63, in get_remote_pkgs ret = run_osc(["list", proj]) ^^^^^^^^^^^^^^^^^^^^^^^ File "/obs/lib/osc.py", line 58, in run_osc return lib.run_cmd(cmd, *args, **kwargs) ^^^^^^^^^^^^^^^^^^^^^^^^^^^^^^^^^ File "/obs/lib/__init__.py", line 200, in run_cmd exit_error_cmd(p, "command failed unexpectedly") File "/obs/lib/__init__.py", line 161, in exit_error_cmd raise RuntimeError("shell command related error, find details right above" RuntimeError: shell command related error, find details right above this python trace Build step 'Execute shell' marked build as failure
See https://jenkins.osmocom.org/jenkins/job/Osmocom_OBS_master/93666/display/redirect
Changes:
------------------------------------------ Started by upstream project "master-libosmocore" build number 4302 originally caused by: Started by timer Running as SYSTEM Building remotely on build4-deb12build-ansible (ttcn3 obs osmo-gsm-tester-build ttcn3_with_linux_6.1_or_higher qemu io_uring osmocom-gerrit coverity osmocom-master) in workspace https://jenkins.osmocom.org/jenkins/job/Osmocom_OBS_master/ws/ The recommended git tool is: NONE No credentials specified Wiping out workspace first. Cloning the remote Git repository Cloning repository https://gerrit.osmocom.org/osmo-ci
git init https://jenkins.osmocom.org/jenkins/job/Osmocom_OBS_master/ws/ # timeout=10
Fetching upstream changes from https://gerrit.osmocom.org/osmo-ci
git --version # timeout=10 git --version # 'git version 2.39.5' git fetch --tags --force --progress -- https://gerrit.osmocom.org/osmo-ci +refs/heads/*:refs/remotes/origin/* # timeout=10 git config remote.origin.url https://gerrit.osmocom.org/osmo-ci # timeout=10 git config --add remote.origin.fetch +refs/heads/*:refs/remotes/origin/* # timeout=10
Avoid second fetch
git rev-parse refs/remotes/origin/refs/remotes/origin/master^{commit} # timeout=10 git rev-parse refs/remotes/origin/master^{commit} # timeout=10
Checking out Revision 9a18ebaa78fc255a0aea42186a2743829d69162e (refs/remotes/origin/master)
git config core.sparsecheckout # timeout=10 git checkout -f 9a18ebaa78fc255a0aea42186a2743829d69162e # timeout=10
Commit message: "obs: gerrit_binpkgs: set --allow-unknown-package"
git rev-list --no-walk 9a18ebaa78fc255a0aea42186a2743829d69162e # timeout=10
[Osmocom_OBS_master] $ /bin/sh -xe /tmp/jenkins3200968923131185957.sh + export PYTHONUNBUFFERED=1 + ./scripts/obs/update_obs_project.py --apiurl https://obs.osmocom.org --conflict-version --docker --feed master --meta osmocom:master docker: building image debian-12-osmocom-obs-build-srcpkg + run_in_docker_and_exit(): ['docker', 'build', '--build-arg', 'DISTRO=debian:12', '--build-arg', 'DISTRO_FROM=debian:12', '--build-arg', 'UID=1000', '-t', 'debian-12-osmocom-obs-build-srcpkg', '-f', 'https://jenkins.osmocom.org/jenkins/job/Osmocom_OBS_master/ws/scripts/obs/data/build_srcpkg.Dockerfile', 'https://jenkins.osmocom.org/jenkins/job/Osmocom_OBS_master/ws/scripts/obs/data'] #0 building with "default" instance using docker driver
#1 [internal] load build definition from build_srcpkg.Dockerfile #1 transferring dockerfile: 579B done #1 WARN: InvalidDefaultArgInFrom: Default value for ARG ${DISTRO_FROM} results in empty or invalid base image name (line 3) #1 DONE 0.0s
#2 [internal] load metadata for docker.io/library/debian:12 #2 DONE 0.4s
#3 [internal] load .dockerignore #3 transferring context: 2B done #3 DONE 0.0s
#4 [1/3] FROM docker.io/library/debian:12@sha256:18023f131f52fc3ea21973cabffe0b216c60b417fd2478e94d9d59981ebba6af #4 DONE 0.0s
#5 [2/3] RUN APT-GET update && apt-get upgrade -y && apt-get install -y --no-install-recommends ca-certificates colordiff debhelper dh-python dpkg-dev fakeroot git git-review gnupg2 libxml2-utils lsb-release meson osc python3-packaging python3-setuptools quilt rebar3 sed sphinx-common && apt-get clean #5 CACHED
#6 [3/3] RUN USERADD --uid=1000 -m user #6 CACHED
#7 exporting to image #7 exporting layers done #7 writing image sha256:2a9dd95b35028e4d71315e59c45ba43dc43f920d55d8b4980b221443515a5cd4 0.0s done #7 naming to docker.io/library/debian-12-osmocom-obs-build-srcpkg 0.0s done #7 DONE 0.0s
[33m1 warning found (use docker --debug to expand): [0m - InvalidDefaultArgInFrom: Default value for ARG ${DISTRO_FROM} results in empty or invalid base image name (line 3) docker: running: update_obs_project.py inside docker OBS: getting packages in osmocom:master Traceback (most recent call last): File "/obs/update_obs_project.py", line 265, in <module> main() File "/obs/update_obs_project.py", line 257, in main pkgs_remote = lib.osc.get_remote_pkgs() ^^^^^^^^^^^^^^^^^^^^^^^^^ File "/obs/lib/osc.py", line 63, in get_remote_pkgs
ERROR: command failed unexpectedly
*** command *** ['osc', '-A', 'https://obs.osmocom.org', 'list', 'osmocom:master']
*** returncode *** 1
*** output *** Server returned an error: HTTP Error 503: Service Unavailable
Request: https://obs.osmocom.org/source/osmocom:master Headers: Server: nginx Date: Thu, 03 Apr 2025 23:56:46 GMT Content-Type: text/html; charset=UTF-8 Content-Length: 189 Connection: close cache-control: no-cache, no-store, must-revalidate Status: 503 Service Unavailable Cache-Control: public
*** python trace *** ret = run_osc(["list", proj]) ^^^^^^^^^^^^^^^^^^^^^^^ File "/obs/lib/osc.py", line 58, in run_osc return lib.run_cmd(cmd, *args, **kwargs) ^^^^^^^^^^^^^^^^^^^^^^^^^^^^^^^^^ File "/obs/lib/__init__.py", line 200, in run_cmd exit_error_cmd(p, "command failed unexpectedly") File "/obs/lib/__init__.py", line 161, in exit_error_cmd raise RuntimeError("shell command related error, find details right above" RuntimeError: shell command related error, find details right above this python trace Build step 'Execute shell' marked build as failure
See https://jenkins.osmocom.org/jenkins/job/Osmocom_OBS_master/93667/display/redirect
Changes:
------------------------------------------ Started by upstream project "master-osmo-tetra" build number 6896 originally caused by: Started by upstream project "master-libosmocore" build number 4302 originally caused by: Started by timer Started by upstream project "master-xgoldmon" build number 1353 originally caused by: Started by upstream project "master-libosmocore" build number 4302 originally caused by: Started by timer Started by upstream project "master-simtrace" build number 1357 originally caused by: Started by upstream project "master-libosmocore" build number 4302 originally caused by: Started by timer Started by upstream project "master-osmo-gmr" build number 9529 originally caused by: Started by upstream project "master-libosmocore" build number 4302 originally caused by: Started by timer Running as SYSTEM Building remotely on build4-deb12build-ansible (ttcn3 obs osmo-gsm-tester-build ttcn3_with_linux_6.1_or_higher qemu io_uring osmocom-gerrit coverity osmocom-master) in workspace https://jenkins.osmocom.org/jenkins/job/Osmocom_OBS_master/ws/ The recommended git tool is: NONE No credentials specified Wiping out workspace first. Cloning the remote Git repository Cloning repository https://gerrit.osmocom.org/osmo-ci
git init https://jenkins.osmocom.org/jenkins/job/Osmocom_OBS_master/ws/ # timeout=10
Fetching upstream changes from https://gerrit.osmocom.org/osmo-ci
git --version # timeout=10 git --version # 'git version 2.39.5' git fetch --tags --force --progress -- https://gerrit.osmocom.org/osmo-ci +refs/heads/*:refs/remotes/origin/* # timeout=10 git config remote.origin.url https://gerrit.osmocom.org/osmo-ci # timeout=10 git config --add remote.origin.fetch +refs/heads/*:refs/remotes/origin/* # timeout=10
Avoid second fetch
git rev-parse refs/remotes/origin/refs/remotes/origin/master^{commit} # timeout=10 git rev-parse refs/remotes/origin/master^{commit} # timeout=10
Checking out Revision 9a18ebaa78fc255a0aea42186a2743829d69162e (refs/remotes/origin/master)
git config core.sparsecheckout # timeout=10 git checkout -f 9a18ebaa78fc255a0aea42186a2743829d69162e # timeout=10
Commit message: "obs: gerrit_binpkgs: set --allow-unknown-package"
git rev-list --no-walk 9a18ebaa78fc255a0aea42186a2743829d69162e # timeout=10
[Osmocom_OBS_master] $ /bin/sh -xe /tmp/jenkins17248201333860715997.sh + export PYTHONUNBUFFERED=1 + ./scripts/obs/update_obs_project.py --apiurl https://obs.osmocom.org --conflict-version --docker --feed master --meta osmocom:master docker: building image debian-12-osmocom-obs-build-srcpkg + run_in_docker_and_exit(): ['docker', 'build', '--build-arg', 'DISTRO=debian:12', '--build-arg', 'DISTRO_FROM=debian:12', '--build-arg', 'UID=1000', '-t', 'debian-12-osmocom-obs-build-srcpkg', '-f', 'https://jenkins.osmocom.org/jenkins/job/Osmocom_OBS_master/ws/scripts/obs/data/build_srcpkg.Dockerfile', 'https://jenkins.osmocom.org/jenkins/job/Osmocom_OBS_master/ws/scripts/obs/data'] #0 building with "default" instance using docker driver
#1 [internal] load build definition from build_srcpkg.Dockerfile #1 transferring dockerfile: 579B done #1 WARN: InvalidDefaultArgInFrom: Default value for ARG ${DISTRO_FROM} results in empty or invalid base image name (line 3) #1 DONE 0.0s
#2 [internal] load metadata for docker.io/library/debian:12 #2 DONE 0.4s
#3 [internal] load .dockerignore #3 transferring context: 2B done #3 DONE 0.0s
#4 [1/3] FROM docker.io/library/debian:12@sha256:18023f131f52fc3ea21973cabffe0b216c60b417fd2478e94d9d59981ebba6af #4 DONE 0.0s
#5 [2/3] RUN APT-GET update && apt-get upgrade -y && apt-get install -y --no-install-recommends ca-certificates colordiff debhelper dh-python dpkg-dev fakeroot git git-review gnupg2 libxml2-utils lsb-release meson osc python3-packaging python3-setuptools quilt rebar3 sed sphinx-common && apt-get clean #5 CACHED
#6 [3/3] RUN USERADD --uid=1000 -m user #6 CACHED
#7 exporting to image #7 exporting layers done #7 writing image sha256:2a9dd95b35028e4d71315e59c45ba43dc43f920d55d8b4980b221443515a5cd4 0.0s done #7 naming to docker.io/library/debian-12-osmocom-obs-build-srcpkg done #7 DONE 0.0s
[33m1 warning found (use docker --debug to expand): [0m - InvalidDefaultArgInFrom: Default value for ARG ${DISTRO_FROM} results in empty or invalid base image name (line 3) docker: running: update_obs_project.py inside docker OBS: getting packages in osmocom:master
ERROR: command failed unexpectedly
*** command *** ['osc', '-A', 'https://obs.osmocom.org', 'list', 'osmocom:master']
*** returncode *** 1
*** output *** Server returned an error: HTTP Error 503: Service Unavailable
Request: https://obs.osmocom.org/source/osmocom:master Headers: Server: nginx Date: Thu, 03 Apr 2025 23:57:28 GMT Content-Type: text/html; charset=UTF-8 Content-Length: 189 Connection: close cache-control: no-cache, no-store, must-revalidate Status: 503 Service Unavailable Cache-Control: public
*** python trace *** Traceback (most recent call last): File "/obs/update_obs_project.py", line 265, in <module> main() File "/obs/update_obs_project.py", line 257, in main pkgs_remote = lib.osc.get_remote_pkgs() ^^^^^^^^^^^^^^^^^^^^^^^^^ File "/obs/lib/osc.py", line 63, in get_remote_pkgs ret = run_osc(["list", proj]) ^^^^^^^^^^^^^^^^^^^^^^^ File "/obs/lib/osc.py", line 58, in run_osc return lib.run_cmd(cmd, *args, **kwargs) ^^^^^^^^^^^^^^^^^^^^^^^^^^^^^^^^^ File "/obs/lib/__init__.py", line 200, in run_cmd exit_error_cmd(p, "command failed unexpectedly") File "/obs/lib/__init__.py", line 161, in exit_error_cmd raise RuntimeError("shell command related error, find details right above" RuntimeError: shell command related error, find details right above this python trace Build step 'Execute shell' marked build as failure
See https://jenkins.osmocom.org/jenkins/job/Osmocom_OBS_master/93668/display/redirect
Changes:
------------------------------------------ Started by upstream project "master-osmo-sip-connector" build number 6972 originally caused by: Started by upstream project "master-libosmocore" build number 4302 originally caused by: Started by timer Started by upstream project "master-osmo-ggsn" build number 9671 originally caused by: Started by upstream project "master-libosmocore" build number 4302 originally caused by: Started by timer Running as SYSTEM Building remotely on build4-deb12build-ansible (ttcn3 obs osmo-gsm-tester-build ttcn3_with_linux_6.1_or_higher qemu io_uring osmocom-gerrit coverity osmocom-master) in workspace https://jenkins.osmocom.org/jenkins/job/Osmocom_OBS_master/ws/ The recommended git tool is: NONE No credentials specified Wiping out workspace first. Cloning the remote Git repository Cloning repository https://gerrit.osmocom.org/osmo-ci
git init https://jenkins.osmocom.org/jenkins/job/Osmocom_OBS_master/ws/ # timeout=10
Fetching upstream changes from https://gerrit.osmocom.org/osmo-ci
git --version # timeout=10 git --version # 'git version 2.39.5' git fetch --tags --force --progress -- https://gerrit.osmocom.org/osmo-ci +refs/heads/*:refs/remotes/origin/* # timeout=10 git config remote.origin.url https://gerrit.osmocom.org/osmo-ci # timeout=10 git config --add remote.origin.fetch +refs/heads/*:refs/remotes/origin/* # timeout=10
Avoid second fetch
git rev-parse refs/remotes/origin/refs/remotes/origin/master^{commit} # timeout=10 git rev-parse refs/remotes/origin/master^{commit} # timeout=10
Checking out Revision 9a18ebaa78fc255a0aea42186a2743829d69162e (refs/remotes/origin/master)
git config core.sparsecheckout # timeout=10 git checkout -f 9a18ebaa78fc255a0aea42186a2743829d69162e # timeout=10
Commit message: "obs: gerrit_binpkgs: set --allow-unknown-package"
git rev-list --no-walk 9a18ebaa78fc255a0aea42186a2743829d69162e # timeout=10
[Osmocom_OBS_master] $ /bin/sh -xe /tmp/jenkins13476545214079098030.sh + export PYTHONUNBUFFERED=1 + ./scripts/obs/update_obs_project.py --apiurl https://obs.osmocom.org --conflict-version --docker --feed master --meta osmocom:master docker: building image debian-12-osmocom-obs-build-srcpkg + run_in_docker_and_exit(): ['docker', 'build', '--build-arg', 'DISTRO=debian:12', '--build-arg', 'DISTRO_FROM=debian:12', '--build-arg', 'UID=1000', '-t', 'debian-12-osmocom-obs-build-srcpkg', '-f', 'https://jenkins.osmocom.org/jenkins/job/Osmocom_OBS_master/ws/scripts/obs/data/build_srcpkg.Dockerfile', 'https://jenkins.osmocom.org/jenkins/job/Osmocom_OBS_master/ws/scripts/obs/data'] #0 building with "default" instance using docker driver
#1 [internal] load build definition from build_srcpkg.Dockerfile #1 transferring dockerfile: 579B done #1 WARN: InvalidDefaultArgInFrom: Default value for ARG ${DISTRO_FROM} results in empty or invalid base image name (line 3) #1 DONE 0.0s
#2 [internal] load metadata for docker.io/library/debian:12 #2 DONE 0.4s
#3 [internal] load .dockerignore #3 transferring context: 2B done #3 DONE 0.0s
#4 [1/3] FROM docker.io/library/debian:12@sha256:18023f131f52fc3ea21973cabffe0b216c60b417fd2478e94d9d59981ebba6af #4 DONE 0.0s
#5 [2/3] RUN APT-GET update && apt-get upgrade -y && apt-get install -y --no-install-recommends ca-certificates colordiff debhelper dh-python dpkg-dev fakeroot git git-review gnupg2 libxml2-utils lsb-release meson osc python3-packaging python3-setuptools quilt rebar3 sed sphinx-common && apt-get clean #5 CACHED
#6 [3/3] RUN USERADD --uid=1000 -m user #6 CACHED
#7 exporting to image #7 exporting layers done #7 writing image sha256:2a9dd95b35028e4d71315e59c45ba43dc43f920d55d8b4980b221443515a5cd4 0.0s done #7 naming to docker.io/library/debian-12-osmocom-obs-build-srcpkg done #7 DONE 0.0s
[33m1 warning found (use docker --debug to expand): [0m - InvalidDefaultArgInFrom: Default value for ARG ${DISTRO_FROM} results in empty or invalid base image name (line 3) docker: running: update_obs_project.py inside docker OBS: getting packages in osmocom:master Traceback (most recent call last): File "/obs/update_obs_project.py", line 265, in <module> main()
ERROR: command failed unexpectedly
*** command *** ['osc', '-A', 'https://obs.osmocom.org', 'list', 'osmocom:master']
*** returncode *** 1
*** output *** Server returned an error: HTTP Error 503: Service Unavailable
Request: https://obs.osmocom.org/source/osmocom:master Headers: Server: nginx Date: Thu, 03 Apr 2025 23:57:34 GMT Content-Type: text/html; charset=UTF-8 Content-Length: 189 Connection: close cache-control: no-cache, no-store, must-revalidate Status: 503 Service Unavailable Cache-Control: public
*** python trace *** File "/obs/update_obs_project.py", line 257, in main pkgs_remote = lib.osc.get_remote_pkgs() ^^^^^^^^^^^^^^^^^^^^^^^^^ File "/obs/lib/osc.py", line 63, in get_remote_pkgs ret = run_osc(["list", proj]) ^^^^^^^^^^^^^^^^^^^^^^^ File "/obs/lib/osc.py", line 58, in run_osc return lib.run_cmd(cmd, *args, **kwargs) ^^^^^^^^^^^^^^^^^^^^^^^^^^^^^^^^^ File "/obs/lib/__init__.py", line 200, in run_cmd exit_error_cmd(p, "command failed unexpectedly") File "/obs/lib/__init__.py", line 161, in exit_error_cmd raise RuntimeError("shell command related error, find details right above" RuntimeError: shell command related error, find details right above this python trace Build step 'Execute shell' marked build as failure
See https://jenkins.osmocom.org/jenkins/job/Osmocom_OBS_master/93669/display/redirect
Changes:
------------------------------------------ Started by upstream project "master-libosmo-pfcp" build number 2541 originally caused by: Started by upstream project "master-libosmocore" build number 4302 originally caused by: Started by timer Started by upstream project "master-libosmo-netif" build number 9926 originally caused by: Started by upstream project "master-libosmocore" build number 4302 originally caused by: Started by timer Running as SYSTEM Building remotely on build5-deb12build-ansible (ttcn3 obs osmo-gsm-tester-build ttcn3-ggsn-test-kernel-git ttcn3_with_linux_6.1_or_higher qemu io_uring osmocom-gerrit coverity osmocom-master) in workspace https://jenkins.osmocom.org/jenkins/job/Osmocom_OBS_master/ws/ The recommended git tool is: NONE No credentials specified Wiping out workspace first. Cloning the remote Git repository Cloning repository https://gerrit.osmocom.org/osmo-ci
git init https://jenkins.osmocom.org/jenkins/job/Osmocom_OBS_master/ws/ # timeout=10
Fetching upstream changes from https://gerrit.osmocom.org/osmo-ci
git --version # timeout=10 git --version # 'git version 2.39.5' git fetch --tags --force --progress -- https://gerrit.osmocom.org/osmo-ci +refs/heads/*:refs/remotes/origin/* # timeout=10 git config remote.origin.url https://gerrit.osmocom.org/osmo-ci # timeout=10 git config --add remote.origin.fetch +refs/heads/*:refs/remotes/origin/* # timeout=10
Avoid second fetch
git rev-parse refs/remotes/origin/refs/remotes/origin/master^{commit} # timeout=10 git rev-parse refs/remotes/origin/master^{commit} # timeout=10
Checking out Revision 9a18ebaa78fc255a0aea42186a2743829d69162e (refs/remotes/origin/master)
git config core.sparsecheckout # timeout=10 git checkout -f 9a18ebaa78fc255a0aea42186a2743829d69162e # timeout=10
Commit message: "obs: gerrit_binpkgs: set --allow-unknown-package"
git rev-list --no-walk 9a18ebaa78fc255a0aea42186a2743829d69162e # timeout=10
[Osmocom_OBS_master] $ /bin/sh -xe /tmp/jenkins14857127697266776048.sh + export PYTHONUNBUFFERED=1 + ./scripts/obs/update_obs_project.py --apiurl https://obs.osmocom.org --conflict-version --docker --feed master --meta osmocom:master docker: building image debian-12-osmocom-obs-build-srcpkg + run_in_docker_and_exit(): ['docker', 'build', '--build-arg', 'DISTRO=debian:12', '--build-arg', 'DISTRO_FROM=debian:12', '--build-arg', 'UID=1000', '-t', 'debian-12-osmocom-obs-build-srcpkg', '-f', 'https://jenkins.osmocom.org/jenkins/job/Osmocom_OBS_master/ws/scripts/obs/data/build_srcpkg.Dockerfile', 'https://jenkins.osmocom.org/jenkins/job/Osmocom_OBS_master/ws/scripts/obs/data'] #0 building with "default" instance using docker driver
#1 [internal] load build definition from build_srcpkg.Dockerfile #1 transferring dockerfile: 579B done #1 WARN: InvalidDefaultArgInFrom: Default value for ARG ${DISTRO_FROM} results in empty or invalid base image name (line 3) #1 DONE 0.1s
#2 [internal] load metadata for docker.io/library/debian:12 #2 DONE 1.1s
#3 [internal] load .dockerignore #3 transferring context: 2B done #3 DONE 0.1s
#4 [1/3] FROM docker.io/library/debian:12@sha256:18023f131f52fc3ea21973cabffe0b216c60b417fd2478e94d9d59981ebba6af #4 resolve docker.io/library/debian:12@sha256:18023f131f52fc3ea21973cabffe0b216c60b417fd2478e94d9d59981ebba6af 0.0s done #4 DONE 0.0s
#5 [2/3] RUN APT-GET update && apt-get upgrade -y && apt-get install -y --no-install-recommends ca-certificates colordiff debhelper dh-python dpkg-dev fakeroot git git-review gnupg2 libxml2-utils lsb-release meson osc python3-packaging python3-setuptools quilt rebar3 sed sphinx-common && apt-get clean #5 CACHED
#6 [3/3] RUN USERADD --uid=1000 -m user #6 CACHED
#7 exporting to image #7 exporting layers done #7 writing image sha256:bc6a5998c69e89ffa8b1575b367bf8e7e099cfb23989f67da73b87732b6acf83 done #7 naming to docker.io/library/debian-12-osmocom-obs-build-srcpkg 0.0s done #7 DONE 0.0s
[33m1 warning found (use docker --debug to expand): [0m - InvalidDefaultArgInFrom: Default value for ARG ${DISTRO_FROM} results in empty or invalid base image name (line 3) docker: running: update_obs_project.py inside docker OBS: getting packages in osmocom:master Traceback (most recent call last): File "/obs/update_obs_project.py", line 265, in <module> main() File "/obs/update_obs_project.py", line 257, in main
ERROR: command failed unexpectedly
*** command *** ['osc', '-A', 'https://obs.osmocom.org', 'list', 'osmocom:master']
*** returncode *** 1
*** output *** Server returned an error: HTTP Error 503: Service Unavailable
Request: https://obs.osmocom.org/source/osmocom:master Headers: Server: nginx Date: Thu, 03 Apr 2025 23:57:46 GMT Content-Type: text/html; charset=UTF-8 Content-Length: 189 Connection: close cache-control: no-cache, no-store, must-revalidate Status: 503 Service Unavailable Cache-Control: public
*** python trace *** pkgs_remote = lib.osc.get_remote_pkgs() ^^^^^^^^^^^^^^^^^^^^^^^^^ File "/obs/lib/osc.py", line 63, in get_remote_pkgs ret = run_osc(["list", proj]) ^^^^^^^^^^^^^^^^^^^^^^^ File "/obs/lib/osc.py", line 58, in run_osc return lib.run_cmd(cmd, *args, **kwargs) ^^^^^^^^^^^^^^^^^^^^^^^^^^^^^^^^^ File "/obs/lib/__init__.py", line 200, in run_cmd exit_error_cmd(p, "command failed unexpectedly") File "/obs/lib/__init__.py", line 161, in exit_error_cmd raise RuntimeError("shell command related error, find details right above" RuntimeError: shell command related error, find details right above this python trace Build step 'Execute shell' marked build as failure
See https://jenkins.osmocom.org/jenkins/job/Osmocom_OBS_master/93670/display/redirect
Changes:
------------------------------------------ Started by upstream project "master-osmo-pcap" build number 6977 originally caused by: Started by upstream project "master-libosmocore" build number 4302 originally caused by: Started by timer Started by upstream project "master-osmo-gbproxy" build number 3824 originally caused by: Started by upstream project "master-libosmocore" build number 4302 originally caused by: Started by timer Running as SYSTEM Building remotely on build5-deb12build-ansible (ttcn3 obs osmo-gsm-tester-build ttcn3-ggsn-test-kernel-git ttcn3_with_linux_6.1_or_higher qemu io_uring osmocom-gerrit coverity osmocom-master) in workspace https://jenkins.osmocom.org/jenkins/job/Osmocom_OBS_master/ws/ The recommended git tool is: NONE No credentials specified Wiping out workspace first. Cloning the remote Git repository Cloning repository https://gerrit.osmocom.org/osmo-ci
git init https://jenkins.osmocom.org/jenkins/job/Osmocom_OBS_master/ws/ # timeout=10
Fetching upstream changes from https://gerrit.osmocom.org/osmo-ci
git --version # timeout=10 git --version # 'git version 2.39.5' git fetch --tags --force --progress -- https://gerrit.osmocom.org/osmo-ci +refs/heads/*:refs/remotes/origin/* # timeout=10 git config remote.origin.url https://gerrit.osmocom.org/osmo-ci # timeout=10 git config --add remote.origin.fetch +refs/heads/*:refs/remotes/origin/* # timeout=10
Avoid second fetch
git rev-parse refs/remotes/origin/refs/remotes/origin/master^{commit} # timeout=10 git rev-parse refs/remotes/origin/master^{commit} # timeout=10
Checking out Revision 9a18ebaa78fc255a0aea42186a2743829d69162e (refs/remotes/origin/master)
git config core.sparsecheckout # timeout=10 git checkout -f 9a18ebaa78fc255a0aea42186a2743829d69162e # timeout=10
Commit message: "obs: gerrit_binpkgs: set --allow-unknown-package"
git rev-list --no-walk 9a18ebaa78fc255a0aea42186a2743829d69162e # timeout=10
[Osmocom_OBS_master] $ /bin/sh -xe /tmp/jenkins663811891249918386.sh + export PYTHONUNBUFFERED=1 + ./scripts/obs/update_obs_project.py --apiurl https://obs.osmocom.org --conflict-version --docker --feed master --meta osmocom:master docker: building image debian-12-osmocom-obs-build-srcpkg + run_in_docker_and_exit(): ['docker', 'build', '--build-arg', 'DISTRO=debian:12', '--build-arg', 'DISTRO_FROM=debian:12', '--build-arg', 'UID=1000', '-t', 'debian-12-osmocom-obs-build-srcpkg', '-f', 'https://jenkins.osmocom.org/jenkins/job/Osmocom_OBS_master/ws/scripts/obs/data/build_srcpkg.Dockerfile', 'https://jenkins.osmocom.org/jenkins/job/Osmocom_OBS_master/ws/scripts/obs/data'] #0 building with "default" instance using docker driver
#1 [internal] load build definition from build_srcpkg.Dockerfile #1 transferring dockerfile: 579B done #1 WARN: InvalidDefaultArgInFrom: Default value for ARG ${DISTRO_FROM} results in empty or invalid base image name (line 3) #1 DONE 0.0s
#2 [internal] load metadata for docker.io/library/debian:12 #2 DONE 0.4s
#3 [internal] load .dockerignore #3 transferring context: 2B done #3 DONE 0.0s
#4 [1/3] FROM docker.io/library/debian:12@sha256:18023f131f52fc3ea21973cabffe0b216c60b417fd2478e94d9d59981ebba6af #4 resolve docker.io/library/debian:12@sha256:18023f131f52fc3ea21973cabffe0b216c60b417fd2478e94d9d59981ebba6af 0.0s done #4 DONE 0.0s
#5 [2/3] RUN APT-GET update && apt-get upgrade -y && apt-get install -y --no-install-recommends ca-certificates colordiff debhelper dh-python dpkg-dev fakeroot git git-review gnupg2 libxml2-utils lsb-release meson osc python3-packaging python3-setuptools quilt rebar3 sed sphinx-common && apt-get clean #5 CACHED
#6 [3/3] RUN USERADD --uid=1000 -m user #6 CACHED
#7 exporting to image #7 exporting layers done #7 writing image sha256:bc6a5998c69e89ffa8b1575b367bf8e7e099cfb23989f67da73b87732b6acf83 done #7 naming to docker.io/library/debian-12-osmocom-obs-build-srcpkg done #7 DONE 0.0s
[33m1 warning found (use docker --debug to expand): [0m - InvalidDefaultArgInFrom: Default value for ARG ${DISTRO_FROM} results in empty or invalid base image name (line 3) docker: running: update_obs_project.py inside docker OBS: getting packages in osmocom:master
ERROR: command failed unexpectedly
*** command *** ['osc', '-A', 'https://obs.osmocom.org', 'list', 'osmocom:master']
*** returncode *** 1
*** output *** Server returned an error: HTTP Error 503: Service Unavailable
Request: https://obs.osmocom.org/source/osmocom:master Headers: Server: nginx Date: Thu, 03 Apr 2025 23:58:10 GMT Content-Type: text/html; charset=UTF-8 Content-Length: 189 Connection: close cache-control: no-cache, no-store, must-revalidate Status: 503 Service Unavailable Cache-Control: public
*** python trace *** Traceback (most recent call last): File "/obs/update_obs_project.py", line 265, in <module> main() File "/obs/update_obs_project.py", line 257, in main pkgs_remote = lib.osc.get_remote_pkgs() ^^^^^^^^^^^^^^^^^^^^^^^^^ File "/obs/lib/osc.py", line 63, in get_remote_pkgs ret = run_osc(["list", proj]) ^^^^^^^^^^^^^^^^^^^^^^^ File "/obs/lib/osc.py", line 58, in run_osc return lib.run_cmd(cmd, *args, **kwargs) ^^^^^^^^^^^^^^^^^^^^^^^^^^^^^^^^^ File "/obs/lib/__init__.py", line 200, in run_cmd exit_error_cmd(p, "command failed unexpectedly") File "/obs/lib/__init__.py", line 161, in exit_error_cmd raise RuntimeError("shell command related error, find details right above" RuntimeError: shell command related error, find details right above this python trace Build step 'Execute shell' marked build as failure
See https://jenkins.osmocom.org/jenkins/job/Osmocom_OBS_master/93671/display/redirect
Changes:
------------------------------------------ Started by upstream project "master-osmocom-bb" build number 7400 originally caused by: Started by upstream project "master-libosmocore" build number 4302 originally caused by: Started by timer Running as SYSTEM Building remotely on build4-deb12build-ansible (ttcn3 obs osmo-gsm-tester-build ttcn3_with_linux_6.1_or_higher qemu io_uring osmocom-gerrit coverity osmocom-master) in workspace https://jenkins.osmocom.org/jenkins/job/Osmocom_OBS_master/ws/ The recommended git tool is: NONE No credentials specified Wiping out workspace first. Cloning the remote Git repository Cloning repository https://gerrit.osmocom.org/osmo-ci
git init https://jenkins.osmocom.org/jenkins/job/Osmocom_OBS_master/ws/ # timeout=10
Fetching upstream changes from https://gerrit.osmocom.org/osmo-ci
git --version # timeout=10 git --version # 'git version 2.39.5' git fetch --tags --force --progress -- https://gerrit.osmocom.org/osmo-ci +refs/heads/*:refs/remotes/origin/* # timeout=10 git config remote.origin.url https://gerrit.osmocom.org/osmo-ci # timeout=10 git config --add remote.origin.fetch +refs/heads/*:refs/remotes/origin/* # timeout=10
Avoid second fetch
git rev-parse refs/remotes/origin/refs/remotes/origin/master^{commit} # timeout=10 git rev-parse refs/remotes/origin/master^{commit} # timeout=10
Checking out Revision 9a18ebaa78fc255a0aea42186a2743829d69162e (refs/remotes/origin/master)
git config core.sparsecheckout # timeout=10 git checkout -f 9a18ebaa78fc255a0aea42186a2743829d69162e # timeout=10
Commit message: "obs: gerrit_binpkgs: set --allow-unknown-package"
git rev-list --no-walk 9a18ebaa78fc255a0aea42186a2743829d69162e # timeout=10
[Osmocom_OBS_master] $ /bin/sh -xe /tmp/jenkins9054827936885682040.sh + export PYTHONUNBUFFERED=1 + ./scripts/obs/update_obs_project.py --apiurl https://obs.osmocom.org --conflict-version --docker --feed master --meta osmocom:master docker: building image debian-12-osmocom-obs-build-srcpkg + run_in_docker_and_exit(): ['docker', 'build', '--build-arg', 'DISTRO=debian:12', '--build-arg', 'DISTRO_FROM=debian:12', '--build-arg', 'UID=1000', '-t', 'debian-12-osmocom-obs-build-srcpkg', '-f', 'https://jenkins.osmocom.org/jenkins/job/Osmocom_OBS_master/ws/scripts/obs/data/build_srcpkg.Dockerfile', 'https://jenkins.osmocom.org/jenkins/job/Osmocom_OBS_master/ws/scripts/obs/data'] #0 building with "default" instance using docker driver
#1 [internal] load build definition from build_srcpkg.Dockerfile #1 transferring dockerfile: 579B done #1 WARN: InvalidDefaultArgInFrom: Default value for ARG ${DISTRO_FROM} results in empty or invalid base image name (line 3) #1 DONE 0.0s
#2 [internal] load metadata for docker.io/library/debian:12 #2 DONE 0.4s
#3 [internal] load .dockerignore #3 transferring context: 2B done #3 DONE 0.0s
#4 [1/3] FROM docker.io/library/debian:12@sha256:18023f131f52fc3ea21973cabffe0b216c60b417fd2478e94d9d59981ebba6af #4 DONE 0.0s
#5 [2/3] RUN APT-GET update && apt-get upgrade -y && apt-get install -y --no-install-recommends ca-certificates colordiff debhelper dh-python dpkg-dev fakeroot git git-review gnupg2 libxml2-utils lsb-release meson osc python3-packaging python3-setuptools quilt rebar3 sed sphinx-common && apt-get clean #5 CACHED
#6 [3/3] RUN USERADD --uid=1000 -m user #6 CACHED
#7 exporting to image #7 exporting layers done #7 writing image sha256:2a9dd95b35028e4d71315e59c45ba43dc43f920d55d8b4980b221443515a5cd4 0.0s done #7 naming to docker.io/library/debian-12-osmocom-obs-build-srcpkg 0.0s done #7 DONE 0.0s
[33m1 warning found (use docker --debug to expand): [0m - InvalidDefaultArgInFrom: Default value for ARG ${DISTRO_FROM} results in empty or invalid base image name (line 3) docker: running: update_obs_project.py inside docker OBS: getting packages in osmocom:master Traceback (most recent call last): File "/obs/update_obs_project.py", line 265, in <module> main() File "/obs/update_obs_project.py", line 257, in main pkgs_remote = lib.osc.get_remote_pkgs() ^^^^^^^^^^^^^^^^^^^^^^^^^ File "/obs/lib/osc.py", line 63, in get_remote_pkgs
ERROR: command failed unexpectedly
*** command *** ['osc', '-A', 'https://obs.osmocom.org', 'list', 'osmocom:master']
*** returncode *** 1
*** output *** Server returned an error: HTTP Error 503: Service Unavailable
Request: https://obs.osmocom.org/source/osmocom:master Headers: Server: nginx Date: Thu, 03 Apr 2025 23:58:27 GMT Content-Type: text/html; charset=UTF-8 Content-Length: 189 Connection: close cache-control: no-cache, no-store, must-revalidate Status: 503 Service Unavailable Cache-Control: public
*** python trace *** ret = run_osc(["list", proj]) ^^^^^^^^^^^^^^^^^^^^^^^ File "/obs/lib/osc.py", line 58, in run_osc return lib.run_cmd(cmd, *args, **kwargs) ^^^^^^^^^^^^^^^^^^^^^^^^^^^^^^^^^ File "/obs/lib/__init__.py", line 200, in run_cmd exit_error_cmd(p, "command failed unexpectedly") File "/obs/lib/__init__.py", line 161, in exit_error_cmd raise RuntimeError("shell command related error, find details right above" RuntimeError: shell command related error, find details right above this python trace Build step 'Execute shell' marked build as failure
See https://jenkins.osmocom.org/jenkins/job/Osmocom_OBS_master/93672/display/redirect
Changes:
------------------------------------------ Started by upstream project "master-osmo-upf" build number 5324 originally caused by: Started by upstream project "master-libosmo-pfcp" build number 2541 originally caused by: Started by upstream project "master-libosmocore" build number 4302 originally caused by: Started by timer Running as SYSTEM Building remotely on build4-deb12build-ansible (ttcn3 obs osmo-gsm-tester-build ttcn3_with_linux_6.1_or_higher qemu io_uring osmocom-gerrit coverity osmocom-master) in workspace https://jenkins.osmocom.org/jenkins/job/Osmocom_OBS_master/ws/ The recommended git tool is: NONE No credentials specified Wiping out workspace first. Cloning the remote Git repository Cloning repository https://gerrit.osmocom.org/osmo-ci
git init https://jenkins.osmocom.org/jenkins/job/Osmocom_OBS_master/ws/ # timeout=10
Fetching upstream changes from https://gerrit.osmocom.org/osmo-ci
git --version # timeout=10 git --version # 'git version 2.39.5' git fetch --tags --force --progress -- https://gerrit.osmocom.org/osmo-ci +refs/heads/*:refs/remotes/origin/* # timeout=10 git config remote.origin.url https://gerrit.osmocom.org/osmo-ci # timeout=10 git config --add remote.origin.fetch +refs/heads/*:refs/remotes/origin/* # timeout=10
Avoid second fetch
git rev-parse refs/remotes/origin/refs/remotes/origin/master^{commit} # timeout=10 git rev-parse refs/remotes/origin/master^{commit} # timeout=10
Checking out Revision 9a18ebaa78fc255a0aea42186a2743829d69162e (refs/remotes/origin/master)
git config core.sparsecheckout # timeout=10 git checkout -f 9a18ebaa78fc255a0aea42186a2743829d69162e # timeout=10
Commit message: "obs: gerrit_binpkgs: set --allow-unknown-package"
git rev-list --no-walk 9a18ebaa78fc255a0aea42186a2743829d69162e # timeout=10
[Osmocom_OBS_master] $ /bin/sh -xe /tmp/jenkins12535746928647238792.sh + export PYTHONUNBUFFERED=1 + ./scripts/obs/update_obs_project.py --apiurl https://obs.osmocom.org --conflict-version --docker --feed master --meta osmocom:master docker: building image debian-12-osmocom-obs-build-srcpkg + run_in_docker_and_exit(): ['docker', 'build', '--build-arg', 'DISTRO=debian:12', '--build-arg', 'DISTRO_FROM=debian:12', '--build-arg', 'UID=1000', '-t', 'debian-12-osmocom-obs-build-srcpkg', '-f', 'https://jenkins.osmocom.org/jenkins/job/Osmocom_OBS_master/ws/scripts/obs/data/build_srcpkg.Dockerfile', 'https://jenkins.osmocom.org/jenkins/job/Osmocom_OBS_master/ws/scripts/obs/data'] #0 building with "default" instance using docker driver
#1 [internal] load build definition from build_srcpkg.Dockerfile #1 transferring dockerfile: 579B done #1 WARN: InvalidDefaultArgInFrom: Default value for ARG ${DISTRO_FROM} results in empty or invalid base image name (line 3) #1 DONE 0.0s
#2 [internal] load metadata for docker.io/library/debian:12 #2 DONE 0.4s
#3 [internal] load .dockerignore #3 transferring context: 2B done #3 DONE 0.1s
#4 [1/3] FROM docker.io/library/debian:12@sha256:18023f131f52fc3ea21973cabffe0b216c60b417fd2478e94d9d59981ebba6af #4 DONE 0.0s
#5 [2/3] RUN APT-GET update && apt-get upgrade -y && apt-get install -y --no-install-recommends ca-certificates colordiff debhelper dh-python dpkg-dev fakeroot git git-review gnupg2 libxml2-utils lsb-release meson osc python3-packaging python3-setuptools quilt rebar3 sed sphinx-common && apt-get clean #5 CACHED
#6 [3/3] RUN USERADD --uid=1000 -m user #6 CACHED
#7 exporting to image #7 exporting layers done #7 writing image sha256:2a9dd95b35028e4d71315e59c45ba43dc43f920d55d8b4980b221443515a5cd4 0.0s done #7 naming to docker.io/library/debian-12-osmocom-obs-build-srcpkg done #7 DONE 0.0s
[33m1 warning found (use docker --debug to expand): [0m - InvalidDefaultArgInFrom: Default value for ARG ${DISTRO_FROM} results in empty or invalid base image name (line 3) docker: running: update_obs_project.py inside docker OBS: getting packages in osmocom:master Traceback (most recent call last): File "/obs/update_obs_project.py", line 265, in <module> main() File "/obs/update_obs_project.py", line 257, in main pkgs_remote = lib.osc.get_remote_pkgs() ^^^^^^^^^^^^^^^^^^^^^^^^^ File "/obs/lib/osc.py", line 63, in get_remote_pkgs ret = run_osc(["list", proj])
ERROR: command failed unexpectedly
*** command *** ['osc', '-A', 'https://obs.osmocom.org', 'list', 'osmocom:master']
*** returncode *** 1
*** output *** Server returned an error: HTTP Error 503: Service Unavailable
Request: https://obs.osmocom.org/source/osmocom:master Headers: Server: nginx Date: Thu, 03 Apr 2025 23:59:15 GMT Content-Type: text/html; charset=UTF-8 Content-Length: 189 Connection: close cache-control: no-cache, no-store, must-revalidate Status: 503 Service Unavailable Cache-Control: public
*** python trace *** ^^^^^^^^^^^^^^^^^^^^^^^ File "/obs/lib/osc.py", line 58, in run_osc return lib.run_cmd(cmd, *args, **kwargs) ^^^^^^^^^^^^^^^^^^^^^^^^^^^^^^^^^ File "/obs/lib/__init__.py", line 200, in run_cmd exit_error_cmd(p, "command failed unexpectedly") File "/obs/lib/__init__.py", line 161, in exit_error_cmd raise RuntimeError("shell command related error, find details right above" RuntimeError: shell command related error, find details right above this python trace Build step 'Execute shell' marked build as failure
See https://jenkins.osmocom.org/jenkins/job/Osmocom_OBS_master/93673/display/redirect
Changes:
------------------------------------------ Started by upstream project "master-osmo-msc" build number 47787 originally caused by: Started by upstream project "master-libsmpp34" build number 2671 originally caused by: Started by timer Running as SYSTEM Building remotely on build4-deb12build-ansible (ttcn3 obs osmo-gsm-tester-build ttcn3_with_linux_6.1_or_higher qemu io_uring osmocom-gerrit coverity osmocom-master) in workspace https://jenkins.osmocom.org/jenkins/job/Osmocom_OBS_master/ws/ The recommended git tool is: NONE No credentials specified Wiping out workspace first. Cloning the remote Git repository Cloning repository https://gerrit.osmocom.org/osmo-ci
git init https://jenkins.osmocom.org/jenkins/job/Osmocom_OBS_master/ws/ # timeout=10
Fetching upstream changes from https://gerrit.osmocom.org/osmo-ci
git --version # timeout=10 git --version # 'git version 2.39.5' git fetch --tags --force --progress -- https://gerrit.osmocom.org/osmo-ci +refs/heads/*:refs/remotes/origin/* # timeout=10 git config remote.origin.url https://gerrit.osmocom.org/osmo-ci # timeout=10 git config --add remote.origin.fetch +refs/heads/*:refs/remotes/origin/* # timeout=10
Avoid second fetch
git rev-parse refs/remotes/origin/refs/remotes/origin/master^{commit} # timeout=10 git rev-parse refs/remotes/origin/master^{commit} # timeout=10
Checking out Revision 9a18ebaa78fc255a0aea42186a2743829d69162e (refs/remotes/origin/master)
git config core.sparsecheckout # timeout=10 git checkout -f 9a18ebaa78fc255a0aea42186a2743829d69162e # timeout=10
Commit message: "obs: gerrit_binpkgs: set --allow-unknown-package"
git rev-list --no-walk 9a18ebaa78fc255a0aea42186a2743829d69162e # timeout=10
[Osmocom_OBS_master] $ /bin/sh -xe /tmp/jenkins4458193789965372050.sh + export PYTHONUNBUFFERED=1 + ./scripts/obs/update_obs_project.py --apiurl https://obs.osmocom.org --conflict-version --docker --feed master --meta osmocom:master docker: building image debian-12-osmocom-obs-build-srcpkg + run_in_docker_and_exit(): ['docker', 'build', '--build-arg', 'DISTRO=debian:12', '--build-arg', 'DISTRO_FROM=debian:12', '--build-arg', 'UID=1000', '-t', 'debian-12-osmocom-obs-build-srcpkg', '-f', 'https://jenkins.osmocom.org/jenkins/job/Osmocom_OBS_master/ws/scripts/obs/data/build_srcpkg.Dockerfile', 'https://jenkins.osmocom.org/jenkins/job/Osmocom_OBS_master/ws/scripts/obs/data'] #0 building with "default" instance using docker driver
#1 [internal] load build definition from build_srcpkg.Dockerfile #1 transferring dockerfile: 579B done #1 WARN: InvalidDefaultArgInFrom: Default value for ARG ${DISTRO_FROM} results in empty or invalid base image name (line 3) #1 DONE 0.0s
#2 [internal] load metadata for docker.io/library/debian:12 #2 DONE 0.4s
#3 [internal] load .dockerignore #3 transferring context: 2B done #3 DONE 0.0s
#4 [1/3] FROM docker.io/library/debian:12@sha256:18023f131f52fc3ea21973cabffe0b216c60b417fd2478e94d9d59981ebba6af #4 DONE 0.0s
#5 [2/3] RUN APT-GET update && apt-get upgrade -y && apt-get install -y --no-install-recommends ca-certificates colordiff debhelper dh-python dpkg-dev fakeroot git git-review gnupg2 libxml2-utils lsb-release meson osc python3-packaging python3-setuptools quilt rebar3 sed sphinx-common && apt-get clean #5 CACHED
#6 [3/3] RUN USERADD --uid=1000 -m user #6 CACHED
#7 exporting to image #7 exporting layers done #7 writing image sha256:2a9dd95b35028e4d71315e59c45ba43dc43f920d55d8b4980b221443515a5cd4 done #7 naming to docker.io/library/debian-12-osmocom-obs-build-srcpkg 0.0s done #7 DONE 0.0s
[33m1 warning found (use docker --debug to expand): [0m - InvalidDefaultArgInFrom: Default value for ARG ${DISTRO_FROM} results in empty or invalid base image name (line 3) docker: running: update_obs_project.py inside docker OBS: getting packages in osmocom:master Traceback (most recent call last): File "/obs/update_obs_project.py", line 265, in <module> main() File "/obs/update_obs_project.py", line 257, in main pkgs_remote = lib.osc.get_remote_pkgs() ^^^^^^^^^^^^^^^^^^^^^^^^^ File "/obs/lib/osc.py", line 63, in get_remote_pkgs
ERROR: command failed unexpectedly
*** command *** ['osc', '-A', 'https://obs.osmocom.org', 'list', 'osmocom:master']
*** returncode *** 1
*** output *** Server returned an error: HTTP Error 503: Service Unavailable
Request: https://obs.osmocom.org/source/osmocom:master Headers: Server: nginx Date: Thu, 03 Apr 2025 23:59:25 GMT Content-Type: text/html; charset=UTF-8 Content-Length: 189 Connection: close cache-control: no-cache, no-store, must-revalidate Status: 503 Service Unavailable Cache-Control: public
*** python trace *** ret = run_osc(["list", proj]) ^^^^^^^^^^^^^^^^^^^^^^^ File "/obs/lib/osc.py", line 58, in run_osc return lib.run_cmd(cmd, *args, **kwargs) ^^^^^^^^^^^^^^^^^^^^^^^^^^^^^^^^^ File "/obs/lib/__init__.py", line 200, in run_cmd exit_error_cmd(p, "command failed unexpectedly") File "/obs/lib/__init__.py", line 161, in exit_error_cmd raise RuntimeError("shell command related error, find details right above" RuntimeError: shell command related error, find details right above this python trace Build step 'Execute shell' marked build as failure
See https://jenkins.osmocom.org/jenkins/job/Osmocom_OBS_master/93674/display/redirect
Changes:
------------------------------------------ Started by upstream project "master-osmo-hnbgw" build number 11423 originally caused by: Started by upstream project "master-libosmo-pfcp" build number 2541 originally caused by: Started by upstream project "master-libosmocore" build number 4302 originally caused by: Started by timer Running as SYSTEM Building remotely on build4-deb12build-ansible (ttcn3 obs osmo-gsm-tester-build ttcn3_with_linux_6.1_or_higher qemu io_uring osmocom-gerrit coverity osmocom-master) in workspace https://jenkins.osmocom.org/jenkins/job/Osmocom_OBS_master/ws/ The recommended git tool is: NONE No credentials specified Wiping out workspace first. Cloning the remote Git repository Cloning repository https://gerrit.osmocom.org/osmo-ci
git init https://jenkins.osmocom.org/jenkins/job/Osmocom_OBS_master/ws/ # timeout=10
Fetching upstream changes from https://gerrit.osmocom.org/osmo-ci
git --version # timeout=10 git --version # 'git version 2.39.5' git fetch --tags --force --progress -- https://gerrit.osmocom.org/osmo-ci +refs/heads/*:refs/remotes/origin/* # timeout=10 git config remote.origin.url https://gerrit.osmocom.org/osmo-ci # timeout=10 git config --add remote.origin.fetch +refs/heads/*:refs/remotes/origin/* # timeout=10
Avoid second fetch
git rev-parse refs/remotes/origin/refs/remotes/origin/master^{commit} # timeout=10 git rev-parse refs/remotes/origin/master^{commit} # timeout=10
Checking out Revision 9a18ebaa78fc255a0aea42186a2743829d69162e (refs/remotes/origin/master)
git config core.sparsecheckout # timeout=10 git checkout -f 9a18ebaa78fc255a0aea42186a2743829d69162e # timeout=10
Commit message: "obs: gerrit_binpkgs: set --allow-unknown-package"
git rev-list --no-walk 9a18ebaa78fc255a0aea42186a2743829d69162e # timeout=10
[Osmocom_OBS_master] $ /bin/sh -xe /tmp/jenkins17284273811932625047.sh + export PYTHONUNBUFFERED=1 + ./scripts/obs/update_obs_project.py --apiurl https://obs.osmocom.org --conflict-version --docker --feed master --meta osmocom:master docker: building image debian-12-osmocom-obs-build-srcpkg + run_in_docker_and_exit(): ['docker', 'build', '--build-arg', 'DISTRO=debian:12', '--build-arg', 'DISTRO_FROM=debian:12', '--build-arg', 'UID=1000', '-t', 'debian-12-osmocom-obs-build-srcpkg', '-f', 'https://jenkins.osmocom.org/jenkins/job/Osmocom_OBS_master/ws/scripts/obs/data/build_srcpkg.Dockerfile', 'https://jenkins.osmocom.org/jenkins/job/Osmocom_OBS_master/ws/scripts/obs/data'] #0 building with "default" instance using docker driver
#1 [internal] load build definition from build_srcpkg.Dockerfile #1 transferring dockerfile: 579B done #1 WARN: InvalidDefaultArgInFrom: Default value for ARG ${DISTRO_FROM} results in empty or invalid base image name (line 3) #1 DONE 0.0s
#2 [internal] load metadata for docker.io/library/debian:12 #2 DONE 0.4s
#3 [internal] load .dockerignore #3 transferring context: 2B done #3 DONE 0.0s
#4 [1/3] FROM docker.io/library/debian:12@sha256:18023f131f52fc3ea21973cabffe0b216c60b417fd2478e94d9d59981ebba6af #4 DONE 0.0s
#5 [2/3] RUN APT-GET update && apt-get upgrade -y && apt-get install -y --no-install-recommends ca-certificates colordiff debhelper dh-python dpkg-dev fakeroot git git-review gnupg2 libxml2-utils lsb-release meson osc python3-packaging python3-setuptools quilt rebar3 sed sphinx-common && apt-get clean #5 CACHED
#6 [3/3] RUN USERADD --uid=1000 -m user #6 CACHED
#7 exporting to image #7 exporting layers done #7 writing image sha256:2a9dd95b35028e4d71315e59c45ba43dc43f920d55d8b4980b221443515a5cd4 0.0s done #7 naming to docker.io/library/debian-12-osmocom-obs-build-srcpkg done #7 DONE 0.0s
[33m1 warning found (use docker --debug to expand): [0m - InvalidDefaultArgInFrom: Default value for ARG ${DISTRO_FROM} results in empty or invalid base image name (line 3) docker: running: update_obs_project.py inside docker OBS: getting packages in osmocom:master
ERROR: command failed unexpectedly
*** command *** ['osc', '-A', 'https://obs.osmocom.org', 'list', 'osmocom:master']
*** returncode *** 1
*** output *** Server returned an error: HTTP Error 503: Service Unavailable
Request: https://obs.osmocom.org/source/osmocom:master Headers: Server: nginx Date: Thu, 03 Apr 2025 23:59:50 GMT Content-Type: text/html; charset=UTF-8 Content-Length: 189 Connection: close cache-control: no-cache, no-store, must-revalidate Status: 503 Service Unavailable Cache-Control: public
*** python trace *** Traceback (most recent call last): File "/obs/update_obs_project.py", line 265, in <module> main() File "/obs/update_obs_project.py", line 257, in main pkgs_remote = lib.osc.get_remote_pkgs() ^^^^^^^^^^^^^^^^^^^^^^^^^ File "/obs/lib/osc.py", line 63, in get_remote_pkgs ret = run_osc(["list", proj]) ^^^^^^^^^^^^^^^^^^^^^^^ File "/obs/lib/osc.py", line 58, in run_osc return lib.run_cmd(cmd, *args, **kwargs) ^^^^^^^^^^^^^^^^^^^^^^^^^^^^^^^^^ File "/obs/lib/__init__.py", line 200, in run_cmd exit_error_cmd(p, "command failed unexpectedly") File "/obs/lib/__init__.py", line 161, in exit_error_cmd raise RuntimeError("shell command related error, find details right above" RuntimeError: shell command related error, find details right above this python trace Build step 'Execute shell' marked build as failure
jenkins-notifications@lists.osmocom.org