Changes:
------------------------------------------ [...truncated 429.00 KB...]
ss -tn
State Recv-Q Send-Q Local Address:Port Peer Address:Port
ss -tln
State Recv-Q Send-Q Local Address:Port Peer Address:Port LISTEN 0 10 127.0.0.1:4251 *:* LISTEN 0 10 127.0.0.1:4245 *:*
ps xua | grep osmo
build 12547 0.0 0.0 21475109004 26496 ? S 15:32 0:00 ./src/sgsn/osmo-sgsn -c /build/tests/../doc/examples/osmo-sgsn/osmo-sgsn-accept-all.cfg build 12554 0.0 0.0 4280 796 ? S 15:32 0:00 /bin/sh -c ps xua | grep osmo build 12556 0.0 0.0 12784 1012 ? S 15:32 0:00 grep osmo
Socket: in 1 tries, connected to 127.0.0.1:4245 <socket.socket fd=4, family=AddressFamily.AF_INET, type=SocketKind.SOCK_STREAM, proto=0, laddr=('127.0.0.1', 38088), raddr=('127.0.0.1', 4245)> (1 sockets open) Socket: closing 127.0.0.1:4245 <socket.socket fd=4, family=AddressFamily.AF_INET, type=SocketKind.SOCK_STREAM, proto=0, laddr=('127.0.0.1', 38088), raddr=('127.0.0.1', 4245)> (0 sockets open) Terminating took 0.897s ok testVtyCDR (__main__.TestVTYSGSN) ... Launching: PWD=/build './src/sgsn/osmo-sgsn' '-c' '/build/tests/../doc/examples/osmo-sgsn/osmo-sgsn-accept-all.cfg'
ls -l /proc/12513/fd
total 0 lr-x------ 1 build build 64 Dec 2 15:32 0 -> pipe:[205876758] l-wx------ 1 build build 64 Dec 2 15:32 1 -> pipe:[205876759] l-wx------ 1 build build 64 Dec 2 15:32 2 -> pipe:[205876760] l-wx------ 1 build build 64 Dec 2 15:32 3 -> /dev/null
ss -tn
State Recv-Q Send-Q Local Address:Port Peer Address:Port
ss -tln
State Recv-Q Send-Q Local Address:Port Peer Address:Port
ps xua | grep osmo
build 12558 0.0 0.0 21475109004 32996 ? R 15:32 0:00 ./src/sgsn/osmo-sgsn -c /build/tests/../doc/examples/osmo-sgsn/osmo-sgsn-accept-all.cfg build 12565 0.0 0.0 4280 704 ? S 15:32 0:00 /bin/sh -c ps xua | grep osmo build 12567 0.0 0.0 12784 932 ? S 15:32 0:00 grep osmo
Socket: in 1 tries, connected to 127.0.0.1:4245 <socket.socket fd=4, family=AddressFamily.AF_INET, type=SocketKind.SOCK_STREAM, proto=0, laddr=('127.0.0.1', 38090), raddr=('127.0.0.1', 4245)> (1 sockets open) Socket: closing 127.0.0.1:4245 <socket.socket fd=4, family=AddressFamily.AF_INET, type=SocketKind.SOCK_STREAM, proto=0, laddr=('127.0.0.1', 38090), raddr=('127.0.0.1', 4245)> (0 sockets open) Terminating took 0.897s ok testVtyEasyAPN (__main__.TestVTYSGSN) ... Launching: PWD=/build './src/sgsn/osmo-sgsn' '-c' '/build/tests/../doc/examples/osmo-sgsn/osmo-sgsn-accept-all.cfg'
ls -l /proc/12513/fd
total 0 lr-x------ 1 build build 64 Dec 2 15:32 0 -> pipe:[205876758] l-wx------ 1 build build 64 Dec 2 15:32 1 -> pipe:[205876759] l-wx------ 1 build build 64 Dec 2 15:32 2 -> pipe:[205876760] l-wx------ 1 build build 64 Dec 2 15:32 3 -> /dev/null
ss -tn
State Recv-Q Send-Q Local Address:Port Peer Address:Port
ss -tln
State Recv-Q Send-Q Local Address:Port Peer Address:Port
ps xua | grep osmo
build 12569 0.0 0.0 21474976644 29332 ? D 15:32 0:00 ./src/sgsn/osmo-sgsn -c /build/tests/../doc/examples/osmo-sgsn/osmo-sgsn-accept-all.cfg build 12576 0.0 0.0 4280 768 ? S 15:32 0:00 /bin/sh -c ps xua | grep osmo build 12578 0.0 0.0 12784 956 ? S 15:32 0:00 grep osmo
Socket: in 1 tries, connected to 127.0.0.1:4245 <socket.socket fd=4, family=AddressFamily.AF_INET, type=SocketKind.SOCK_STREAM, proto=0, laddr=('127.0.0.1', 38092), raddr=('127.0.0.1', 4245)> (1 sockets open) Socket: closing 127.0.0.1:4245 <socket.socket fd=4, family=AddressFamily.AF_INET, type=SocketKind.SOCK_STREAM, proto=0, laddr=('127.0.0.1', 38092), raddr=('127.0.0.1', 4245)> (0 sockets open) Terminating took 0.897s ok testVtyGgsn (__main__.TestVTYSGSN) ... Launching: PWD=/build './src/sgsn/osmo-sgsn' '-c' '/build/tests/../doc/examples/osmo-sgsn/osmo-sgsn-accept-all.cfg'
ls -l /proc/12513/fd
total 0 lr-x------ 1 build build 64 Dec 2 15:32 0 -> pipe:[205876758] l-wx------ 1 build build 64 Dec 2 15:32 1 -> pipe:[205876759] l-wx------ 1 build build 64 Dec 2 15:32 2 -> pipe:[205876760] l-wx------ 1 build build 64 Dec 2 15:32 3 -> /dev/null
ss -tn
State Recv-Q Send-Q Local Address:Port Peer Address:Port
ss -tln
State Recv-Q Send-Q Local Address:Port Peer Address:Port
ps xua | grep osmo
build 12580 0.0 0.0 21475042824 29212 ? R 15:32 0:00 ./src/sgsn/osmo-sgsn -c /build/tests/../doc/examples/osmo-sgsn/osmo-sgsn-accept-all.cfg build 12587 0.0 0.0 4280 716 ? S 15:32 0:00 /bin/sh -c ps xua | grep osmo build 12589 0.0 0.0 12784 972 ? S 15:32 0:00 grep osmo
Socket: in 1 tries, connected to 127.0.0.1:4245 <socket.socket fd=4, family=AddressFamily.AF_INET, type=SocketKind.SOCK_STREAM, proto=0, laddr=('127.0.0.1', 38094), raddr=('127.0.0.1', 4245)> (1 sockets open) Socket: closing 127.0.0.1:4245 <socket.socket fd=4, family=AddressFamily.AF_INET, type=SocketKind.SOCK_STREAM, proto=0, laddr=('127.0.0.1', 38094), raddr=('127.0.0.1', 4245)> (0 sockets open) Terminating took 0.897s ok testVtyShow (__main__.TestVTYSGSN) ... Launching: PWD=/build './src/sgsn/osmo-sgsn' '-c' '/build/tests/../doc/examples/osmo-sgsn/osmo-sgsn-accept-all.cfg'
ls -l /proc/12513/fd
total 0 lr-x------ 1 build build 64 Dec 2 15:32 0 -> pipe:[205876758] l-wx------ 1 build build 64 Dec 2 15:32 1 -> pipe:[205876759] l-wx------ 1 build build 64 Dec 2 15:32 2 -> pipe:[205876760] l-wx------ 1 build build 64 Dec 2 15:32 3 -> /dev/null
ss -tn
State Recv-Q Send-Q Local Address:Port Peer Address:Port
ss -tln
State Recv-Q Send-Q Local Address:Port Peer Address:Port
ps xua | grep osmo
build 12591 0.0 0.0 21475042824 30508 ? R 15:32 0:00 ./src/sgsn/osmo-sgsn -c /build/tests/../doc/examples/osmo-sgsn/osmo-sgsn-accept-all.cfg build 12598 0.0 0.0 4280 708 ? S 15:32 0:00 /bin/sh -c ps xua | grep osmo build 12600 0.0 0.0 12784 1012 ? S 15:32 0:00 grep osmo
Socket: in 1 tries, connected to 127.0.0.1:4245 <socket.socket fd=4, family=AddressFamily.AF_INET, type=SocketKind.SOCK_STREAM, proto=0, laddr=('127.0.0.1', 38096), raddr=('127.0.0.1', 4245)> (1 sockets open) Socket: closing 127.0.0.1:4245 <socket.socket fd=4, family=AddressFamily.AF_INET, type=SocketKind.SOCK_STREAM, proto=0, laddr=('127.0.0.1', 38096), raddr=('127.0.0.1', 4245)> (0 sockets open) Terminating took 0.897s ok testVtySubscriber (__main__.TestVTYSGSN) ... Launching: PWD=/build './src/sgsn/osmo-sgsn' '-c' '/build/tests/../doc/examples/osmo-sgsn/osmo-sgsn-accept-all.cfg'
ls -l /proc/12513/fd
total 0 lr-x------ 1 build build 64 Dec 2 15:32 0 -> pipe:[205876758] l-wx------ 1 build build 64 Dec 2 15:32 1 -> pipe:[205876759] l-wx------ 1 build build 64 Dec 2 15:32 2 -> pipe:[205876760] l-wx------ 1 build build 64 Dec 2 15:32 3 -> /dev/null
ss -tn
State Recv-Q Send-Q Local Address:Port Peer Address:Port
ss -tln
State Recv-Q Send-Q Local Address:Port Peer Address:Port
ps xua | grep osmo
build 12602 0.0 0.0 21475109004 36828 ? R 15:32 0:00 ./src/sgsn/osmo-sgsn -c /build/tests/../doc/examples/osmo-sgsn/osmo-sgsn-accept-all.cfg build 12609 0.0 0.0 4280 756 ? S 15:32 0:00 /bin/sh -c ps xua | grep osmo build 12611 0.0 0.0 12784 936 ? S 15:32 0:00 grep osmo
Socket: in 1 tries, connected to 127.0.0.1:4245 <socket.socket fd=4, family=AddressFamily.AF_INET, type=SocketKind.SOCK_STREAM, proto=0, laddr=('127.0.0.1', 38098), raddr=('127.0.0.1', 4245)> (1 sockets open) Socket: closing 127.0.0.1:4245 <socket.socket fd=4, family=AddressFamily.AF_INET, type=SocketKind.SOCK_STREAM, proto=0, laddr=('127.0.0.1', 38098), raddr=('127.0.0.1', 4245)> (0 sockets open) Terminating took 0.897s ok testVtyTimers (__main__.TestVTYSGSN) ... Launching: PWD=/build './src/sgsn/osmo-sgsn' '-c' '/build/tests/../doc/examples/osmo-sgsn/osmo-sgsn-accept-all.cfg'
ls -l /proc/12513/fd
total 0 lr-x------ 1 build build 64 Dec 2 15:32 0 -> pipe:[205876758] l-wx------ 1 build build 64 Dec 2 15:32 1 -> pipe:[205876759] l-wx------ 1 build build 64 Dec 2 15:32 2 -> pipe:[205876760] l-wx------ 1 build build 64 Dec 2 15:32 3 -> /dev/null
ss -tn
State Recv-Q Send-Q Local Address:Port Peer Address:Port
ss -tln
State Recv-Q Send-Q Local Address:Port Peer Address:Port
ps xua | grep osmo
build 12613 0.0 0.0 21475109004 26332 ? S 15:32 0:00 ./src/sgsn/osmo-sgsn -c /build/tests/../doc/examples/osmo-sgsn/osmo-sgsn-accept-all.cfg build 12620 0.0 0.0 4280 736 ? S 15:32 0:00 /bin/sh -c ps xua | grep osmo build 12622 0.0 0.0 12784 964 ? S 15:32 0:00 grep osmo
Socket: in 1 tries, connected to 127.0.0.1:4245 <socket.socket fd=4, family=AddressFamily.AF_INET, type=SocketKind.SOCK_STREAM, proto=0, laddr=('127.0.0.1', 38100), raddr=('127.0.0.1', 4245)> (1 sockets open) Socket: closing 127.0.0.1:4245 <socket.socket fd=4, family=AddressFamily.AF_INET, type=SocketKind.SOCK_STREAM, proto=0, laddr=('127.0.0.1', 38100), raddr=('127.0.0.1', 4245)> (0 sockets open) Terminating took 0.897s ok testVtyTree (__main__.TestVTYSGSN) ... Launching: PWD=/build './src/sgsn/osmo-sgsn' '-c' '/build/tests/../doc/examples/osmo-sgsn/osmo-sgsn-accept-all.cfg'
ls -l /proc/12513/fd
total 0 lr-x------ 1 build build 64 Dec 2 15:32 0 -> pipe:[205876758] l-wx------ 1 build build 64 Dec 2 15:32 1 -> pipe:[205876759] l-wx------ 1 build build 64 Dec 2 15:32 2 -> pipe:[205876760] l-wx------ 1 build build 64 Dec 2 15:32 3 -> /dev/null
ss -tn
State Recv-Q Send-Q Local Address:Port Peer Address:Port
ss -tln
State Recv-Q Send-Q Local Address:Port Peer Address:Port
ps xua | grep osmo
build 12624 0.0 0.0 21475109004 28520 ? S 15:32 0:00 ./src/sgsn/osmo-sgsn -c /build/tests/../doc/examples/osmo-sgsn/osmo-sgsn-accept-all.cfg build 12631 0.0 0.0 4280 772 ? S 15:32 0:00 /bin/sh -c ps xua | grep osmo build 12633 0.0 0.0 12784 948 ? S 15:32 0:00 grep osmo
Socket: in 1 tries, connected to 127.0.0.1:4245 <socket.socket fd=4, family=AddressFamily.AF_INET, type=SocketKind.SOCK_STREAM, proto=0, laddr=('127.0.0.1', 38102), raddr=('127.0.0.1', 4245)> (1 sockets open) Socket: closing 127.0.0.1:4245 <socket.socket fd=4, family=AddressFamily.AF_INET, type=SocketKind.SOCK_STREAM, proto=0, laddr=('127.0.0.1', 38102), raddr=('127.0.0.1', 4245)> (0 sockets open) Terminating took 0.897s ok
====================================================================== FAIL: testVtyShow (__main__.TestVTYGbproxy) ---------------------------------------------------------------------- Traceback (most recent call last): File "./vty_test_runner.py", line 98, in testVtyShow self.assertTrue(res.find('UDP bind') >= 0) AssertionError: False is not true
---------------------------------------------------------------------- Ran 11 tests in 15.877s
FAILED (failures=1) make[7]: *** [vty-python-test] Error 1 Makefile:711: recipe for target 'vty-python-test' failed make[7]: Leaving directory '/build/tests' Makefile:728: recipe for target 'vty-test' failed make[6]: Leaving directory '/build/tests' make[6]: *** [vty-test] Error 2 make[5]: *** [python-tests] Error 2 Makefile:705: recipe for target 'python-tests' failed make[5]: Leaving directory '/build/tests' make[4]: *** [check-local] Error 2 Makefile:736: recipe for target 'check-local' failed make[4]: Leaving directory '/build/tests' Makefile:565: recipe for target 'check-am' failed make[3]: Leaving directory '/build/tests' make[3]: *** [check-am] Error 2 Makefile:417: recipe for target 'check-recursive' failed make[2]: Leaving directory '/build/tests' make[2]: *** [check-recursive] Error 1 Makefile:461: recipe for target 'check-recursive' failed make[1]: Leaving directory '/build' make[1]: *** [check-recursive] Error 1 make: *** [check] Error 2 Makefile:752: recipe for target 'check' failed + cat-testlogs.sh Build step 'Execute shell' marked build as failure [WARNINGS]Skipping publisher since build result is FAILURE
Changes:
------------------------------------------ [...truncated 429.20 KB...] l-wx------ 1 build build 64 Dec 2 15:35 2 -> pipe:[1841171219] l-wx------ 1 build build 64 Dec 2 15:35 3 -> /dev/null
ss -tn
State Recv-Q Send-Q Local Address:Port Peer Address:Port
ss -tln
State Recv-Q Send-Q Local Address:Port Peer Address:Port
ps xua | grep osmo
build 12528 0.0 0.0 21475109004 18132 ? S 15:35 0:00 ./src/sgsn/osmo-sgsn -c /build/tests/../doc/examples/osmo-sgsn/osmo-sgsn-accept-all.cfg build 12535 0.0 0.0 4280 716 ? S 15:35 0:00 /bin/sh -c ps xua | grep osmo build 12537 0.0 0.0 12784 1012 ? S 15:35 0:00 grep osmo
Socket: in 1 tries, connected to 127.0.0.1:4245 <socket.socket fd=4, family=AddressFamily.AF_INET, type=SocketKind.SOCK_STREAM, proto=0, laddr=('127.0.0.1', 49168), raddr=('127.0.0.1', 4245)> (1 sockets open) Socket: closing 127.0.0.1:4245 <socket.socket fd=4, family=AddressFamily.AF_INET, type=SocketKind.SOCK_STREAM, proto=0, laddr=('127.0.0.1', 49168), raddr=('127.0.0.1', 4245)> (0 sockets open) Terminating took 0.897s ok testVtyCDR (__main__.TestVTYSGSN) ... Launching: PWD=/build './src/sgsn/osmo-sgsn' '-c' '/build/tests/../doc/examples/osmo-sgsn/osmo-sgsn-accept-all.cfg'
ls -l /proc/12494/fd
total 0 lr-x------ 1 build build 64 Dec 2 15:35 0 -> pipe:[1841171217] l-wx------ 1 build build 64 Dec 2 15:35 1 -> pipe:[1841171218] l-wx------ 1 build build 64 Dec 2 15:35 2 -> pipe:[1841171219] l-wx------ 1 build build 64 Dec 2 15:35 3 -> /dev/null
ss -tn
State Recv-Q Send-Q Local Address:Port Peer Address:Port
ss -tln
State Recv-Q Send-Q Local Address:Port Peer Address:Port
ps xua | grep osmo
build 12539 0.0 0.0 21475109004 18092 ? S 15:35 0:00 ./src/sgsn/osmo-sgsn -c /build/tests/../doc/examples/osmo-sgsn/osmo-sgsn-accept-all.cfg build 12546 0.0 0.0 4280 752 ? S 15:35 0:00 /bin/sh -c ps xua | grep osmo build 12548 0.0 0.0 12784 928 ? S 15:35 0:00 grep osmo
Socket: in 1 tries, connected to 127.0.0.1:4245 <socket.socket fd=4, family=AddressFamily.AF_INET, type=SocketKind.SOCK_STREAM, proto=0, laddr=('127.0.0.1', 49232), raddr=('127.0.0.1', 4245)> (1 sockets open) Socket: closing 127.0.0.1:4245 <socket.socket fd=4, family=AddressFamily.AF_INET, type=SocketKind.SOCK_STREAM, proto=0, laddr=('127.0.0.1', 49232), raddr=('127.0.0.1', 4245)> (0 sockets open) Terminating took 0.897s ok testVtyEasyAPN (__main__.TestVTYSGSN) ... Launching: PWD=/build './src/sgsn/osmo-sgsn' '-c' '/build/tests/../doc/examples/osmo-sgsn/osmo-sgsn-accept-all.cfg'
ls -l /proc/12494/fd
total 0 lr-x------ 1 build build 64 Dec 2 15:35 0 -> pipe:[1841171217] l-wx------ 1 build build 64 Dec 2 15:35 1 -> pipe:[1841171218] l-wx------ 1 build build 64 Dec 2 15:35 2 -> pipe:[1841171219] l-wx------ 1 build build 64 Dec 2 15:35 3 -> /dev/null
ss -tn
State Recv-Q Send-Q Local Address:Port Peer Address:Port
ss -tln
State Recv-Q Send-Q Local Address:Port Peer Address:Port
ps xua | grep osmo
build 12550 0.0 0.0 21475109004 17980 ? S 15:35 0:00 ./src/sgsn/osmo-sgsn -c /build/tests/../doc/examples/osmo-sgsn/osmo-sgsn-accept-all.cfg build 12557 0.0 0.0 4280 720 ? S 15:35 0:00 /bin/sh -c ps xua | grep osmo build 12559 0.0 0.0 12784 976 ? S 15:35 0:00 grep osmo
Socket: in 1 tries, connected to 127.0.0.1:4245 <socket.socket fd=4, family=AddressFamily.AF_INET, type=SocketKind.SOCK_STREAM, proto=0, laddr=('127.0.0.1', 49284), raddr=('127.0.0.1', 4245)> (1 sockets open) Socket: closing 127.0.0.1:4245 <socket.socket fd=4, family=AddressFamily.AF_INET, type=SocketKind.SOCK_STREAM, proto=0, laddr=('127.0.0.1', 49284), raddr=('127.0.0.1', 4245)> (0 sockets open) Terminating took 0.897s ok testVtyGgsn (__main__.TestVTYSGSN) ... Launching: PWD=/build './src/sgsn/osmo-sgsn' '-c' '/build/tests/../doc/examples/osmo-sgsn/osmo-sgsn-accept-all.cfg'
ls -l /proc/12494/fd
total 0 lr-x------ 1 build build 64 Dec 2 15:35 0 -> pipe:[1841171217] l-wx------ 1 build build 64 Dec 2 15:35 1 -> pipe:[1841171218] l-wx------ 1 build build 64 Dec 2 15:35 2 -> pipe:[1841171219] l-wx------ 1 build build 64 Dec 2 15:35 3 -> /dev/null
ss -tn
State Recv-Q Send-Q Local Address:Port Peer Address:Port
ss -tln
State Recv-Q Send-Q Local Address:Port Peer Address:Port
ps xua | grep osmo
build 12561 0.0 0.0 21475109004 23568 ? R 15:35 0:00 ./src/sgsn/osmo-sgsn -c /build/tests/../doc/examples/osmo-sgsn/osmo-sgsn-accept-all.cfg build 12568 0.0 0.0 4280 756 ? S 15:35 0:00 /bin/sh -c ps xua | grep osmo build 12570 0.0 0.0 12784 964 ? S 15:35 0:00 grep osmo
Socket: in 1 tries, connected to 127.0.0.1:4245 <socket.socket fd=4, family=AddressFamily.AF_INET, type=SocketKind.SOCK_STREAM, proto=0, laddr=('127.0.0.1', 49330), raddr=('127.0.0.1', 4245)> (1 sockets open) Socket: closing 127.0.0.1:4245 <socket.socket fd=4, family=AddressFamily.AF_INET, type=SocketKind.SOCK_STREAM, proto=0, laddr=('127.0.0.1', 49330), raddr=('127.0.0.1', 4245)> (0 sockets open) Terminating took 0.897s ok testVtyShow (__main__.TestVTYSGSN) ... Launching: PWD=/build './src/sgsn/osmo-sgsn' '-c' '/build/tests/../doc/examples/osmo-sgsn/osmo-sgsn-accept-all.cfg'
ls -l /proc/12494/fd
total 0 lr-x------ 1 build build 64 Dec 2 15:35 0 -> pipe:[1841171217] l-wx------ 1 build build 64 Dec 2 15:35 1 -> pipe:[1841171218] l-wx------ 1 build build 64 Dec 2 15:35 2 -> pipe:[1841171219] l-wx------ 1 build build 64 Dec 2 15:35 3 -> /dev/null
ss -tn
State Recv-Q Send-Q Local Address:Port Peer Address:Port
ss -tln
State Recv-Q Send-Q Local Address:Port Peer Address:Port
ps xua | grep osmo
build 12572 0.0 0.0 21475109004 17944 ? S 15:35 0:00 ./src/sgsn/osmo-sgsn -c /build/tests/../doc/examples/osmo-sgsn/osmo-sgsn-accept-all.cfg build 12579 0.0 0.0 4280 700 ? S 15:35 0:00 /bin/sh -c ps xua | grep osmo build 12581 0.0 0.0 12784 1012 ? S 15:35 0:00 grep osmo
Socket: in 1 tries, connected to 127.0.0.1:4245 <socket.socket fd=4, family=AddressFamily.AF_INET, type=SocketKind.SOCK_STREAM, proto=0, laddr=('127.0.0.1', 49402), raddr=('127.0.0.1', 4245)> (1 sockets open) Socket: closing 127.0.0.1:4245 <socket.socket fd=4, family=AddressFamily.AF_INET, type=SocketKind.SOCK_STREAM, proto=0, laddr=('127.0.0.1', 49402), raddr=('127.0.0.1', 4245)> (0 sockets open) Terminating took 0.897s ok testVtySubscriber (__main__.TestVTYSGSN) ... Launching: PWD=/build './src/sgsn/osmo-sgsn' '-c' '/build/tests/../doc/examples/osmo-sgsn/osmo-sgsn-accept-all.cfg'
ls -l /proc/12494/fd
total 0 lr-x------ 1 build build 64 Dec 2 15:35 0 -> pipe:[1841171217] l-wx------ 1 build build 64 Dec 2 15:35 1 -> pipe:[1841171218] l-wx------ 1 build build 64 Dec 2 15:35 2 -> pipe:[1841171219] l-wx------ 1 build build 64 Dec 2 15:35 3 -> /dev/null
ss -tn
State Recv-Q Send-Q Local Address:Port Peer Address:Port
ss -tln
State Recv-Q Send-Q Local Address:Port Peer Address:Port
ps xua | grep osmo
build 12583 0.0 0.0 21475109004 18224 ? S 15:35 0:00 ./src/sgsn/osmo-sgsn -c /build/tests/../doc/examples/osmo-sgsn/osmo-sgsn-accept-all.cfg build 12590 0.0 0.0 4280 748 ? S 15:35 0:00 /bin/sh -c ps xua | grep osmo build 12592 0.0 0.0 12784 944 ? S 15:35 0:00 grep osmo
Socket: in 1 tries, connected to 127.0.0.1:4245 <socket.socket fd=4, family=AddressFamily.AF_INET, type=SocketKind.SOCK_STREAM, proto=0, laddr=('127.0.0.1', 49444), raddr=('127.0.0.1', 4245)> (1 sockets open) Socket: closing 127.0.0.1:4245 <socket.socket fd=4, family=AddressFamily.AF_INET, type=SocketKind.SOCK_STREAM, proto=0, laddr=('127.0.0.1', 49444), raddr=('127.0.0.1', 4245)> (0 sockets open) Terminating took 0.897s ok testVtyTimers (__main__.TestVTYSGSN) ... Launching: PWD=/build './src/sgsn/osmo-sgsn' '-c' '/build/tests/../doc/examples/osmo-sgsn/osmo-sgsn-accept-all.cfg'
ls -l /proc/12494/fd
total 0 lr-x------ 1 build build 64 Dec 2 15:35 0 -> pipe:[1841171217] l-wx------ 1 build build 64 Dec 2 15:35 1 -> pipe:[1841171218] l-wx------ 1 build build 64 Dec 2 15:35 2 -> pipe:[1841171219] l-wx------ 1 build build 64 Dec 2 15:35 3 -> /dev/null
ss -tn
State Recv-Q Send-Q Local Address:Port Peer Address:Port
ss -tln
State Recv-Q Send-Q Local Address:Port Peer Address:Port
ps xua | grep osmo
build 12594 0.0 0.0 21475109004 18072 ? S 15:35 0:00 ./src/sgsn/osmo-sgsn -c /build/tests/../doc/examples/osmo-sgsn/osmo-sgsn-accept-all.cfg build 12601 0.0 0.0 4280 724 ? S 15:35 0:00 /bin/sh -c ps xua | grep osmo build 12603 0.0 0.0 12784 940 ? S 15:35 0:00 grep osmo
Socket: in 1 tries, connected to 127.0.0.1:4245 <socket.socket fd=4, family=AddressFamily.AF_INET, type=SocketKind.SOCK_STREAM, proto=0, laddr=('127.0.0.1', 49500), raddr=('127.0.0.1', 4245)> (1 sockets open) Socket: closing 127.0.0.1:4245 <socket.socket fd=4, family=AddressFamily.AF_INET, type=SocketKind.SOCK_STREAM, proto=0, laddr=('127.0.0.1', 49500), raddr=('127.0.0.1', 4245)> (0 sockets open) Terminating took 0.897s ok testVtyTree (__main__.TestVTYSGSN) ... Launching: PWD=/build './src/sgsn/osmo-sgsn' '-c' '/build/tests/../doc/examples/osmo-sgsn/osmo-sgsn-accept-all.cfg'
ls -l /proc/12494/fd
total 0 lr-x------ 1 build build 64 Dec 2 15:35 0 -> pipe:[1841171217] l-wx------ 1 build build 64 Dec 2 15:35 1 -> pipe:[1841171218] l-wx------ 1 build build 64 Dec 2 15:35 2 -> pipe:[1841171219] l-wx------ 1 build build 64 Dec 2 15:35 3 -> /dev/null
ss -tn
State Recv-Q Send-Q Local Address:Port Peer Address:Port
ss -tln
State Recv-Q Send-Q Local Address:Port Peer Address:Port
ps xua | grep osmo
build 12605 0.0 0.0 21475109004 17884 ? S 15:35 0:00 ./src/sgsn/osmo-sgsn -c /build/tests/../doc/examples/osmo-sgsn/osmo-sgsn-accept-all.cfg build 12612 0.0 0.0 4280 700 ? S 15:35 0:00 /bin/sh -c ps xua | grep osmo build 12614 0.0 0.0 12784 932 ? S 15:35 0:00 grep osmo
Socket: in 1 tries, connected to 127.0.0.1:4245 <socket.socket fd=4, family=AddressFamily.AF_INET, type=SocketKind.SOCK_STREAM, proto=0, laddr=('127.0.0.1', 49560), raddr=('127.0.0.1', 4245)> (1 sockets open) Socket: closing 127.0.0.1:4245 <socket.socket fd=4, family=AddressFamily.AF_INET, type=SocketKind.SOCK_STREAM, proto=0, laddr=('127.0.0.1', 49560), raddr=('127.0.0.1', 4245)> (0 sockets open) Terminating took 0.897s ok
====================================================================== FAIL: testVtyShow (__main__.TestVTYGbproxy) ---------------------------------------------------------------------- Traceback (most recent call last): File "./vty_test_runner.py", line 98, in testVtyShow self.assertTrue(res.find('UDP bind') >= 0) AssertionError: False is not true
---------------------------------------------------------------------- Ran 11 tests in 15.835s
FAILED (failures=1) Makefile:711: recipe for target 'vty-python-test' failed make[7]: Leaving directory '/build/tests' make[7]: *** [vty-python-test] Error 1 Makefile:728: recipe for target 'vty-test' failed make[6]: Leaving directory '/build/tests' make[6]: *** [vty-test] Error 2 Makefile:705: recipe for target 'python-tests' failed make[5]: Leaving directory '/build/tests' make[5]: *** [python-tests] Error 2 Makefile:736: recipe for target 'check-local' failed make[4]: Leaving directory '/build/tests' make[4]: *** [check-local] Error 2 make[3]: *** [check-am] Error 2 Makefile:565: recipe for target 'check-am' failed make[3]: Leaving directory '/build/tests' make[2]: *** [check-recursive] Error 1 Makefile:417: recipe for target 'check-recursive' failed make[2]: Leaving directory '/build/tests' Makefile:461: recipe for target 'check-recursive' failed make[1]: Leaving directory '/build' make[1]: *** [check-recursive] Error 1 make: *** [check] Error 2 Makefile:752: recipe for target 'check' failed + cat-testlogs.sh Build step 'Execute shell' marked build as failure [WARNINGS]Skipping publisher since build result is FAILURE
Changes:
------------------------------------------ [...truncated 430.69 KB...] l-wx------ 1 build build 64 Dec 2 15:43 2 -> pipe:[207320049] l-wx------ 1 build build 64 Dec 2 15:43 3 -> /dev/null
ss -tn
State Recv-Q Send-Q Local Address:Port Peer Address:Port
ss -tln
State Recv-Q Send-Q Local Address:Port Peer Address:Port
ps xua | grep osmo
build 12538 0.0 0.0 21475042824 30372 ? R 15:43 0:00 ./src/sgsn/osmo-sgsn -c /build/tests/../doc/examples/osmo-sgsn/osmo-sgsn-accept-all.cfg build 12545 0.0 0.0 4280 752 ? S 15:43 0:00 /bin/sh -c ps xua | grep osmo build 12547 0.0 0.0 12784 1016 ? R 15:43 0:00 grep osmo
Socket: in 1 tries, connected to 127.0.0.1:4245 <socket.socket fd=4, family=AddressFamily.AF_INET, type=SocketKind.SOCK_STREAM, proto=0, laddr=('127.0.0.1', 39526), raddr=('127.0.0.1', 4245)> (1 sockets open) Socket: closing 127.0.0.1:4245 <socket.socket fd=4, family=AddressFamily.AF_INET, type=SocketKind.SOCK_STREAM, proto=0, laddr=('127.0.0.1', 39526), raddr=('127.0.0.1', 4245)> (0 sockets open) Terminating took 0.897s ok testVtyCDR (__main__.TestVTYSGSN) ... Launching: PWD=/build './src/sgsn/osmo-sgsn' '-c' '/build/tests/../doc/examples/osmo-sgsn/osmo-sgsn-accept-all.cfg'
ls -l /proc/12504/fd
total 0 lr-x------ 1 build build 64 Dec 2 15:43 0 -> pipe:[207320047] l-wx------ 1 build build 64 Dec 2 15:43 1 -> pipe:[207320048] l-wx------ 1 build build 64 Dec 2 15:43 2 -> pipe:[207320049] l-wx------ 1 build build 64 Dec 2 15:43 3 -> /dev/null
ss -tn
State Recv-Q Send-Q Local Address:Port Peer Address:Port
ss -tln
State Recv-Q Send-Q Local Address:Port Peer Address:Port
ps xua | grep osmo
build 12549 0.0 0.0 21475109004 28736 ? R 15:43 0:00 ./src/sgsn/osmo-sgsn -c /build/tests/../doc/examples/osmo-sgsn/osmo-sgsn-accept-all.cfg build 12556 0.0 0.0 4280 712 ? S 15:43 0:00 /bin/sh -c ps xua | grep osmo build 12558 0.0 0.0 12784 940 ? S 15:43 0:00 grep osmo
Socket: in 1 tries, connected to 127.0.0.1:4245 <socket.socket fd=4, family=AddressFamily.AF_INET, type=SocketKind.SOCK_STREAM, proto=0, laddr=('127.0.0.1', 39528), raddr=('127.0.0.1', 4245)> (1 sockets open) Socket: closing 127.0.0.1:4245 <socket.socket fd=4, family=AddressFamily.AF_INET, type=SocketKind.SOCK_STREAM, proto=0, laddr=('127.0.0.1', 39528), raddr=('127.0.0.1', 4245)> (0 sockets open) Terminating took 0.897s ok testVtyEasyAPN (__main__.TestVTYSGSN) ... Launching: PWD=/build './src/sgsn/osmo-sgsn' '-c' '/build/tests/../doc/examples/osmo-sgsn/osmo-sgsn-accept-all.cfg'
ls -l /proc/12504/fd
total 0 lr-x------ 1 build build 64 Dec 2 15:43 0 -> pipe:[207320047] l-wx------ 1 build build 64 Dec 2 15:43 1 -> pipe:[207320048] l-wx------ 1 build build 64 Dec 2 15:43 2 -> pipe:[207320049] l-wx------ 1 build build 64 Dec 2 15:43 3 -> /dev/null
ss -tn
State Recv-Q Send-Q Local Address:Port Peer Address:Port
ss -tln
State Recv-Q Send-Q Local Address:Port Peer Address:Port
ps xua | grep osmo
build 12560 0.0 0.0 21475109004 29408 ? R 15:43 0:00 ./src/sgsn/osmo-sgsn -c /build/tests/../doc/examples/osmo-sgsn/osmo-sgsn-accept-all.cfg build 12567 0.0 0.0 4280 756 ? S 15:43 0:00 /bin/sh -c ps xua | grep osmo build 12569 0.0 0.0 12784 980 ? S 15:43 0:00 grep osmo
Socket: in 1 tries, connected to 127.0.0.1:4245 <socket.socket fd=4, family=AddressFamily.AF_INET, type=SocketKind.SOCK_STREAM, proto=0, laddr=('127.0.0.1', 39530), raddr=('127.0.0.1', 4245)> (1 sockets open) Socket: closing 127.0.0.1:4245 <socket.socket fd=4, family=AddressFamily.AF_INET, type=SocketKind.SOCK_STREAM, proto=0, laddr=('127.0.0.1', 39530), raddr=('127.0.0.1', 4245)> (0 sockets open) Terminating took 0.897s ok testVtyGgsn (__main__.TestVTYSGSN) ... Launching: PWD=/build './src/sgsn/osmo-sgsn' '-c' '/build/tests/../doc/examples/osmo-sgsn/osmo-sgsn-accept-all.cfg'
ls -l /proc/12504/fd
total 0 lr-x------ 1 build build 64 Dec 2 15:43 0 -> pipe:[207320047] l-wx------ 1 build build 64 Dec 2 15:43 1 -> pipe:[207320048] l-wx------ 1 build build 64 Dec 2 15:43 2 -> pipe:[207320049] l-wx------ 1 build build 64 Dec 2 15:43 3 -> /dev/null
ss -tn
State Recv-Q Send-Q Local Address:Port Peer Address:Port
ss -tln
State Recv-Q Send-Q Local Address:Port Peer Address:Port
ps xua | grep osmo
build 12571 0.0 0.0 21475042824 38168 ? R 15:43 0:00 ./src/sgsn/osmo-sgsn -c /build/tests/../doc/examples/osmo-sgsn/osmo-sgsn-accept-all.cfg build 12578 0.0 0.0 4280 700 ? S 15:43 0:00 /bin/sh -c ps xua | grep osmo build 12580 0.0 0.0 12784 1028 ? S 15:43 0:00 grep osmo
Socket: in 1 tries, connected to 127.0.0.1:4245 <socket.socket fd=4, family=AddressFamily.AF_INET, type=SocketKind.SOCK_STREAM, proto=0, laddr=('127.0.0.1', 39532), raddr=('127.0.0.1', 4245)> (1 sockets open) Socket: closing 127.0.0.1:4245 <socket.socket fd=4, family=AddressFamily.AF_INET, type=SocketKind.SOCK_STREAM, proto=0, laddr=('127.0.0.1', 39532), raddr=('127.0.0.1', 4245)> (0 sockets open) Terminating took 0.897s ok testVtyShow (__main__.TestVTYSGSN) ... Launching: PWD=/build './src/sgsn/osmo-sgsn' '-c' '/build/tests/../doc/examples/osmo-sgsn/osmo-sgsn-accept-all.cfg'
ls -l /proc/12504/fd
total 0 lr-x------ 1 build build 64 Dec 2 15:43 0 -> pipe:[207320047] l-wx------ 1 build build 64 Dec 2 15:43 1 -> pipe:[207320048] l-wx------ 1 build build 64 Dec 2 15:43 2 -> pipe:[207320049] l-wx------ 1 build build 64 Dec 2 15:43 3 -> /dev/null
ss -tn
State Recv-Q Send-Q Local Address:Port Peer Address:Port
ss -tln
State Recv-Q Send-Q Local Address:Port Peer Address:Port
ps xua | grep osmo
build 12582 0.0 0.0 21474976644 29764 ? D 15:43 0:00 ./src/sgsn/osmo-sgsn -c /build/tests/../doc/examples/osmo-sgsn/osmo-sgsn-accept-all.cfg build 12589 0.0 0.0 4280 736 ? S 15:43 0:00 /bin/sh -c ps xua | grep osmo build 12591 0.0 0.0 12784 956 ? S 15:43 0:00 grep osmo
Socket: in 1 tries, connected to 127.0.0.1:4245 <socket.socket fd=4, family=AddressFamily.AF_INET, type=SocketKind.SOCK_STREAM, proto=0, laddr=('127.0.0.1', 39534), raddr=('127.0.0.1', 4245)> (1 sockets open) Socket: closing 127.0.0.1:4245 <socket.socket fd=4, family=AddressFamily.AF_INET, type=SocketKind.SOCK_STREAM, proto=0, laddr=('127.0.0.1', 39534), raddr=('127.0.0.1', 4245)> (0 sockets open) Terminating took 0.897s ok testVtySubscriber (__main__.TestVTYSGSN) ... Launching: PWD=/build './src/sgsn/osmo-sgsn' '-c' '/build/tests/../doc/examples/osmo-sgsn/osmo-sgsn-accept-all.cfg'
ls -l /proc/12504/fd
total 0 lr-x------ 1 build build 64 Dec 2 15:43 0 -> pipe:[207320047] l-wx------ 1 build build 64 Dec 2 15:43 1 -> pipe:[207320048] l-wx------ 1 build build 64 Dec 2 15:43 2 -> pipe:[207320049] l-wx------ 1 build build 64 Dec 2 15:43 3 -> /dev/null
ss -tn
State Recv-Q Send-Q Local Address:Port Peer Address:Port
ss -tln
State Recv-Q Send-Q Local Address:Port Peer Address:Port
ps xua | grep osmo
build 12593 0.0 0.0 21475042824 29872 ? R 15:43 0:00 ./src/sgsn/osmo-sgsn -c /build/tests/../doc/examples/osmo-sgsn/osmo-sgsn-accept-all.cfg build 12600 0.0 0.0 4280 716 ? S 15:43 0:00 /bin/sh -c ps xua | grep osmo build 12602 0.0 0.0 12784 984 ? S 15:43 0:00 grep osmo
Socket: in 1 tries, connected to 127.0.0.1:4245 <socket.socket fd=4, family=AddressFamily.AF_INET, type=SocketKind.SOCK_STREAM, proto=0, laddr=('127.0.0.1', 39538), raddr=('127.0.0.1', 4245)> (1 sockets open) Socket: closing 127.0.0.1:4245 <socket.socket fd=4, family=AddressFamily.AF_INET, type=SocketKind.SOCK_STREAM, proto=0, laddr=('127.0.0.1', 39538), raddr=('127.0.0.1', 4245)> (0 sockets open) Terminating took 0.897s ok testVtyTimers (__main__.TestVTYSGSN) ... Launching: PWD=/build './src/sgsn/osmo-sgsn' '-c' '/build/tests/../doc/examples/osmo-sgsn/osmo-sgsn-accept-all.cfg'
ls -l /proc/12504/fd
total 0 lr-x------ 1 build build 64 Dec 2 15:43 0 -> pipe:[207320047] l-wx------ 1 build build 64 Dec 2 15:43 1 -> pipe:[207320048] l-wx------ 1 build build 64 Dec 2 15:43 2 -> pipe:[207320049] l-wx------ 1 build build 64 Dec 2 15:43 3 -> /dev/null
ss -tn
State Recv-Q Send-Q Local Address:Port Peer Address:Port
ss -tln
State Recv-Q Send-Q Local Address:Port Peer Address:Port
ps xua | grep osmo
build 12604 0.0 0.0 21475109004 26460 ? S 15:43 0:00 ./src/sgsn/osmo-sgsn -c /build/tests/../doc/examples/osmo-sgsn/osmo-sgsn-accept-all.cfg build 12611 0.0 0.0 4280 712 ? S 15:43 0:00 /bin/sh -c ps xua | grep osmo build 12613 0.0 0.0 12784 948 ? S 15:43 0:00 grep osmo
Socket: in 1 tries, connected to 127.0.0.1:4245 <socket.socket fd=4, family=AddressFamily.AF_INET, type=SocketKind.SOCK_STREAM, proto=0, laddr=('127.0.0.1', 39540), raddr=('127.0.0.1', 4245)> (1 sockets open) Socket: closing 127.0.0.1:4245 <socket.socket fd=4, family=AddressFamily.AF_INET, type=SocketKind.SOCK_STREAM, proto=0, laddr=('127.0.0.1', 39540), raddr=('127.0.0.1', 4245)> (0 sockets open) Terminating took 0.897s ok testVtyTree (__main__.TestVTYSGSN) ... Launching: PWD=/build './src/sgsn/osmo-sgsn' '-c' '/build/tests/../doc/examples/osmo-sgsn/osmo-sgsn-accept-all.cfg'
ls -l /proc/12504/fd
total 0 lr-x------ 1 build build 64 Dec 2 15:43 0 -> pipe:[207320047] l-wx------ 1 build build 64 Dec 2 15:43 1 -> pipe:[207320048] l-wx------ 1 build build 64 Dec 2 15:43 2 -> pipe:[207320049] l-wx------ 1 build build 64 Dec 2 15:43 3 -> /dev/null
ss -tn
State Recv-Q Send-Q Local Address:Port Peer Address:Port
ss -tln
State Recv-Q Send-Q Local Address:Port Peer Address:Port
ps xua | grep osmo
build 12615 0.0 0.0 21475042824 34692 ? R 15:44 0:00 ./src/sgsn/osmo-sgsn -c /build/tests/../doc/examples/osmo-sgsn/osmo-sgsn-accept-all.cfg build 12622 0.0 0.0 4280 752 ? S 15:44 0:00 /bin/sh -c ps xua | grep osmo build 12624 0.0 0.0 12784 988 ? S 15:44 0:00 grep osmo
Socket: in 1 tries, connected to 127.0.0.1:4245 <socket.socket fd=4, family=AddressFamily.AF_INET, type=SocketKind.SOCK_STREAM, proto=0, laddr=('127.0.0.1', 39542), raddr=('127.0.0.1', 4245)> (1 sockets open) Socket: closing 127.0.0.1:4245 <socket.socket fd=4, family=AddressFamily.AF_INET, type=SocketKind.SOCK_STREAM, proto=0, laddr=('127.0.0.1', 39542), raddr=('127.0.0.1', 4245)> (0 sockets open) Terminating took 0.897s ok
====================================================================== FAIL: testVtyShow (__main__.TestVTYGbproxy) ---------------------------------------------------------------------- Traceback (most recent call last): File "./vty_test_runner.py", line 98, in testVtyShow self.assertTrue(res.find('UDP bind') >= 0) AssertionError: False is not true
---------------------------------------------------------------------- Ran 11 tests in 15.864s
FAILED (failures=1) Makefile:711: recipe for target 'vty-python-test' failed make[7]: Leaving directory '/build/tests' make[7]: *** [vty-python-test] Error 1 Makefile:728: recipe for target 'vty-test' failed make[6]: Leaving directory '/build/tests' make[6]: *** [vty-test] Error 2 Makefile:705: recipe for target 'python-tests' failed make[5]: Leaving directory '/build/tests' make[5]: *** [python-tests] Error 2 make[4]: *** [check-local] Error 2 Makefile:736: recipe for target 'check-local' failed make[4]: Leaving directory '/build/tests' make[3]: *** [check-am] Error 2 Makefile:565: recipe for target 'check-am' failed make[3]: Leaving directory '/build/tests' make[2]: *** [check-recursive] Error 1 Makefile:417: recipe for target 'check-recursive' failed make[2]: Leaving directory '/build/tests' make[1]: *** [check-recursive] Error 1 Makefile:461: recipe for target 'check-recursive' failed make[1]: Leaving directory '/build' Makefile:752: recipe for target 'check' failed make: *** [check] Error 2 + cat-testlogs.sh Build step 'Execute shell' marked build as failure [WARNINGS]Skipping publisher since build result is FAILURE
Changes:
------------------------------------------ [...truncated 427.42 KB...]
ss -tn
State Recv-Q Send-Q Local Address:Port Peer Address:Port
ss -tln
State Recv-Q Send-Q Local Address:Port Peer Address:Port LISTEN 0 10 127.0.0.1:4251 *:* LISTEN 0 10 127.0.0.1:4245 *:*
ps xua | grep osmo
build 12537 0.0 0.0 21475109004 19724 ? S 16:09 0:00 ./src/sgsn/osmo-sgsn -c /build/tests/../doc/examples/osmo-sgsn/osmo-sgsn-accept-all.cfg build 12544 0.0 0.0 4280 732 ? S 16:09 0:00 /bin/sh -c ps xua | grep osmo build 12546 0.0 0.0 12784 944 ? S 16:09 0:00 grep osmo
Socket: in 1 tries, connected to 127.0.0.1:4245 <socket.socket fd=4, family=AddressFamily.AF_INET, type=SocketKind.SOCK_STREAM, proto=0, laddr=('127.0.0.1', 39956), raddr=('127.0.0.1', 4245)> (1 sockets open) Socket: closing 127.0.0.1:4245 <socket.socket fd=4, family=AddressFamily.AF_INET, type=SocketKind.SOCK_STREAM, proto=0, laddr=('127.0.0.1', 39956), raddr=('127.0.0.1', 4245)> (0 sockets open) Terminating took 0.897s ok testVtyCDR (__main__.TestVTYSGSN) ... Launching: PWD=/build './src/sgsn/osmo-sgsn' '-c' '/build/tests/../doc/examples/osmo-sgsn/osmo-sgsn-accept-all.cfg'
ls -l /proc/12503/fd
total 0 lr-x------ 1 build build 64 Dec 2 16:09 0 -> pipe:[208083046] l-wx------ 1 build build 64 Dec 2 16:09 1 -> pipe:[208083047] l-wx------ 1 build build 64 Dec 2 16:09 2 -> pipe:[208083048] l-wx------ 1 build build 64 Dec 2 16:09 3 -> /dev/null
ss -tn
State Recv-Q Send-Q Local Address:Port Peer Address:Port
ss -tln
State Recv-Q Send-Q Local Address:Port Peer Address:Port
ps xua | grep osmo
build 12548 0.0 0.0 21475109004 19180 ? S 16:09 0:00 ./src/sgsn/osmo-sgsn -c /build/tests/../doc/examples/osmo-sgsn/osmo-sgsn-accept-all.cfg build 12555 0.0 0.0 4280 740 ? S 16:09 0:00 /bin/sh -c ps xua | grep osmo build 12557 0.0 0.0 12784 960 ? S 16:09 0:00 grep osmo
Socket: in 1 tries, connected to 127.0.0.1:4245 <socket.socket fd=4, family=AddressFamily.AF_INET, type=SocketKind.SOCK_STREAM, proto=0, laddr=('127.0.0.1', 39958), raddr=('127.0.0.1', 4245)> (1 sockets open) Socket: closing 127.0.0.1:4245 <socket.socket fd=4, family=AddressFamily.AF_INET, type=SocketKind.SOCK_STREAM, proto=0, laddr=('127.0.0.1', 39958), raddr=('127.0.0.1', 4245)> (0 sockets open) Terminating took 0.897s ok testVtyEasyAPN (__main__.TestVTYSGSN) ... Launching: PWD=/build './src/sgsn/osmo-sgsn' '-c' '/build/tests/../doc/examples/osmo-sgsn/osmo-sgsn-accept-all.cfg'
ls -l /proc/12503/fd
total 0 lr-x------ 1 build build 64 Dec 2 16:09 0 -> pipe:[208083046] l-wx------ 1 build build 64 Dec 2 16:09 1 -> pipe:[208083047] l-wx------ 1 build build 64 Dec 2 16:09 2 -> pipe:[208083048] l-wx------ 1 build build 64 Dec 2 16:09 3 -> /dev/null
ss -tn
State Recv-Q Send-Q Local Address:Port Peer Address:Port
ss -tln
State Recv-Q Send-Q Local Address:Port Peer Address:Port
ps xua | grep osmo
build 12559 0.0 0.0 21475109004 20032 ? S 16:09 0:00 ./src/sgsn/osmo-sgsn -c /build/tests/../doc/examples/osmo-sgsn/osmo-sgsn-accept-all.cfg build 12566 0.0 0.0 4280 756 ? S 16:09 0:00 /bin/sh -c ps xua | grep osmo build 12568 0.0 0.0 12784 968 ? S 16:09 0:00 grep osmo
Socket: in 1 tries, connected to 127.0.0.1:4245 <socket.socket fd=4, family=AddressFamily.AF_INET, type=SocketKind.SOCK_STREAM, proto=0, laddr=('127.0.0.1', 39960), raddr=('127.0.0.1', 4245)> (1 sockets open) Socket: closing 127.0.0.1:4245 <socket.socket fd=4, family=AddressFamily.AF_INET, type=SocketKind.SOCK_STREAM, proto=0, laddr=('127.0.0.1', 39960), raddr=('127.0.0.1', 4245)> (0 sockets open) Terminating took 0.897s ok testVtyGgsn (__main__.TestVTYSGSN) ... Launching: PWD=/build './src/sgsn/osmo-sgsn' '-c' '/build/tests/../doc/examples/osmo-sgsn/osmo-sgsn-accept-all.cfg'
ls -l /proc/12503/fd
total 0 lr-x------ 1 build build 64 Dec 2 16:09 0 -> pipe:[208083046] l-wx------ 1 build build 64 Dec 2 16:09 1 -> pipe:[208083047] l-wx------ 1 build build 64 Dec 2 16:09 2 -> pipe:[208083048] l-wx------ 1 build build 64 Dec 2 16:09 3 -> /dev/null
ss -tn
State Recv-Q Send-Q Local Address:Port Peer Address:Port
ss -tln
State Recv-Q Send-Q Local Address:Port Peer Address:Port
ps xua | grep osmo
build 12570 0.0 0.0 21475109004 25672 ? R 16:09 0:00 ./src/sgsn/osmo-sgsn -c /build/tests/../doc/examples/osmo-sgsn/osmo-sgsn-accept-all.cfg build 12577 0.0 0.0 4280 724 ? S 16:09 0:00 /bin/sh -c ps xua | grep osmo build 12579 0.0 0.0 12784 932 ? S 16:09 0:00 grep osmo
Socket: in 1 tries, connected to 127.0.0.1:4245 <socket.socket fd=4, family=AddressFamily.AF_INET, type=SocketKind.SOCK_STREAM, proto=0, laddr=('127.0.0.1', 39962), raddr=('127.0.0.1', 4245)> (1 sockets open) Socket: closing 127.0.0.1:4245 <socket.socket fd=4, family=AddressFamily.AF_INET, type=SocketKind.SOCK_STREAM, proto=0, laddr=('127.0.0.1', 39962), raddr=('127.0.0.1', 4245)> (0 sockets open) Terminating took 0.897s ok testVtyShow (__main__.TestVTYSGSN) ... Launching: PWD=/build './src/sgsn/osmo-sgsn' '-c' '/build/tests/../doc/examples/osmo-sgsn/osmo-sgsn-accept-all.cfg'
ls -l /proc/12503/fd
total 0 lr-x------ 1 build build 64 Dec 2 16:09 0 -> pipe:[208083046] l-wx------ 1 build build 64 Dec 2 16:09 1 -> pipe:[208083047] l-wx------ 1 build build 64 Dec 2 16:09 2 -> pipe:[208083048] l-wx------ 1 build build 64 Dec 2 16:09 3 -> /dev/null
ss -tn
State Recv-Q Send-Q Local Address:Port Peer Address:Port
ss -tln
State Recv-Q Send-Q Local Address:Port Peer Address:Port
ps xua | grep osmo
build 12581 0.0 0.0 21475109004 20100 ? S 16:09 0:00 ./src/sgsn/osmo-sgsn -c /build/tests/../doc/examples/osmo-sgsn/osmo-sgsn-accept-all.cfg build 12588 0.0 0.0 4280 704 ? S 16:09 0:00 /bin/sh -c ps xua | grep osmo build 12590 0.0 0.0 12784 972 ? S 16:09 0:00 grep osmo
Socket: in 1 tries, connected to 127.0.0.1:4245 <socket.socket fd=4, family=AddressFamily.AF_INET, type=SocketKind.SOCK_STREAM, proto=0, laddr=('127.0.0.1', 39964), raddr=('127.0.0.1', 4245)> (1 sockets open) Socket: closing 127.0.0.1:4245 <socket.socket fd=4, family=AddressFamily.AF_INET, type=SocketKind.SOCK_STREAM, proto=0, laddr=('127.0.0.1', 39964), raddr=('127.0.0.1', 4245)> (0 sockets open) Terminating took 0.897s ok testVtySubscriber (__main__.TestVTYSGSN) ... Launching: PWD=/build './src/sgsn/osmo-sgsn' '-c' '/build/tests/../doc/examples/osmo-sgsn/osmo-sgsn-accept-all.cfg'
ls -l /proc/12503/fd
total 0 lr-x------ 1 build build 64 Dec 2 16:09 0 -> pipe:[208083046] l-wx------ 1 build build 64 Dec 2 16:09 1 -> pipe:[208083047] l-wx------ 1 build build 64 Dec 2 16:09 2 -> pipe:[208083048] l-wx------ 1 build build 64 Dec 2 16:09 3 -> /dev/null
ss -tn
State Recv-Q Send-Q Local Address:Port Peer Address:Port
ss -tln
State Recv-Q Send-Q Local Address:Port Peer Address:Port
ps xua | grep osmo
build 12592 0.0 0.0 21475109004 19452 ? S 16:09 0:00 ./src/sgsn/osmo-sgsn -c /build/tests/../doc/examples/osmo-sgsn/osmo-sgsn-accept-all.cfg build 12599 0.0 0.0 4280 752 ? S 16:09 0:00 /bin/sh -c ps xua | grep osmo build 12601 0.0 0.0 12784 936 ? S 16:09 0:00 grep osmo
Socket: in 1 tries, connected to 127.0.0.1:4245 <socket.socket fd=4, family=AddressFamily.AF_INET, type=SocketKind.SOCK_STREAM, proto=0, laddr=('127.0.0.1', 39974), raddr=('127.0.0.1', 4245)> (1 sockets open) Socket: closing 127.0.0.1:4245 <socket.socket fd=4, family=AddressFamily.AF_INET, type=SocketKind.SOCK_STREAM, proto=0, laddr=('127.0.0.1', 39974), raddr=('127.0.0.1', 4245)> (0 sockets open) Terminating took 0.897s ok testVtyTimers (__main__.TestVTYSGSN) ... Launching: PWD=/build './src/sgsn/osmo-sgsn' '-c' '/build/tests/../doc/examples/osmo-sgsn/osmo-sgsn-accept-all.cfg'
ls -l /proc/12503/fd
total 0 lr-x------ 1 build build 64 Dec 2 16:09 0 -> pipe:[208083046] l-wx------ 1 build build 64 Dec 2 16:09 1 -> pipe:[208083047] l-wx------ 1 build build 64 Dec 2 16:09 2 -> pipe:[208083048] l-wx------ 1 build build 64 Dec 2 16:09 3 -> /dev/null
ss -tn
State Recv-Q Send-Q Local Address:Port Peer Address:Port
ss -tln
State Recv-Q Send-Q Local Address:Port Peer Address:Port
ps xua | grep osmo
build 12603 0.0 0.0 21475042824 21244 ? R 16:09 0:00 ./src/sgsn/osmo-sgsn -c /build/tests/../doc/examples/osmo-sgsn/osmo-sgsn-accept-all.cfg build 12610 0.0 0.0 4280 744 ? S 16:09 0:00 /bin/sh -c ps xua | grep osmo build 12612 0.0 0.0 12784 1020 ? S 16:09 0:00 grep osmo
Socket: in 1 tries, connected to 127.0.0.1:4245 <socket.socket fd=4, family=AddressFamily.AF_INET, type=SocketKind.SOCK_STREAM, proto=0, laddr=('127.0.0.1', 39980), raddr=('127.0.0.1', 4245)> (1 sockets open) Socket: closing 127.0.0.1:4245 <socket.socket fd=4, family=AddressFamily.AF_INET, type=SocketKind.SOCK_STREAM, proto=0, laddr=('127.0.0.1', 39980), raddr=('127.0.0.1', 4245)> (0 sockets open) Terminating took 0.897s ok testVtyTree (__main__.TestVTYSGSN) ... Launching: PWD=/build './src/sgsn/osmo-sgsn' '-c' '/build/tests/../doc/examples/osmo-sgsn/osmo-sgsn-accept-all.cfg'
ls -l /proc/12503/fd
total 0 lr-x------ 1 build build 64 Dec 2 16:09 0 -> pipe:[208083046] l-wx------ 1 build build 64 Dec 2 16:09 1 -> pipe:[208083047] l-wx------ 1 build build 64 Dec 2 16:09 2 -> pipe:[208083048] l-wx------ 1 build build 64 Dec 2 16:09 3 -> /dev/null
ss -tn
State Recv-Q Send-Q Local Address:Port Peer Address:Port
ss -tln
State Recv-Q Send-Q Local Address:Port Peer Address:Port
ps xua | grep osmo
build 12614 0.0 0.0 21475109004 18352 ? S 16:09 0:00 ./src/sgsn/osmo-sgsn -c /build/tests/../doc/examples/osmo-sgsn/osmo-sgsn-accept-all.cfg build 12621 0.0 0.0 4280 700 ? S 16:09 0:00 /bin/sh -c ps xua | grep osmo build 12623 0.0 0.0 12784 1028 ? S 16:09 0:00 grep osmo
Socket: in 1 tries, connected to 127.0.0.1:4245 <socket.socket fd=4, family=AddressFamily.AF_INET, type=SocketKind.SOCK_STREAM, proto=0, laddr=('127.0.0.1', 39982), raddr=('127.0.0.1', 4245)> (1 sockets open) Socket: closing 127.0.0.1:4245 <socket.socket fd=4, family=AddressFamily.AF_INET, type=SocketKind.SOCK_STREAM, proto=0, laddr=('127.0.0.1', 39982), raddr=('127.0.0.1', 4245)> (0 sockets open) Terminating took 0.897s ok
====================================================================== FAIL: testVtyShow (__main__.TestVTYGbproxy) ---------------------------------------------------------------------- Traceback (most recent call last): File "./vty_test_runner.py", line 98, in testVtyShow self.assertTrue(res.find('UDP bind') >= 0) AssertionError: False is not true
---------------------------------------------------------------------- Ran 11 tests in 15.860s
FAILED (failures=1) make[7]: *** [vty-python-test] Error 1 Makefile:711: recipe for target 'vty-python-test' failed make[7]: Leaving directory '/build/tests' Makefile:728: recipe for target 'vty-test' failed make[6]: Leaving directory '/build/tests' make[6]: *** [vty-test] Error 2 make[5]: *** [python-tests] Error 2 Makefile:705: recipe for target 'python-tests' failed make[5]: Leaving directory '/build/tests' Makefile:736: recipe for target 'check-local' failed make[4]: *** [check-local] Error 2 make[4]: Leaving directory '/build/tests' make[3]: *** [check-am] Error 2 Makefile:565: recipe for target 'check-am' failed make[3]: Leaving directory '/build/tests' Makefile:417: recipe for target 'check-recursive' failed make[2]: Leaving directory '/build/tests' make[2]: *** [check-recursive] Error 1 Makefile:461: recipe for target 'check-recursive' failed make[1]: *** [check-recursive] Error 1 make[1]: Leaving directory '/build' Makefile:752: recipe for target 'check' failed make: *** [check] Error 2 + cat-testlogs.sh Build step 'Execute shell' marked build as failure [WARNINGS]Skipping publisher since build result is FAILURE
Changes:
------------------------------------------ [...truncated 429.15 KB...] State Recv-Q Send-Q Local Address:Port Peer Address:Port LISTEN 0 10 127.0.0.1:4245 *:* LISTEN 0 10 127.0.0.1:4251 *:*
ps xua | grep osmo
build 12524 0.0 0.0 21475109000 17964 ? S 16:15 0:00 ./src/sgsn/osmo-sgsn -c /build/tests/../doc/examples/osmo-sgsn/osmo-sgsn-accept-all.cfg build 12531 0.0 0.0 4276 732 ? S 16:15 0:00 /bin/sh -c ps xua | grep osmo build 12533 0.0 0.0 12780 1012 ? S 16:15 0:00 grep osmo
Socket: in 1 tries, connected to 127.0.0.1:4245 <socket.socket fd=4, family=AddressFamily.AF_INET, type=SocketKind.SOCK_STREAM, proto=0, laddr=('127.0.0.1', 57924), raddr=('127.0.0.1', 4245)> (1 sockets open) Socket: closing 127.0.0.1:4245 <socket.socket fd=4, family=AddressFamily.AF_INET, type=SocketKind.SOCK_STREAM, proto=0, laddr=('127.0.0.1', 57924), raddr=('127.0.0.1', 4245)> (0 sockets open) Terminating took 0.897s ok testVtyCDR (__main__.TestVTYSGSN) ... Launching: PWD=/build './src/sgsn/osmo-sgsn' '-c' '/build/tests/../doc/examples/osmo-sgsn/osmo-sgsn-accept-all.cfg'
ls -l /proc/12490/fd
total 0 lr-x------ 1 build build 64 Dec 2 16:15 0 -> pipe:[3020028669] l-wx------ 1 build build 64 Dec 2 16:15 1 -> pipe:[3020028670] l-wx------ 1 build build 64 Dec 2 16:15 2 -> pipe:[3020028671] l-wx------ 1 build build 64 Dec 2 16:15 3 -> /dev/null
ss -tn
State Recv-Q Send-Q Local Address:Port Peer Address:Port
ss -tln
State Recv-Q Send-Q Local Address:Port Peer Address:Port
ps xua | grep osmo
build 12535 0.0 0.0 21475042820 20236 ? R 16:15 0:00 ./src/sgsn/osmo-sgsn -c /build/tests/../doc/examples/osmo-sgsn/osmo-sgsn-accept-all.cfg build 12542 0.0 0.0 4276 772 ? S 16:15 0:00 /bin/sh -c ps xua | grep osmo build 12544 0.0 0.0 12780 964 ? S 16:15 0:00 grep osmo
Socket: in 1 tries, connected to 127.0.0.1:4245 <socket.socket fd=4, family=AddressFamily.AF_INET, type=SocketKind.SOCK_STREAM, proto=0, laddr=('127.0.0.1', 57940), raddr=('127.0.0.1', 4245)> (1 sockets open) Socket: closing 127.0.0.1:4245 <socket.socket fd=4, family=AddressFamily.AF_INET, type=SocketKind.SOCK_STREAM, proto=0, laddr=('127.0.0.1', 57940), raddr=('127.0.0.1', 4245)> (0 sockets open) Terminating took 0.897s ok testVtyEasyAPN (__main__.TestVTYSGSN) ... Launching: PWD=/build './src/sgsn/osmo-sgsn' '-c' '/build/tests/../doc/examples/osmo-sgsn/osmo-sgsn-accept-all.cfg'
ls -l /proc/12490/fd
total 0 lr-x------ 1 build build 64 Dec 2 16:15 0 -> pipe:[3020028669] l-wx------ 1 build build 64 Dec 2 16:15 1 -> pipe:[3020028670] l-wx------ 1 build build 64 Dec 2 16:15 2 -> pipe:[3020028671] l-wx------ 1 build build 64 Dec 2 16:15 3 -> /dev/null
ss -tn
State Recv-Q Send-Q Local Address:Port Peer Address:Port
ss -tln
State Recv-Q Send-Q Local Address:Port Peer Address:Port
ps xua | grep osmo
build 12546 0.0 0.0 21475042820 18172 ? R 16:15 0:00 ./src/sgsn/osmo-sgsn -c /build/tests/../doc/examples/osmo-sgsn/osmo-sgsn-accept-all.cfg build 12553 0.0 0.0 4276 792 ? S 16:15 0:00 /bin/sh -c ps xua | grep osmo build 12555 0.0 0.0 12780 928 ? S 16:15 0:00 grep osmo
Socket: in 1 tries, connected to 127.0.0.1:4245 <socket.socket fd=4, family=AddressFamily.AF_INET, type=SocketKind.SOCK_STREAM, proto=0, laddr=('127.0.0.1', 57944), raddr=('127.0.0.1', 4245)> (1 sockets open) Socket: closing 127.0.0.1:4245 <socket.socket fd=4, family=AddressFamily.AF_INET, type=SocketKind.SOCK_STREAM, proto=0, laddr=('127.0.0.1', 57944), raddr=('127.0.0.1', 4245)> (0 sockets open) Terminating took 0.897s ok testVtyGgsn (__main__.TestVTYSGSN) ... Launching: PWD=/build './src/sgsn/osmo-sgsn' '-c' '/build/tests/../doc/examples/osmo-sgsn/osmo-sgsn-accept-all.cfg'
ls -l /proc/12490/fd
total 0 lr-x------ 1 build build 64 Dec 2 16:15 0 -> pipe:[3020028669] l-wx------ 1 build build 64 Dec 2 16:15 1 -> pipe:[3020028670] l-wx------ 1 build build 64 Dec 2 16:15 2 -> pipe:[3020028671] l-wx------ 1 build build 64 Dec 2 16:15 3 -> /dev/null
ss -tn
State Recv-Q Send-Q Local Address:Port Peer Address:Port
ss -tln
State Recv-Q Send-Q Local Address:Port Peer Address:Port
ps xua | grep osmo
build 12557 0.0 0.0 21474972380 14368 ? R 16:15 0:00 ./src/sgsn/osmo-sgsn -c /build/tests/../doc/examples/osmo-sgsn/osmo-sgsn-accept-all.cfg build 12564 0.0 0.0 4276 756 ? S 16:15 0:00 /bin/sh -c ps xua | grep osmo build 12566 0.0 0.0 12780 952 ? S 16:15 0:00 grep osmo
Connecting socket failed, retrying... Socket: in 2 tries, connected to 127.0.0.1:4245 <socket.socket fd=5, family=AddressFamily.AF_INET, type=SocketKind.SOCK_STREAM, proto=0, laddr=('127.0.0.1', 57950), raddr=('127.0.0.1', 4245)> (1 sockets open) Socket: closing 127.0.0.1:4245 <socket.socket fd=5, family=AddressFamily.AF_INET, type=SocketKind.SOCK_STREAM, proto=0, laddr=('127.0.0.1', 57950), raddr=('127.0.0.1', 4245)> (0 sockets open) Terminating took 0.897s ok testVtyShow (__main__.TestVTYSGSN) ... Launching: PWD=/build './src/sgsn/osmo-sgsn' '-c' '/build/tests/../doc/examples/osmo-sgsn/osmo-sgsn-accept-all.cfg'
ls -l /proc/12490/fd
total 0 lr-x------ 1 build build 64 Dec 2 16:15 0 -> pipe:[3020028669] l-wx------ 1 build build 64 Dec 2 16:15 1 -> pipe:[3020028670] l-wx------ 1 build build 64 Dec 2 16:15 2 -> pipe:[3020028671] l-wx------ 1 build build 64 Dec 2 16:15 3 -> /dev/null
ss -tn
State Recv-Q Send-Q Local Address:Port Peer Address:Port
ss -tln
State Recv-Q Send-Q Local Address:Port Peer Address:Port LISTEN 0 10 127.0.0.1:4245 *:* LISTEN 0 10 127.0.0.1:4251 *:*
ps xua | grep osmo
build 12568 0.0 0.0 21475109000 17792 ? S 16:15 0:00 ./src/sgsn/osmo-sgsn -c /build/tests/../doc/examples/osmo-sgsn/osmo-sgsn-accept-all.cfg build 12575 0.0 0.0 4276 748 ? S 16:15 0:00 /bin/sh -c ps xua | grep osmo build 12577 0.0 0.0 12780 952 ? S 16:15 0:00 grep osmo
Socket: in 1 tries, connected to 127.0.0.1:4245 <socket.socket fd=4, family=AddressFamily.AF_INET, type=SocketKind.SOCK_STREAM, proto=0, laddr=('127.0.0.1', 57974), raddr=('127.0.0.1', 4245)> (1 sockets open) Socket: closing 127.0.0.1:4245 <socket.socket fd=4, family=AddressFamily.AF_INET, type=SocketKind.SOCK_STREAM, proto=0, laddr=('127.0.0.1', 57974), raddr=('127.0.0.1', 4245)> (0 sockets open) Terminating took 0.897s ok testVtySubscriber (__main__.TestVTYSGSN) ... Launching: PWD=/build './src/sgsn/osmo-sgsn' '-c' '/build/tests/../doc/examples/osmo-sgsn/osmo-sgsn-accept-all.cfg'
ls -l /proc/12490/fd
total 0 lr-x------ 1 build build 64 Dec 2 16:15 0 -> pipe:[3020028669] l-wx------ 1 build build 64 Dec 2 16:15 1 -> pipe:[3020028670] l-wx------ 1 build build 64 Dec 2 16:15 2 -> pipe:[3020028671] l-wx------ 1 build build 64 Dec 2 16:15 3 -> /dev/null
ss -tn
State Recv-Q Send-Q Local Address:Port Peer Address:Port
ss -tln
State Recv-Q Send-Q Local Address:Port Peer Address:Port LISTEN 0 10 127.0.0.1:4245 *:* LISTEN 0 10 127.0.0.1:4251 *:*
ps xua | grep osmo
build 12579 0.0 0.0 21475109000 17788 ? S 16:15 0:00 ./src/sgsn/osmo-sgsn -c /build/tests/../doc/examples/osmo-sgsn/osmo-sgsn-accept-all.cfg build 12586 0.0 0.0 4276 792 ? S 16:15 0:00 /bin/sh -c ps xua | grep osmo build 12588 0.0 0.0 4276 88 ? R 16:15 0:00 /bin/sh -c ps xua | grep osmo
Socket: in 1 tries, connected to 127.0.0.1:4245 <socket.socket fd=4, family=AddressFamily.AF_INET, type=SocketKind.SOCK_STREAM, proto=0, laddr=('127.0.0.1', 58024), raddr=('127.0.0.1', 4245)> (1 sockets open) Socket: closing 127.0.0.1:4245 <socket.socket fd=4, family=AddressFamily.AF_INET, type=SocketKind.SOCK_STREAM, proto=0, laddr=('127.0.0.1', 58024), raddr=('127.0.0.1', 4245)> (0 sockets open) Terminating took 0.897s ok testVtyTimers (__main__.TestVTYSGSN) ... Launching: PWD=/build './src/sgsn/osmo-sgsn' '-c' '/build/tests/../doc/examples/osmo-sgsn/osmo-sgsn-accept-all.cfg'
ls -l /proc/12490/fd
total 0 lr-x------ 1 build build 64 Dec 2 16:15 0 -> pipe:[3020028669] l-wx------ 1 build build 64 Dec 2 16:15 1 -> pipe:[3020028670] l-wx------ 1 build build 64 Dec 2 16:15 2 -> pipe:[3020028671] l-wx------ 1 build build 64 Dec 2 16:15 3 -> /dev/null
ss -tn
State Recv-Q Send-Q Local Address:Port Peer Address:Port
ss -tln
State Recv-Q Send-Q Local Address:Port Peer Address:Port
ps xua | grep osmo
build 12590 0.0 0.0 21474972412 17148 ? R 16:15 0:00 ./src/sgsn/osmo-sgsn -c /build/tests/../doc/examples/osmo-sgsn/osmo-sgsn-accept-all.cfg build 12597 0.0 0.0 4276 704 ? S 16:15 0:00 /bin/sh -c ps xua | grep osmo build 12599 0.0 0.0 12780 1008 ? S 16:15 0:00 grep osmo
Socket: in 1 tries, connected to 127.0.0.1:4245 <socket.socket fd=4, family=AddressFamily.AF_INET, type=SocketKind.SOCK_STREAM, proto=0, laddr=('127.0.0.1', 58038), raddr=('127.0.0.1', 4245)> (1 sockets open) Socket: closing 127.0.0.1:4245 <socket.socket fd=4, family=AddressFamily.AF_INET, type=SocketKind.SOCK_STREAM, proto=0, laddr=('127.0.0.1', 58038), raddr=('127.0.0.1', 4245)> (0 sockets open) Terminating took 0.897s ok testVtyTree (__main__.TestVTYSGSN) ... Launching: PWD=/build './src/sgsn/osmo-sgsn' '-c' '/build/tests/../doc/examples/osmo-sgsn/osmo-sgsn-accept-all.cfg'
ls -l /proc/12490/fd
total 0 lr-x------ 1 build build 64 Dec 2 16:15 0 -> pipe:[3020028669] l-wx------ 1 build build 64 Dec 2 16:15 1 -> pipe:[3020028670] l-wx------ 1 build build 64 Dec 2 16:15 2 -> pipe:[3020028671] l-wx------ 1 build build 64 Dec 2 16:15 3 -> /dev/null
ss -tn
State Recv-Q Send-Q Local Address:Port Peer Address:Port
ss -tln
State Recv-Q Send-Q Local Address:Port Peer Address:Port LISTEN 0 10 127.0.0.1:4245 *:* LISTEN 0 10 127.0.0.1:4251 *:*
ps xua | grep osmo
build 12601 0.0 0.0 21474976640 17820 ? D 16:15 0:00 ./src/sgsn/osmo-sgsn -c /build/tests/../doc/examples/osmo-sgsn/osmo-sgsn-accept-all.cfg build 12608 0.0 0.0 4276 788 ? S 16:15 0:00 /bin/sh -c ps xua | grep osmo build 12610 0.0 0.0 4276 84 ? R 16:15 0:00 /bin/sh -c ps xua | grep osmo
Socket: in 1 tries, connected to 127.0.0.1:4245 <socket.socket fd=4, family=AddressFamily.AF_INET, type=SocketKind.SOCK_STREAM, proto=0, laddr=('127.0.0.1', 58040), raddr=('127.0.0.1', 4245)> (1 sockets open) Socket: closing 127.0.0.1:4245 <socket.socket fd=4, family=AddressFamily.AF_INET, type=SocketKind.SOCK_STREAM, proto=0, laddr=('127.0.0.1', 58040), raddr=('127.0.0.1', 4245)> (0 sockets open) Terminating took 0.897s ok
====================================================================== FAIL: testVtyShow (__main__.TestVTYGbproxy) ---------------------------------------------------------------------- Traceback (most recent call last): File "./vty_test_runner.py", line 98, in testVtyShow self.assertTrue(res.find('UDP bind') >= 0) AssertionError: False is not true
---------------------------------------------------------------------- Ran 11 tests in 16.230s
FAILED (failures=1) make[7]: *** [vty-python-test] Error 1 Makefile:711: recipe for target 'vty-python-test' failed make[7]: Leaving directory '/build/tests' Makefile:728: recipe for target 'vty-test' failed make[6]: Leaving directory '/build/tests' make[6]: *** [vty-test] Error 2 Makefile:705: recipe for target 'python-tests' failed make[5]: Leaving directory '/build/tests' make[5]: *** [python-tests] Error 2 Makefile:736: recipe for target 'check-local' failed make[4]: *** [check-local] Error 2 make[4]: Leaving directory '/build/tests' make[3]: *** [check-am] Error 2 Makefile:565: recipe for target 'check-am' failed make[3]: Leaving directory '/build/tests' Makefile:417: recipe for target 'check-recursive' failed make[2]: Leaving directory '/build/tests' make[2]: *** [check-recursive] Error 1 make[1]: *** [check-recursive] Error 1 Makefile:461: recipe for target 'check-recursive' failed make[1]: Leaving directory '/build' Makefile:752: recipe for target 'check' failed make: *** [check] Error 2 + cat-testlogs.sh Build step 'Execute shell' marked build as failure [WARNINGS]Skipping publisher since build result is FAILURE
Changes:
------------------------------------------ [...truncated 429.84 KB...]
ss -tn
State Recv-Q Send-Q Local Address:Port Peer Address:Port
ss -tln
State Recv-Q Send-Q Local Address:Port Peer Address:Port
ps xua | grep osmo
build 12543 0.0 0.0 21474972416 16992 ? R 16:22 0:00 ./src/sgsn/osmo-sgsn -c /build/tests/../doc/examples/osmo-sgsn/osmo-sgsn-accept-all.cfg build 12550 0.0 0.0 4280 732 ? S 16:22 0:00 /bin/sh -c ps xua | grep osmo build 12552 0.0 0.0 12784 944 ? S 16:22 0:00 grep osmo
Socket: in 1 tries, connected to 127.0.0.1:4245 <socket.socket fd=4, family=AddressFamily.AF_INET, type=SocketKind.SOCK_STREAM, proto=0, laddr=('127.0.0.1', 41670), raddr=('127.0.0.1', 4245)> (1 sockets open) Socket: closing 127.0.0.1:4245 <socket.socket fd=4, family=AddressFamily.AF_INET, type=SocketKind.SOCK_STREAM, proto=0, laddr=('127.0.0.1', 41670), raddr=('127.0.0.1', 4245)> (0 sockets open) Terminating took 0.897s ok testVtyCDR (__main__.TestVTYSGSN) ... Launching: PWD=/build './src/sgsn/osmo-sgsn' '-c' '/build/tests/../doc/examples/osmo-sgsn/osmo-sgsn-accept-all.cfg'
ls -l /proc/12509/fd
total 0 lr-x------ 1 build build 64 Dec 2 16:22 0 -> pipe:[208927566] l-wx------ 1 build build 64 Dec 2 16:22 1 -> pipe:[208927567] l-wx------ 1 build build 64 Dec 2 16:22 2 -> pipe:[208927568] l-wx------ 1 build build 64 Dec 2 16:22 3 -> /dev/null
ss -tn
State Recv-Q Send-Q Local Address:Port Peer Address:Port
ss -tln
State Recv-Q Send-Q Local Address:Port Peer Address:Port
ps xua | grep osmo
build 12554 0.0 0.0 21475109004 18128 ? S 16:22 0:00 ./src/sgsn/osmo-sgsn -c /build/tests/../doc/examples/osmo-sgsn/osmo-sgsn-accept-all.cfg build 12561 0.0 0.0 4280 792 ? S 16:22 0:00 /bin/sh -c ps xua | grep osmo build 12563 0.0 0.0 12784 968 ? S 16:22 0:00 grep osmo
Socket: in 1 tries, connected to 127.0.0.1:4245 <socket.socket fd=4, family=AddressFamily.AF_INET, type=SocketKind.SOCK_STREAM, proto=0, laddr=('127.0.0.1', 41672), raddr=('127.0.0.1', 4245)> (1 sockets open) Socket: closing 127.0.0.1:4245 <socket.socket fd=4, family=AddressFamily.AF_INET, type=SocketKind.SOCK_STREAM, proto=0, laddr=('127.0.0.1', 41672), raddr=('127.0.0.1', 4245)> (0 sockets open) Terminating took 0.897s ok testVtyEasyAPN (__main__.TestVTYSGSN) ... Launching: PWD=/build './src/sgsn/osmo-sgsn' '-c' '/build/tests/../doc/examples/osmo-sgsn/osmo-sgsn-accept-all.cfg'
ls -l /proc/12509/fd
total 0 lr-x------ 1 build build 64 Dec 2 16:22 0 -> pipe:[208927566] l-wx------ 1 build build 64 Dec 2 16:22 1 -> pipe:[208927567] l-wx------ 1 build build 64 Dec 2 16:22 2 -> pipe:[208927568] l-wx------ 1 build build 64 Dec 2 16:22 3 -> /dev/null
ss -tn
State Recv-Q Send-Q Local Address:Port Peer Address:Port
ss -tln
State Recv-Q Send-Q Local Address:Port Peer Address:Port
ps xua | grep osmo
build 12565 0.0 0.0 21475109004 21112 ? S 16:22 0:00 ./src/sgsn/osmo-sgsn -c /build/tests/../doc/examples/osmo-sgsn/osmo-sgsn-accept-all.cfg build 12572 0.0 0.0 4280 736 ? S 16:22 0:00 /bin/sh -c ps xua | grep osmo build 12574 0.0 0.0 12784 972 ? S 16:22 0:00 grep osmo
Socket: in 1 tries, connected to 127.0.0.1:4245 <socket.socket fd=4, family=AddressFamily.AF_INET, type=SocketKind.SOCK_STREAM, proto=0, laddr=('127.0.0.1', 41674), raddr=('127.0.0.1', 4245)> (1 sockets open) Socket: closing 127.0.0.1:4245 <socket.socket fd=4, family=AddressFamily.AF_INET, type=SocketKind.SOCK_STREAM, proto=0, laddr=('127.0.0.1', 41674), raddr=('127.0.0.1', 4245)> (0 sockets open) Terminating took 0.897s ok testVtyGgsn (__main__.TestVTYSGSN) ... Launching: PWD=/build './src/sgsn/osmo-sgsn' '-c' '/build/tests/../doc/examples/osmo-sgsn/osmo-sgsn-accept-all.cfg'
ls -l /proc/12509/fd
total 0 lr-x------ 1 build build 64 Dec 2 16:22 0 -> pipe:[208927566] l-wx------ 1 build build 64 Dec 2 16:22 1 -> pipe:[208927567] l-wx------ 1 build build 64 Dec 2 16:22 2 -> pipe:[208927568] l-wx------ 1 build build 64 Dec 2 16:22 3 -> /dev/null
ss -tn
State Recv-Q Send-Q Local Address:Port Peer Address:Port
ss -tln
State Recv-Q Send-Q Local Address:Port Peer Address:Port LISTEN 0 10 127.0.0.1:4251 *:* LISTEN 0 10 127.0.0.1:4245 *:*
ps xua | grep osmo
build 12576 0.0 0.0 21475109004 21560 ? S 16:22 0:00 ./src/sgsn/osmo-sgsn -c /build/tests/../doc/examples/osmo-sgsn/osmo-sgsn-accept-all.cfg build 12583 0.0 0.0 4280 768 ? S 16:22 0:00 /bin/sh -c ps xua | grep osmo build 12585 0.0 0.0 4280 84 ? R 16:22 0:00 /bin/sh -c ps xua | grep osmo
Socket: in 1 tries, connected to 127.0.0.1:4245 <socket.socket fd=4, family=AddressFamily.AF_INET, type=SocketKind.SOCK_STREAM, proto=0, laddr=('127.0.0.1', 41676), raddr=('127.0.0.1', 4245)> (1 sockets open) Socket: closing 127.0.0.1:4245 <socket.socket fd=4, family=AddressFamily.AF_INET, type=SocketKind.SOCK_STREAM, proto=0, laddr=('127.0.0.1', 41676), raddr=('127.0.0.1', 4245)> (0 sockets open) Terminating took 0.897s ok testVtyShow (__main__.TestVTYSGSN) ... Launching: PWD=/build './src/sgsn/osmo-sgsn' '-c' '/build/tests/../doc/examples/osmo-sgsn/osmo-sgsn-accept-all.cfg'
ls -l /proc/12509/fd
total 0 lr-x------ 1 build build 64 Dec 2 16:22 0 -> pipe:[208927566] l-wx------ 1 build build 64 Dec 2 16:22 1 -> pipe:[208927567] l-wx------ 1 build build 64 Dec 2 16:22 2 -> pipe:[208927568] l-wx------ 1 build build 64 Dec 2 16:22 3 -> /dev/null
ss -tn
State Recv-Q Send-Q Local Address:Port Peer Address:Port
ss -tln
State Recv-Q Send-Q Local Address:Port Peer Address:Port
ps xua | grep osmo
build 12587 0.0 0.0 21475109004 21308 ? R 16:22 0:00 ./src/sgsn/osmo-sgsn -c /build/tests/../doc/examples/osmo-sgsn/osmo-sgsn-accept-all.cfg build 12594 0.0 0.0 4280 748 ? S 16:22 0:00 /bin/sh -c ps xua | grep osmo build 12596 0.0 0.0 12784 968 ? S 16:22 0:00 grep osmo
Socket: in 1 tries, connected to 127.0.0.1:4245 <socket.socket fd=4, family=AddressFamily.AF_INET, type=SocketKind.SOCK_STREAM, proto=0, laddr=('127.0.0.1', 41680), raddr=('127.0.0.1', 4245)> (1 sockets open) Socket: closing 127.0.0.1:4245 <socket.socket fd=4, family=AddressFamily.AF_INET, type=SocketKind.SOCK_STREAM, proto=0, laddr=('127.0.0.1', 41680), raddr=('127.0.0.1', 4245)> (0 sockets open) Terminating took 0.897s ok testVtySubscriber (__main__.TestVTYSGSN) ... Launching: PWD=/build './src/sgsn/osmo-sgsn' '-c' '/build/tests/../doc/examples/osmo-sgsn/osmo-sgsn-accept-all.cfg'
ls -l /proc/12509/fd
total 0 lr-x------ 1 build build 64 Dec 2 16:22 0 -> pipe:[208927566] l-wx------ 1 build build 64 Dec 2 16:22 1 -> pipe:[208927567] l-wx------ 1 build build 64 Dec 2 16:22 2 -> pipe:[208927568] l-wx------ 1 build build 64 Dec 2 16:22 3 -> /dev/null
ss -tn
State Recv-Q Send-Q Local Address:Port Peer Address:Port
ss -tln
State Recv-Q Send-Q Local Address:Port Peer Address:Port
ps xua | grep osmo
build 12598 0.0 0.0 21475042824 26132 ? R 16:22 0:00 ./src/sgsn/osmo-sgsn -c /build/tests/../doc/examples/osmo-sgsn/osmo-sgsn-accept-all.cfg build 12605 0.0 0.0 4280 716 ? S 16:22 0:00 /bin/sh -c ps xua | grep osmo build 12607 0.0 0.0 12784 964 ? S 16:22 0:00 grep osmo
Socket: in 1 tries, connected to 127.0.0.1:4245 <socket.socket fd=4, family=AddressFamily.AF_INET, type=SocketKind.SOCK_STREAM, proto=0, laddr=('127.0.0.1', 41682), raddr=('127.0.0.1', 4245)> (1 sockets open) Socket: closing 127.0.0.1:4245 <socket.socket fd=4, family=AddressFamily.AF_INET, type=SocketKind.SOCK_STREAM, proto=0, laddr=('127.0.0.1', 41682), raddr=('127.0.0.1', 4245)> (0 sockets open) Terminating took 0.897s ok testVtyTimers (__main__.TestVTYSGSN) ... Launching: PWD=/build './src/sgsn/osmo-sgsn' '-c' '/build/tests/../doc/examples/osmo-sgsn/osmo-sgsn-accept-all.cfg'
ls -l /proc/12509/fd
total 0 lr-x------ 1 build build 64 Dec 2 16:22 0 -> pipe:[208927566] l-wx------ 1 build build 64 Dec 2 16:22 1 -> pipe:[208927567] l-wx------ 1 build build 64 Dec 2 16:22 2 -> pipe:[208927568] l-wx------ 1 build build 64 Dec 2 16:22 3 -> /dev/null
ss -tn
State Recv-Q Send-Q Local Address:Port Peer Address:Port
ss -tln
State Recv-Q Send-Q Local Address:Port Peer Address:Port
ps xua | grep osmo
build 12609 0.0 0.0 21475109004 20636 ? S 16:22 0:00 ./src/sgsn/osmo-sgsn -c /build/tests/../doc/examples/osmo-sgsn/osmo-sgsn-accept-all.cfg build 12616 0.0 0.0 4280 748 ? S 16:22 0:00 /bin/sh -c ps xua | grep osmo build 12618 0.0 0.0 12784 968 ? S 16:22 0:00 grep osmo
Socket: in 1 tries, connected to 127.0.0.1:4245 <socket.socket fd=4, family=AddressFamily.AF_INET, type=SocketKind.SOCK_STREAM, proto=0, laddr=('127.0.0.1', 41684), raddr=('127.0.0.1', 4245)> (1 sockets open) Socket: closing 127.0.0.1:4245 <socket.socket fd=4, family=AddressFamily.AF_INET, type=SocketKind.SOCK_STREAM, proto=0, laddr=('127.0.0.1', 41684), raddr=('127.0.0.1', 4245)> (0 sockets open) Terminating took 0.897s ok testVtyTree (__main__.TestVTYSGSN) ... Launching: PWD=/build './src/sgsn/osmo-sgsn' '-c' '/build/tests/../doc/examples/osmo-sgsn/osmo-sgsn-accept-all.cfg'
ls -l /proc/12509/fd
total 0 lr-x------ 1 build build 64 Dec 2 16:22 0 -> pipe:[208927566] l-wx------ 1 build build 64 Dec 2 16:22 1 -> pipe:[208927567] l-wx------ 1 build build 64 Dec 2 16:22 2 -> pipe:[208927568] l-wx------ 1 build build 64 Dec 2 16:22 3 -> /dev/null
ss -tn
State Recv-Q Send-Q Local Address:Port Peer Address:Port
ss -tln
State Recv-Q Send-Q Local Address:Port Peer Address:Port
ps xua | grep osmo
build 12620 0.0 0.0 21475109004 27836 ? R 16:22 0:00 ./src/sgsn/osmo-sgsn -c /build/tests/../doc/examples/osmo-sgsn/osmo-sgsn-accept-all.cfg build 12627 0.0 0.0 4280 704 ? S 16:22 0:00 /bin/sh -c ps xua | grep osmo build 12629 0.0 0.0 12784 976 ? S 16:22 0:00 grep osmo
Socket: in 1 tries, connected to 127.0.0.1:4245 <socket.socket fd=4, family=AddressFamily.AF_INET, type=SocketKind.SOCK_STREAM, proto=0, laddr=('127.0.0.1', 41686), raddr=('127.0.0.1', 4245)> (1 sockets open) Socket: closing 127.0.0.1:4245 <socket.socket fd=4, family=AddressFamily.AF_INET, type=SocketKind.SOCK_STREAM, proto=0, laddr=('127.0.0.1', 41686), raddr=('127.0.0.1', 4245)> (0 sockets open) Terminating took 0.897s ok
====================================================================== FAIL: testVtyShow (__main__.TestVTYGbproxy) ---------------------------------------------------------------------- Traceback (most recent call last): File "./vty_test_runner.py", line 98, in testVtyShow self.assertTrue(res.find('UDP bind') >= 0) AssertionError: False is not true
---------------------------------------------------------------------- Ran 11 tests in 15.890s
FAILED (failures=1) make[7]: *** [vty-python-test] Error 1 Makefile:711: recipe for target 'vty-python-test' failed make[7]: Leaving directory '/build/tests' Makefile:728: recipe for target 'vty-test' failed make[6]: Leaving directory '/build/tests' make[6]: *** [vty-test] Error 2 Makefile:705: recipe for target 'python-tests' failed make[5]: Leaving directory '/build/tests' make[5]: *** [python-tests] Error 2 Makefile:736: recipe for target 'check-local' failed make[4]: *** [check-local] Error 2 make[4]: Leaving directory '/build/tests' Makefile:565: recipe for target 'check-am' failed make[3]: Leaving directory '/build/tests' make[3]: *** [check-am] Error 2 make[2]: *** [check-recursive] Error 1 Makefile:417: recipe for target 'check-recursive' failed make[2]: Leaving directory '/build/tests' Makefile:461: recipe for target 'check-recursive' failed make[1]: Leaving directory '/build' make[1]: *** [check-recursive] Error 1 make: *** [check] Error 2 Makefile:752: recipe for target 'check' failed + cat-testlogs.sh Build step 'Execute shell' marked build as failure [WARNINGS]Skipping publisher since build result is FAILURE
Changes:
------------------------------------------ [...truncated 427.99 KB...]
ss -tn
State Recv-Q Send-Q Local Address:Port Peer Address:Port
ss -tln
State Recv-Q Send-Q Local Address:Port Peer Address:Port LISTEN 0 10 127.0.0.1:4245 *:* LISTEN 0 10 127.0.0.1:4251 *:*
ps xua | grep osmo
build 12315 0.0 0.0 21475109004 18112 ? S 20:06 0:00 ./src/sgsn/osmo-sgsn -c /build/tests/../doc/examples/osmo-sgsn/osmo-sgsn-accept-all.cfg build 12322 0.0 0.0 4280 712 ? S 20:06 0:00 /bin/sh -c ps xua | grep osmo build 12324 0.0 0.0 12784 940 ? S 20:06 0:00 grep osmo
Socket: in 1 tries, connected to 127.0.0.1:4245 <socket.socket fd=4, family=AddressFamily.AF_INET, type=SocketKind.SOCK_STREAM, proto=0, laddr=('127.0.0.1', 44696), raddr=('127.0.0.1', 4245)> (1 sockets open) Socket: closing 127.0.0.1:4245 <socket.socket fd=4, family=AddressFamily.AF_INET, type=SocketKind.SOCK_STREAM, proto=0, laddr=('127.0.0.1', 44696), raddr=('127.0.0.1', 4245)> (0 sockets open) Terminating took 0.897s ok testVtyCDR (__main__.TestVTYSGSN) ... Launching: PWD=/build './src/sgsn/osmo-sgsn' '-c' '/build/tests/../doc/examples/osmo-sgsn/osmo-sgsn-accept-all.cfg'
ls -l /proc/12281/fd
total 0 lr-x------ 1 build build 64 Dec 2 20:06 0 -> pipe:[211823817] l-wx------ 1 build build 64 Dec 2 20:06 1 -> pipe:[211823818] l-wx------ 1 build build 64 Dec 2 20:06 2 -> pipe:[211823819] l-wx------ 1 build build 64 Dec 2 20:06 3 -> /dev/null
ss -tn
State Recv-Q Send-Q Local Address:Port Peer Address:Port
ss -tln
State Recv-Q Send-Q Local Address:Port Peer Address:Port
ps xua | grep osmo
build 12326 0.0 0.0 21475109004 23048 ? R 20:06 0:00 ./src/sgsn/osmo-sgsn -c /build/tests/../doc/examples/osmo-sgsn/osmo-sgsn-accept-all.cfg build 12333 0.0 0.0 4280 708 ? S 20:06 0:00 /bin/sh -c ps xua | grep osmo build 12335 0.0 0.0 12784 928 ? S 20:06 0:00 grep osmo
Socket: in 1 tries, connected to 127.0.0.1:4245 <socket.socket fd=4, family=AddressFamily.AF_INET, type=SocketKind.SOCK_STREAM, proto=0, laddr=('127.0.0.1', 44698), raddr=('127.0.0.1', 4245)> (1 sockets open) Socket: closing 127.0.0.1:4245 <socket.socket fd=4, family=AddressFamily.AF_INET, type=SocketKind.SOCK_STREAM, proto=0, laddr=('127.0.0.1', 44698), raddr=('127.0.0.1', 4245)> (0 sockets open) Terminating took 0.897s ok testVtyEasyAPN (__main__.TestVTYSGSN) ... Launching: PWD=/build './src/sgsn/osmo-sgsn' '-c' '/build/tests/../doc/examples/osmo-sgsn/osmo-sgsn-accept-all.cfg'
ls -l /proc/12281/fd
total 0 lr-x------ 1 build build 64 Dec 2 20:06 0 -> pipe:[211823817] l-wx------ 1 build build 64 Dec 2 20:06 1 -> pipe:[211823818] l-wx------ 1 build build 64 Dec 2 20:06 2 -> pipe:[211823819] l-wx------ 1 build build 64 Dec 2 20:06 3 -> /dev/null
ss -tn
State Recv-Q Send-Q Local Address:Port Peer Address:Port
ss -tln
State Recv-Q Send-Q Local Address:Port Peer Address:Port LISTEN 0 10 127.0.0.1:4245 *:* LISTEN 0 10 127.0.0.1:4251 *:*
ps xua | grep osmo
build 12337 0.0 0.0 21475109004 28152 ? S 20:06 0:00 ./src/sgsn/osmo-sgsn -c /build/tests/../doc/examples/osmo-sgsn/osmo-sgsn-accept-all.cfg build 12344 0.0 0.0 4280 724 ? S 20:06 0:00 /bin/sh -c ps xua | grep osmo build 12346 0.0 0.0 12784 988 ? S 20:06 0:00 grep osmo
Socket: in 1 tries, connected to 127.0.0.1:4245 <socket.socket fd=4, family=AddressFamily.AF_INET, type=SocketKind.SOCK_STREAM, proto=0, laddr=('127.0.0.1', 44702), raddr=('127.0.0.1', 4245)> (1 sockets open) Socket: closing 127.0.0.1:4245 <socket.socket fd=4, family=AddressFamily.AF_INET, type=SocketKind.SOCK_STREAM, proto=0, laddr=('127.0.0.1', 44702), raddr=('127.0.0.1', 4245)> (0 sockets open) Terminating took 0.897s ok testVtyGgsn (__main__.TestVTYSGSN) ... Launching: PWD=/build './src/sgsn/osmo-sgsn' '-c' '/build/tests/../doc/examples/osmo-sgsn/osmo-sgsn-accept-all.cfg'
ls -l /proc/12281/fd
total 0 lr-x------ 1 build build 64 Dec 2 20:06 0 -> pipe:[211823817] l-wx------ 1 build build 64 Dec 2 20:06 1 -> pipe:[211823818] l-wx------ 1 build build 64 Dec 2 20:06 2 -> pipe:[211823819] l-wx------ 1 build build 64 Dec 2 20:06 3 -> /dev/null
ss -tn
State Recv-Q Send-Q Local Address:Port Peer Address:Port
ss -tln
State Recv-Q Send-Q Local Address:Port Peer Address:Port
ps xua | grep osmo
build 12348 0.0 0.0 21475109004 29492 ? S 20:06 0:00 ./src/sgsn/osmo-sgsn -c /build/tests/../doc/examples/osmo-sgsn/osmo-sgsn-accept-all.cfg build 12355 0.0 0.0 4280 748 ? S 20:06 0:00 /bin/sh -c ps xua | grep osmo build 12357 0.0 0.0 12784 944 ? S 20:06 0:00 grep osmo
Socket: in 1 tries, connected to 127.0.0.1:4245 <socket.socket fd=4, family=AddressFamily.AF_INET, type=SocketKind.SOCK_STREAM, proto=0, laddr=('127.0.0.1', 44706), raddr=('127.0.0.1', 4245)> (1 sockets open) Socket: closing 127.0.0.1:4245 <socket.socket fd=4, family=AddressFamily.AF_INET, type=SocketKind.SOCK_STREAM, proto=0, laddr=('127.0.0.1', 44706), raddr=('127.0.0.1', 4245)> (0 sockets open) Terminating took 0.897s ok testVtyShow (__main__.TestVTYSGSN) ... Launching: PWD=/build './src/sgsn/osmo-sgsn' '-c' '/build/tests/../doc/examples/osmo-sgsn/osmo-sgsn-accept-all.cfg'
ls -l /proc/12281/fd
total 0 lr-x------ 1 build build 64 Dec 2 20:06 0 -> pipe:[211823817] l-wx------ 1 build build 64 Dec 2 20:06 1 -> pipe:[211823818] l-wx------ 1 build build 64 Dec 2 20:06 2 -> pipe:[211823819] l-wx------ 1 build build 64 Dec 2 20:06 3 -> /dev/null
ss -tn
State Recv-Q Send-Q Local Address:Port Peer Address:Port
ss -tln
State Recv-Q Send-Q Local Address:Port Peer Address:Port
ps xua | grep osmo
build 12359 0.0 0.0 21475109004 35804 ? R 20:06 0:00 ./src/sgsn/osmo-sgsn -c /build/tests/../doc/examples/osmo-sgsn/osmo-sgsn-accept-all.cfg build 12366 0.0 0.0 4280 756 ? S 20:06 0:00 /bin/sh -c ps xua | grep osmo build 12368 0.0 0.0 4280 84 ? R 20:06 0:00 /bin/sh -c ps xua | grep osmo
Socket: in 1 tries, connected to 127.0.0.1:4245 <socket.socket fd=4, family=AddressFamily.AF_INET, type=SocketKind.SOCK_STREAM, proto=0, laddr=('127.0.0.1', 44712), raddr=('127.0.0.1', 4245)> (1 sockets open) Socket: closing 127.0.0.1:4245 <socket.socket fd=4, family=AddressFamily.AF_INET, type=SocketKind.SOCK_STREAM, proto=0, laddr=('127.0.0.1', 44712), raddr=('127.0.0.1', 4245)> (0 sockets open) Terminating took 0.897s ok testVtySubscriber (__main__.TestVTYSGSN) ... Launching: PWD=/build './src/sgsn/osmo-sgsn' '-c' '/build/tests/../doc/examples/osmo-sgsn/osmo-sgsn-accept-all.cfg'
ls -l /proc/12281/fd
total 0 lr-x------ 1 build build 64 Dec 2 20:06 0 -> pipe:[211823817] l-wx------ 1 build build 64 Dec 2 20:06 1 -> pipe:[211823818] l-wx------ 1 build build 64 Dec 2 20:06 2 -> pipe:[211823819] l-wx------ 1 build build 64 Dec 2 20:06 3 -> /dev/null
ss -tn
State Recv-Q Send-Q Local Address:Port Peer Address:Port
ss -tln
State Recv-Q Send-Q Local Address:Port Peer Address:Port
ps xua | grep osmo
build 12370 0.0 0.0 21475109004 29332 ? S 20:06 0:00 ./src/sgsn/osmo-sgsn -c /build/tests/../doc/examples/osmo-sgsn/osmo-sgsn-accept-all.cfg build 12377 0.0 0.0 4280 700 ? S 20:06 0:00 /bin/sh -c ps xua | grep osmo build 12379 0.0 0.0 12784 980 ? S 20:06 0:00 grep osmo
Socket: in 1 tries, connected to 127.0.0.1:4245 <socket.socket fd=4, family=AddressFamily.AF_INET, type=SocketKind.SOCK_STREAM, proto=0, laddr=('127.0.0.1', 44726), raddr=('127.0.0.1', 4245)> (1 sockets open) Socket: closing 127.0.0.1:4245 <socket.socket fd=4, family=AddressFamily.AF_INET, type=SocketKind.SOCK_STREAM, proto=0, laddr=('127.0.0.1', 44726), raddr=('127.0.0.1', 4245)> (0 sockets open) Terminating took 0.897s ok testVtyTimers (__main__.TestVTYSGSN) ... Launching: PWD=/build './src/sgsn/osmo-sgsn' '-c' '/build/tests/../doc/examples/osmo-sgsn/osmo-sgsn-accept-all.cfg'
ls -l /proc/12281/fd
total 0 lr-x------ 1 build build 64 Dec 2 20:06 0 -> pipe:[211823817] l-wx------ 1 build build 64 Dec 2 20:06 1 -> pipe:[211823818] l-wx------ 1 build build 64 Dec 2 20:06 2 -> pipe:[211823819] l-wx------ 1 build build 64 Dec 2 20:06 3 -> /dev/null
ss -tn
State Recv-Q Send-Q Local Address:Port Peer Address:Port
ss -tln
State Recv-Q Send-Q Local Address:Port Peer Address:Port
ps xua | grep osmo
build 12381 0.0 0.0 21475109004 32936 ? R 20:06 0:00 ./src/sgsn/osmo-sgsn -c /build/tests/../doc/examples/osmo-sgsn/osmo-sgsn-accept-all.cfg build 12388 0.0 0.0 4280 748 ? S 20:06 0:00 /bin/sh -c ps xua | grep osmo build 12390 0.0 0.0 12784 932 ? S 20:06 0:00 grep osmo
Socket: in 1 tries, connected to 127.0.0.1:4245 <socket.socket fd=4, family=AddressFamily.AF_INET, type=SocketKind.SOCK_STREAM, proto=0, laddr=('127.0.0.1', 44728), raddr=('127.0.0.1', 4245)> (1 sockets open) Socket: closing 127.0.0.1:4245 <socket.socket fd=4, family=AddressFamily.AF_INET, type=SocketKind.SOCK_STREAM, proto=0, laddr=('127.0.0.1', 44728), raddr=('127.0.0.1', 4245)> (0 sockets open) Terminating took 0.897s ok testVtyTree (__main__.TestVTYSGSN) ... Launching: PWD=/build './src/sgsn/osmo-sgsn' '-c' '/build/tests/../doc/examples/osmo-sgsn/osmo-sgsn-accept-all.cfg'
ls -l /proc/12281/fd
total 0 lr-x------ 1 build build 64 Dec 2 20:06 0 -> pipe:[211823817] l-wx------ 1 build build 64 Dec 2 20:06 1 -> pipe:[211823818] l-wx------ 1 build build 64 Dec 2 20:06 2 -> pipe:[211823819] l-wx------ 1 build build 64 Dec 2 20:06 3 -> /dev/null
ss -tn
State Recv-Q Send-Q Local Address:Port Peer Address:Port
ss -tln
State Recv-Q Send-Q Local Address:Port Peer Address:Port
ps xua | grep osmo
build 12392 0.0 0.0 21475109004 30700 ? R 20:06 0:00 ./src/sgsn/osmo-sgsn -c /build/tests/../doc/examples/osmo-sgsn/osmo-sgsn-accept-all.cfg build 12399 0.0 0.0 4280 768 ? S 20:06 0:00 /bin/sh -c ps xua | grep osmo build 12401 0.0 0.0 12784 916 ? S 20:06 0:00 grep osmo
Socket: in 1 tries, connected to 127.0.0.1:4245 <socket.socket fd=4, family=AddressFamily.AF_INET, type=SocketKind.SOCK_STREAM, proto=0, laddr=('127.0.0.1', 44734), raddr=('127.0.0.1', 4245)> (1 sockets open) Socket: closing 127.0.0.1:4245 <socket.socket fd=4, family=AddressFamily.AF_INET, type=SocketKind.SOCK_STREAM, proto=0, laddr=('127.0.0.1', 44734), raddr=('127.0.0.1', 4245)> (0 sockets open) Terminating took 0.897s ok
====================================================================== FAIL: testVtyShow (__main__.TestVTYGbproxy) ---------------------------------------------------------------------- Traceback (most recent call last): File "./vty_test_runner.py", line 98, in testVtyShow self.assertTrue(res.find('UDP bind') >= 0) AssertionError: False is not true
---------------------------------------------------------------------- Ran 11 tests in 15.970s
FAILED (failures=1) make[7]: *** [vty-python-test] Error 1 Makefile:711: recipe for target 'vty-python-test' failed make[7]: Leaving directory '/build/tests' Makefile:728: recipe for target 'vty-test' failed make[6]: *** [vty-test] Error 2 make[6]: Leaving directory '/build/tests' Makefile:705: recipe for target 'python-tests' failed make[5]: Leaving directory '/build/tests' make[5]: *** [python-tests] Error 2 Makefile:736: recipe for target 'check-local' failed make[4]: *** [check-local] Error 2 make[4]: Leaving directory '/build/tests' Makefile:565: recipe for target 'check-am' failed make[3]: *** [check-am] Error 2 make[3]: Leaving directory '/build/tests' make[2]: *** [check-recursive] Error 1 Makefile:417: recipe for target 'check-recursive' failed make[2]: Leaving directory '/build/tests' Makefile:461: recipe for target 'check-recursive' failed make[1]: Leaving directory '/build' make[1]: *** [check-recursive] Error 1 make: *** [check] Error 2 Makefile:752: recipe for target 'check' failed + cat-testlogs.sh Build step 'Execute shell' marked build as failure [WARNINGS]Skipping publisher since build result is FAILURE
Changes:
------------------------------------------ [...truncated 429.36 KB...]
ss -tn
State Recv-Q Send-Q Local Address:Port Peer Address:Port
ss -tln
State Recv-Q Send-Q Local Address:Port Peer Address:Port
ps xua | grep osmo
build 12525 0.0 0.0 21475109000 19288 ? R 20:09 0:00 ./src/sgsn/osmo-sgsn -c /build/tests/../doc/examples/osmo-sgsn/osmo-sgsn-accept-all.cfg build 12532 0.0 0.0 4276 748 ? S 20:09 0:00 /bin/sh -c ps xua | grep osmo build 12534 0.0 0.0 12780 952 ? S 20:09 0:00 grep osmo
Socket: in 1 tries, connected to 127.0.0.1:4245 <socket.socket fd=4, family=AddressFamily.AF_INET, type=SocketKind.SOCK_STREAM, proto=0, laddr=('127.0.0.1', 39386), raddr=('127.0.0.1', 4245)> (1 sockets open) Socket: closing 127.0.0.1:4245 <socket.socket fd=4, family=AddressFamily.AF_INET, type=SocketKind.SOCK_STREAM, proto=0, laddr=('127.0.0.1', 39386), raddr=('127.0.0.1', 4245)> (0 sockets open) Terminating took 0.897s ok testVtyCDR (__main__.TestVTYSGSN) ... Launching: PWD=/build './src/sgsn/osmo-sgsn' '-c' '/build/tests/../doc/examples/osmo-sgsn/osmo-sgsn-accept-all.cfg'
ls -l /proc/12491/fd
total 0 lr-x------ 1 build build 64 Dec 2 20:09 0 -> pipe:[3022347549] l-wx------ 1 build build 64 Dec 2 20:09 1 -> pipe:[3022347550] l-wx------ 1 build build 64 Dec 2 20:09 2 -> pipe:[3022347551] l-wx------ 1 build build 64 Dec 2 20:09 3 -> /dev/null
ss -tn
State Recv-Q Send-Q Local Address:Port Peer Address:Port
ss -tln
State Recv-Q Send-Q Local Address:Port Peer Address:Port
ps xua | grep osmo
build 12536 0.0 0.0 21475042820 25056 ? R 20:09 0:00 ./src/sgsn/osmo-sgsn -c /build/tests/../doc/examples/osmo-sgsn/osmo-sgsn-accept-all.cfg build 12543 0.0 0.0 4276 756 ? S 20:09 0:00 /bin/sh -c ps xua | grep osmo build 12545 0.0 0.0 12780 936 ? S 20:09 0:00 grep osmo
Socket: in 1 tries, connected to 127.0.0.1:4245 <socket.socket fd=4, family=AddressFamily.AF_INET, type=SocketKind.SOCK_STREAM, proto=0, laddr=('127.0.0.1', 39396), raddr=('127.0.0.1', 4245)> (1 sockets open) Socket: closing 127.0.0.1:4245 <socket.socket fd=4, family=AddressFamily.AF_INET, type=SocketKind.SOCK_STREAM, proto=0, laddr=('127.0.0.1', 39396), raddr=('127.0.0.1', 4245)> (0 sockets open) Terminating took 0.897s ok testVtyEasyAPN (__main__.TestVTYSGSN) ... Launching: PWD=/build './src/sgsn/osmo-sgsn' '-c' '/build/tests/../doc/examples/osmo-sgsn/osmo-sgsn-accept-all.cfg'
ls -l /proc/12491/fd
total 0 lr-x------ 1 build build 64 Dec 2 20:09 0 -> pipe:[3022347549] l-wx------ 1 build build 64 Dec 2 20:09 1 -> pipe:[3022347550] l-wx------ 1 build build 64 Dec 2 20:09 2 -> pipe:[3022347551] l-wx------ 1 build build 64 Dec 2 20:09 3 -> /dev/null
ss -tn
State Recv-Q Send-Q Local Address:Port Peer Address:Port
ss -tln
State Recv-Q Send-Q Local Address:Port Peer Address:Port
ps xua | grep osmo
build 12547 0.0 0.0 21475109000 17836 ? S 20:09 0:00 ./src/sgsn/osmo-sgsn -c /build/tests/../doc/examples/osmo-sgsn/osmo-sgsn-accept-all.cfg build 12554 0.0 0.0 4276 740 ? S 20:09 0:00 /bin/sh -c ps xua | grep osmo build 12556 0.0 0.0 12780 968 ? S 20:09 0:00 grep osmo
Socket: in 1 tries, connected to 127.0.0.1:4245 <socket.socket fd=4, family=AddressFamily.AF_INET, type=SocketKind.SOCK_STREAM, proto=0, laddr=('127.0.0.1', 39452), raddr=('127.0.0.1', 4245)> (1 sockets open) Socket: closing 127.0.0.1:4245 <socket.socket fd=4, family=AddressFamily.AF_INET, type=SocketKind.SOCK_STREAM, proto=0, laddr=('127.0.0.1', 39452), raddr=('127.0.0.1', 4245)> (0 sockets open) Terminating took 0.897s ok testVtyGgsn (__main__.TestVTYSGSN) ... Launching: PWD=/build './src/sgsn/osmo-sgsn' '-c' '/build/tests/../doc/examples/osmo-sgsn/osmo-sgsn-accept-all.cfg'
ls -l /proc/12491/fd
total 0 lr-x------ 1 build build 64 Dec 2 20:09 0 -> pipe:[3022347549] l-wx------ 1 build build 64 Dec 2 20:09 1 -> pipe:[3022347550] l-wx------ 1 build build 64 Dec 2 20:09 2 -> pipe:[3022347551] l-wx------ 1 build build 64 Dec 2 20:09 3 -> /dev/null
ss -tn
State Recv-Q Send-Q Local Address:Port Peer Address:Port
ss -tln
State Recv-Q Send-Q Local Address:Port Peer Address:Port
ps xua | grep osmo
build 12558 0.0 0.0 21474976640 17612 ? D 20:09 0:00 ./src/sgsn/osmo-sgsn -c /build/tests/../doc/examples/osmo-sgsn/osmo-sgsn-accept-all.cfg build 12565 0.0 0.0 4276 768 ? S 20:09 0:00 /bin/sh -c ps xua | grep osmo build 12567 0.0 0.0 12780 988 ? S 20:09 0:00 grep osmo
Socket: in 1 tries, connected to 127.0.0.1:4245 <socket.socket fd=4, family=AddressFamily.AF_INET, type=SocketKind.SOCK_STREAM, proto=0, laddr=('127.0.0.1', 39472), raddr=('127.0.0.1', 4245)> (1 sockets open) Socket: closing 127.0.0.1:4245 <socket.socket fd=4, family=AddressFamily.AF_INET, type=SocketKind.SOCK_STREAM, proto=0, laddr=('127.0.0.1', 39472), raddr=('127.0.0.1', 4245)> (0 sockets open) Terminating took 0.897s ok testVtyShow (__main__.TestVTYSGSN) ... Launching: PWD=/build './src/sgsn/osmo-sgsn' '-c' '/build/tests/../doc/examples/osmo-sgsn/osmo-sgsn-accept-all.cfg'
ls -l /proc/12491/fd
total 0 lr-x------ 1 build build 64 Dec 2 20:09 0 -> pipe:[3022347549] l-wx------ 1 build build 64 Dec 2 20:09 1 -> pipe:[3022347550] l-wx------ 1 build build 64 Dec 2 20:09 2 -> pipe:[3022347551] l-wx------ 1 build build 64 Dec 2 20:09 3 -> /dev/null
ss -tn
State Recv-Q Send-Q Local Address:Port Peer Address:Port
ss -tln
State Recv-Q Send-Q Local Address:Port Peer Address:Port LISTEN 0 10 127.0.0.1:4245 *:* LISTEN 0 10 127.0.0.1:4251 *:*
ps xua | grep osmo
build 12569 0.0 0.0 21475109000 17856 ? R 20:09 0:00 ./src/sgsn/osmo-sgsn -c /build/tests/../doc/examples/osmo-sgsn/osmo-sgsn-accept-all.cfg build 12576 0.0 0.0 4276 724 ? S 20:09 0:00 /bin/sh -c ps xua | grep osmo build 12578 0.0 0.0 4276 88 ? R 20:09 0:00 /bin/sh -c ps xua | grep osmo
Socket: in 1 tries, connected to 127.0.0.1:4245 <socket.socket fd=4, family=AddressFamily.AF_INET, type=SocketKind.SOCK_STREAM, proto=0, laddr=('127.0.0.1', 39476), raddr=('127.0.0.1', 4245)> (1 sockets open) Socket: closing 127.0.0.1:4245 <socket.socket fd=4, family=AddressFamily.AF_INET, type=SocketKind.SOCK_STREAM, proto=0, laddr=('127.0.0.1', 39476), raddr=('127.0.0.1', 4245)> (0 sockets open) Terminating took 0.897s ok testVtySubscriber (__main__.TestVTYSGSN) ... Launching: PWD=/build './src/sgsn/osmo-sgsn' '-c' '/build/tests/../doc/examples/osmo-sgsn/osmo-sgsn-accept-all.cfg'
ls -l /proc/12491/fd
total 0 lr-x------ 1 build build 64 Dec 2 20:09 0 -> pipe:[3022347549] l-wx------ 1 build build 64 Dec 2 20:09 1 -> pipe:[3022347550] l-wx------ 1 build build 64 Dec 2 20:09 2 -> pipe:[3022347551] l-wx------ 1 build build 64 Dec 2 20:09 3 -> /dev/null
ss -tn
State Recv-Q Send-Q Local Address:Port Peer Address:Port
ss -tln
State Recv-Q Send-Q Local Address:Port Peer Address:Port
ps xua | grep osmo
build 12580 0.0 0.0 21474976640 17572 ? D 20:09 0:00 ./src/sgsn/osmo-sgsn -c /build/tests/../doc/examples/osmo-sgsn/osmo-sgsn-accept-all.cfg build 12587 0.0 0.0 4276 748 ? S 20:09 0:00 /bin/sh -c ps xua | grep osmo build 12589 0.0 0.0 4276 88 ? R 20:09 0:00 /bin/sh -c ps xua | grep osmo
Socket: in 1 tries, connected to 127.0.0.1:4245 <socket.socket fd=4, family=AddressFamily.AF_INET, type=SocketKind.SOCK_STREAM, proto=0, laddr=('127.0.0.1', 39504), raddr=('127.0.0.1', 4245)> (1 sockets open) Socket: closing 127.0.0.1:4245 <socket.socket fd=4, family=AddressFamily.AF_INET, type=SocketKind.SOCK_STREAM, proto=0, laddr=('127.0.0.1', 39504), raddr=('127.0.0.1', 4245)> (0 sockets open) Terminating took 0.897s ok testVtyTimers (__main__.TestVTYSGSN) ... Launching: PWD=/build './src/sgsn/osmo-sgsn' '-c' '/build/tests/../doc/examples/osmo-sgsn/osmo-sgsn-accept-all.cfg'
ls -l /proc/12491/fd
total 0 lr-x------ 1 build build 64 Dec 2 20:09 0 -> pipe:[3022347549] l-wx------ 1 build build 64 Dec 2 20:09 1 -> pipe:[3022347550] l-wx------ 1 build build 64 Dec 2 20:09 2 -> pipe:[3022347551] l-wx------ 1 build build 64 Dec 2 20:09 3 -> /dev/null
ss -tn
State Recv-Q Send-Q Local Address:Port Peer Address:Port
ss -tln
State Recv-Q Send-Q Local Address:Port Peer Address:Port
ps xua | grep osmo
build 12591 0.0 0.0 21474976640 17672 ? D 20:09 0:00 ./src/sgsn/osmo-sgsn -c /build/tests/../doc/examples/osmo-sgsn/osmo-sgsn-accept-all.cfg build 12598 0.0 0.0 4276 700 ? S 20:09 0:00 /bin/sh -c ps xua | grep osmo build 12600 0.0 0.0 4276 88 ? R 20:09 0:00 /bin/sh -c ps xua | grep osmo
Socket: in 1 tries, connected to 127.0.0.1:4245 <socket.socket fd=4, family=AddressFamily.AF_INET, type=SocketKind.SOCK_STREAM, proto=0, laddr=('127.0.0.1', 39528), raddr=('127.0.0.1', 4245)> (1 sockets open) Socket: closing 127.0.0.1:4245 <socket.socket fd=4, family=AddressFamily.AF_INET, type=SocketKind.SOCK_STREAM, proto=0, laddr=('127.0.0.1', 39528), raddr=('127.0.0.1', 4245)> (0 sockets open) Terminating took 0.897s ok testVtyTree (__main__.TestVTYSGSN) ... Launching: PWD=/build './src/sgsn/osmo-sgsn' '-c' '/build/tests/../doc/examples/osmo-sgsn/osmo-sgsn-accept-all.cfg'
ls -l /proc/12491/fd
total 0 lr-x------ 1 build build 64 Dec 2 20:09 0 -> pipe:[3022347549] l-wx------ 1 build build 64 Dec 2 20:09 1 -> pipe:[3022347550] l-wx------ 1 build build 64 Dec 2 20:09 2 -> pipe:[3022347551] l-wx------ 1 build build 64 Dec 2 20:09 3 -> /dev/null
ss -tn
State Recv-Q Send-Q Local Address:Port Peer Address:Port
ss -tln
State Recv-Q Send-Q Local Address:Port Peer Address:Port
ps xua | grep osmo
build 12602 0.0 0.0 21475109000 24020 ? R 20:09 0:00 ./src/sgsn/osmo-sgsn -c /build/tests/../doc/examples/osmo-sgsn/osmo-sgsn-accept-all.cfg build 12609 0.0 0.0 4276 712 ? S 20:09 0:00 /bin/sh -c ps xua | grep osmo build 12611 0.0 0.0 12780 932 ? S 20:09 0:00 grep osmo
Socket: in 1 tries, connected to 127.0.0.1:4245 <socket.socket fd=4, family=AddressFamily.AF_INET, type=SocketKind.SOCK_STREAM, proto=0, laddr=('127.0.0.1', 39532), raddr=('127.0.0.1', 4245)> (1 sockets open) Socket: closing 127.0.0.1:4245 <socket.socket fd=4, family=AddressFamily.AF_INET, type=SocketKind.SOCK_STREAM, proto=0, laddr=('127.0.0.1', 39532), raddr=('127.0.0.1', 4245)> (0 sockets open) Terminating took 0.897s ok
====================================================================== FAIL: testVtyShow (__main__.TestVTYGbproxy) ---------------------------------------------------------------------- Traceback (most recent call last): File "./vty_test_runner.py", line 98, in testVtyShow self.assertTrue(res.find('UDP bind') >= 0) AssertionError: False is not true
---------------------------------------------------------------------- Ran 11 tests in 15.907s
FAILED (failures=1) make[7]: *** [vty-python-test] Error 1 Makefile:711: recipe for target 'vty-python-test' failed make[7]: Leaving directory '/build/tests' Makefile:728: recipe for target 'vty-test' failed make[6]: Leaving directory '/build/tests' make[6]: *** [vty-test] Error 2 make[5]: *** [python-tests] Error 2 Makefile:705: recipe for target 'python-tests' failed make[5]: Leaving directory '/build/tests' make[4]: *** [check-local] Error 2 Makefile:736: recipe for target 'check-local' failed make[4]: Leaving directory '/build/tests' Makefile:565: recipe for target 'check-am' failed make[3]: Leaving directory '/build/tests' make[3]: *** [check-am] Error 2 Makefile:417: recipe for target 'check-recursive' failed make[2]: Leaving directory '/build/tests' make[2]: *** [check-recursive] Error 1 Makefile:461: recipe for target 'check-recursive' failed make[1]: Leaving directory '/build' make[1]: *** [check-recursive] Error 1 Makefile:752: recipe for target 'check' failed make: *** [check] Error 2 + cat-testlogs.sh Build step 'Execute shell' marked build as failure [WARNINGS]Skipping publisher since build result is FAILURE
Changes:
------------------------------------------ [...truncated 429.36 KB...] l-wx------ 1 build build 64 Dec 2 20:12 2 -> pipe:[212390512] l-wx------ 1 build build 64 Dec 2 20:12 3 -> /dev/null
ss -tn
State Recv-Q Send-Q Local Address:Port Peer Address:Port
ss -tln
State Recv-Q Send-Q Local Address:Port Peer Address:Port
ps xua | grep osmo
build 12543 0.0 0.0 21475109004 35412 ? R 20:12 0:00 ./src/sgsn/osmo-sgsn -c /build/tests/../doc/examples/osmo-sgsn/osmo-sgsn-accept-all.cfg build 12550 0.0 0.0 4280 744 ? S 20:12 0:00 /bin/sh -c ps xua | grep osmo build 12552 0.0 0.0 12784 932 ? S 20:12 0:00 grep osmo
Socket: in 1 tries, connected to 127.0.0.1:4245 <socket.socket fd=4, family=AddressFamily.AF_INET, type=SocketKind.SOCK_STREAM, proto=0, laddr=('127.0.0.1', 45970), raddr=('127.0.0.1', 4245)> (1 sockets open) Socket: closing 127.0.0.1:4245 <socket.socket fd=4, family=AddressFamily.AF_INET, type=SocketKind.SOCK_STREAM, proto=0, laddr=('127.0.0.1', 45970), raddr=('127.0.0.1', 4245)> (0 sockets open) Terminating took 0.897s ok testVtyCDR (__main__.TestVTYSGSN) ... Launching: PWD=/build './src/sgsn/osmo-sgsn' '-c' '/build/tests/../doc/examples/osmo-sgsn/osmo-sgsn-accept-all.cfg'
ls -l /proc/12509/fd
total 0 lr-x------ 1 build build 64 Dec 2 20:12 0 -> pipe:[212390510] l-wx------ 1 build build 64 Dec 2 20:12 1 -> pipe:[212390511] l-wx------ 1 build build 64 Dec 2 20:12 2 -> pipe:[212390512] l-wx------ 1 build build 64 Dec 2 20:12 3 -> /dev/null
ss -tn
State Recv-Q Send-Q Local Address:Port Peer Address:Port
ss -tln
State Recv-Q Send-Q Local Address:Port Peer Address:Port
ps xua | grep osmo
build 12554 0.0 0.0 21475042824 39856 ? R 20:12 0:00 ./src/sgsn/osmo-sgsn -c /build/tests/../doc/examples/osmo-sgsn/osmo-sgsn-accept-all.cfg build 12561 0.0 0.0 4280 756 ? S 20:12 0:00 /bin/sh -c ps xua | grep osmo build 12563 0.0 0.0 12784 976 ? S 20:12 0:00 grep osmo
Socket: in 1 tries, connected to 127.0.0.1:4245 <socket.socket fd=4, family=AddressFamily.AF_INET, type=SocketKind.SOCK_STREAM, proto=0, laddr=('127.0.0.1', 45972), raddr=('127.0.0.1', 4245)> (1 sockets open) Socket: closing 127.0.0.1:4245 <socket.socket fd=4, family=AddressFamily.AF_INET, type=SocketKind.SOCK_STREAM, proto=0, laddr=('127.0.0.1', 45972), raddr=('127.0.0.1', 4245)> (0 sockets open) Terminating took 0.897s ok testVtyEasyAPN (__main__.TestVTYSGSN) ... Launching: PWD=/build './src/sgsn/osmo-sgsn' '-c' '/build/tests/../doc/examples/osmo-sgsn/osmo-sgsn-accept-all.cfg'
ls -l /proc/12509/fd
total 0 lr-x------ 1 build build 64 Dec 2 20:12 0 -> pipe:[212390510] l-wx------ 1 build build 64 Dec 2 20:12 1 -> pipe:[212390511] l-wx------ 1 build build 64 Dec 2 20:12 2 -> pipe:[212390512] l-wx------ 1 build build 64 Dec 2 20:12 3 -> /dev/null
ss -tn
State Recv-Q Send-Q Local Address:Port Peer Address:Port
ss -tln
State Recv-Q Send-Q Local Address:Port Peer Address:Port
ps xua | grep osmo
build 12565 0.0 0.0 21475109004 31812 ? S 20:12 0:00 ./src/sgsn/osmo-sgsn -c /build/tests/../doc/examples/osmo-sgsn/osmo-sgsn-accept-all.cfg build 12572 0.0 0.0 4280 712 ? S 20:12 0:00 /bin/sh -c ps xua | grep osmo build 12574 0.0 0.0 12784 944 ? S 20:12 0:00 grep osmo
Socket: in 1 tries, connected to 127.0.0.1:4245 <socket.socket fd=4, family=AddressFamily.AF_INET, type=SocketKind.SOCK_STREAM, proto=0, laddr=('127.0.0.1', 45982), raddr=('127.0.0.1', 4245)> (1 sockets open) Socket: closing 127.0.0.1:4245 <socket.socket fd=4, family=AddressFamily.AF_INET, type=SocketKind.SOCK_STREAM, proto=0, laddr=('127.0.0.1', 45982), raddr=('127.0.0.1', 4245)> (0 sockets open) Terminating took 0.897s ok testVtyGgsn (__main__.TestVTYSGSN) ... Launching: PWD=/build './src/sgsn/osmo-sgsn' '-c' '/build/tests/../doc/examples/osmo-sgsn/osmo-sgsn-accept-all.cfg'
ls -l /proc/12509/fd
total 0 lr-x------ 1 build build 64 Dec 2 20:12 0 -> pipe:[212390510] l-wx------ 1 build build 64 Dec 2 20:12 1 -> pipe:[212390511] l-wx------ 1 build build 64 Dec 2 20:12 2 -> pipe:[212390512] l-wx------ 1 build build 64 Dec 2 20:12 3 -> /dev/null
ss -tn
State Recv-Q Send-Q Local Address:Port Peer Address:Port
ss -tln
State Recv-Q Send-Q Local Address:Port Peer Address:Port
ps xua | grep osmo
build 12576 0.0 0.0 21475109004 26684 ? S 20:12 0:00 ./src/sgsn/osmo-sgsn -c /build/tests/../doc/examples/osmo-sgsn/osmo-sgsn-accept-all.cfg build 12583 0.0 0.0 4280 736 ? S 20:12 0:00 /bin/sh -c ps xua | grep osmo build 12585 0.0 0.0 12784 1028 ? S 20:12 0:00 grep osmo
Socket: in 1 tries, connected to 127.0.0.1:4245 <socket.socket fd=4, family=AddressFamily.AF_INET, type=SocketKind.SOCK_STREAM, proto=0, laddr=('127.0.0.1', 45986), raddr=('127.0.0.1', 4245)> (1 sockets open) Socket: closing 127.0.0.1:4245 <socket.socket fd=4, family=AddressFamily.AF_INET, type=SocketKind.SOCK_STREAM, proto=0, laddr=('127.0.0.1', 45986), raddr=('127.0.0.1', 4245)> (0 sockets open) Terminating took 0.897s ok testVtyShow (__main__.TestVTYSGSN) ... Launching: PWD=/build './src/sgsn/osmo-sgsn' '-c' '/build/tests/../doc/examples/osmo-sgsn/osmo-sgsn-accept-all.cfg'
ls -l /proc/12509/fd
total 0 lr-x------ 1 build build 64 Dec 2 20:12 0 -> pipe:[212390510] l-wx------ 1 build build 64 Dec 2 20:12 1 -> pipe:[212390511] l-wx------ 1 build build 64 Dec 2 20:12 2 -> pipe:[212390512] l-wx------ 1 build build 64 Dec 2 20:12 3 -> /dev/null
ss -tn
State Recv-Q Send-Q Local Address:Port Peer Address:Port
ss -tln
State Recv-Q Send-Q Local Address:Port Peer Address:Port
ps xua | grep osmo
build 12587 0.0 0.0 21475109004 29632 ? R 20:12 0:00 ./src/sgsn/osmo-sgsn -c /build/tests/../doc/examples/osmo-sgsn/osmo-sgsn-accept-all.cfg build 12594 0.0 0.0 4280 796 ? S 20:12 0:00 /bin/sh -c ps xua | grep osmo build 12596 0.0 0.0 12784 928 ? S 20:12 0:00 grep osmo
Socket: in 1 tries, connected to 127.0.0.1:4245 <socket.socket fd=4, family=AddressFamily.AF_INET, type=SocketKind.SOCK_STREAM, proto=0, laddr=('127.0.0.1', 45998), raddr=('127.0.0.1', 4245)> (1 sockets open) Socket: closing 127.0.0.1:4245 <socket.socket fd=4, family=AddressFamily.AF_INET, type=SocketKind.SOCK_STREAM, proto=0, laddr=('127.0.0.1', 45998), raddr=('127.0.0.1', 4245)> (0 sockets open) Terminating took 0.897s ok testVtySubscriber (__main__.TestVTYSGSN) ... Launching: PWD=/build './src/sgsn/osmo-sgsn' '-c' '/build/tests/../doc/examples/osmo-sgsn/osmo-sgsn-accept-all.cfg'
ls -l /proc/12509/fd
total 0 lr-x------ 1 build build 64 Dec 2 20:12 0 -> pipe:[212390510] l-wx------ 1 build build 64 Dec 2 20:12 1 -> pipe:[212390511] l-wx------ 1 build build 64 Dec 2 20:12 2 -> pipe:[212390512] l-wx------ 1 build build 64 Dec 2 20:12 3 -> /dev/null
ss -tn
State Recv-Q Send-Q Local Address:Port Peer Address:Port
ss -tln
State Recv-Q Send-Q Local Address:Port Peer Address:Port
ps xua | grep osmo
build 12598 0.0 0.0 21474976644 29872 ? D 20:12 0:00 ./src/sgsn/osmo-sgsn -c /build/tests/../doc/examples/osmo-sgsn/osmo-sgsn-accept-all.cfg build 12605 0.0 0.0 4280 760 ? S 20:12 0:00 /bin/sh -c ps xua | grep osmo build 12607 0.0 0.0 12784 936 ? S 20:12 0:00 grep osmo
Socket: in 1 tries, connected to 127.0.0.1:4245 <socket.socket fd=4, family=AddressFamily.AF_INET, type=SocketKind.SOCK_STREAM, proto=0, laddr=('127.0.0.1', 46000), raddr=('127.0.0.1', 4245)> (1 sockets open) Socket: closing 127.0.0.1:4245 <socket.socket fd=4, family=AddressFamily.AF_INET, type=SocketKind.SOCK_STREAM, proto=0, laddr=('127.0.0.1', 46000), raddr=('127.0.0.1', 4245)> (0 sockets open) Terminating took 0.897s ok testVtyTimers (__main__.TestVTYSGSN) ... Launching: PWD=/build './src/sgsn/osmo-sgsn' '-c' '/build/tests/../doc/examples/osmo-sgsn/osmo-sgsn-accept-all.cfg'
ls -l /proc/12509/fd
total 0 lr-x------ 1 build build 64 Dec 2 20:12 0 -> pipe:[212390510] l-wx------ 1 build build 64 Dec 2 20:12 1 -> pipe:[212390511] l-wx------ 1 build build 64 Dec 2 20:12 2 -> pipe:[212390512] l-wx------ 1 build build 64 Dec 2 20:12 3 -> /dev/null
ss -tn
State Recv-Q Send-Q Local Address:Port Peer Address:Port
ss -tln
State Recv-Q Send-Q Local Address:Port Peer Address:Port
ps xua | grep osmo
build 12609 0.0 0.0 21475109004 31728 ? R 20:12 0:00 ./src/sgsn/osmo-sgsn -c /build/tests/../doc/examples/osmo-sgsn/osmo-sgsn-accept-all.cfg build 12616 0.0 0.0 4280 704 ? S 20:12 0:00 /bin/sh -c ps xua | grep osmo build 12618 0.0 0.0 12784 944 ? S 20:12 0:00 grep osmo
Socket: in 1 tries, connected to 127.0.0.1:4245 <socket.socket fd=4, family=AddressFamily.AF_INET, type=SocketKind.SOCK_STREAM, proto=0, laddr=('127.0.0.1', 46004), raddr=('127.0.0.1', 4245)> (1 sockets open) Socket: closing 127.0.0.1:4245 <socket.socket fd=4, family=AddressFamily.AF_INET, type=SocketKind.SOCK_STREAM, proto=0, laddr=('127.0.0.1', 46004), raddr=('127.0.0.1', 4245)> (0 sockets open) Terminating took 0.897s ok testVtyTree (__main__.TestVTYSGSN) ... Launching: PWD=/build './src/sgsn/osmo-sgsn' '-c' '/build/tests/../doc/examples/osmo-sgsn/osmo-sgsn-accept-all.cfg'
ls -l /proc/12509/fd
total 0 lr-x------ 1 build build 64 Dec 2 20:12 0 -> pipe:[212390510] l-wx------ 1 build build 64 Dec 2 20:12 1 -> pipe:[212390511] l-wx------ 1 build build 64 Dec 2 20:12 2 -> pipe:[212390512] l-wx------ 1 build build 64 Dec 2 20:12 3 -> /dev/null
ss -tn
State Recv-Q Send-Q Local Address:Port Peer Address:Port
ss -tln
State Recv-Q Send-Q Local Address:Port Peer Address:Port
ps xua | grep osmo
build 12620 0.0 0.0 21475109004 26540 ? R 20:12 0:00 ./src/sgsn/osmo-sgsn -c /build/tests/../doc/examples/osmo-sgsn/osmo-sgsn-accept-all.cfg build 12627 0.0 0.0 4280 752 ? S 20:12 0:00 /bin/sh -c ps xua | grep osmo build 12629 0.0 0.0 12784 972 ? S 20:12 0:00 grep osmo
Socket: in 1 tries, connected to 127.0.0.1:4245 <socket.socket fd=4, family=AddressFamily.AF_INET, type=SocketKind.SOCK_STREAM, proto=0, laddr=('127.0.0.1', 46010), raddr=('127.0.0.1', 4245)> (1 sockets open) Socket: closing 127.0.0.1:4245 <socket.socket fd=4, family=AddressFamily.AF_INET, type=SocketKind.SOCK_STREAM, proto=0, laddr=('127.0.0.1', 46010), raddr=('127.0.0.1', 4245)> (0 sockets open) Terminating took 0.897s ok
====================================================================== FAIL: testVtyShow (__main__.TestVTYGbproxy) ---------------------------------------------------------------------- Traceback (most recent call last): File "./vty_test_runner.py", line 98, in testVtyShow self.assertTrue(res.find('UDP bind') >= 0) AssertionError: False is not true
---------------------------------------------------------------------- Ran 11 tests in 15.886s
FAILED (failures=1) Makefile:711: recipe for target 'vty-python-test' failed make[7]: Leaving directory '/build/tests' make[7]: *** [vty-python-test] Error 1 Makefile:728: recipe for target 'vty-test' failed make[6]: *** [vty-test] Error 2 make[6]: Leaving directory '/build/tests' Makefile:705: recipe for target 'python-tests' failed make[5]: Leaving directory '/build/tests' make[5]: *** [python-tests] Error 2 Makefile:736: recipe for target 'check-local' failed make[4]: Leaving directory '/build/tests' make[4]: *** [check-local] Error 2 Makefile:565: recipe for target 'check-am' failed make[3]: *** [check-am] Error 2 make[3]: Leaving directory '/build/tests' make[2]: *** [check-recursive] Error 1 Makefile:417: recipe for target 'check-recursive' failed make[2]: Leaving directory '/build/tests' make[1]: *** [check-recursive] Error 1 Makefile:461: recipe for target 'check-recursive' failed make[1]: Leaving directory '/build' Makefile:752: recipe for target 'check' failed make: *** [check] Error 2 + cat-testlogs.sh Build step 'Execute shell' marked build as failure [WARNINGS]Skipping publisher since build result is FAILURE
Changes:
------------------------------------------ [...truncated 430.47 KB...]
ss -tn
State Recv-Q Send-Q Local Address:Port Peer Address:Port
ss -tln
State Recv-Q Send-Q Local Address:Port Peer Address:Port
ps xua | grep osmo
build 12312 0.0 0.0 21475109004 34692 ? R 20:16 0:00 ./src/sgsn/osmo-sgsn -c /build/tests/../doc/examples/osmo-sgsn/osmo-sgsn-accept-all.cfg build 12319 0.0 0.0 4280 700 ? S 20:16 0:00 /bin/sh -c ps xua | grep osmo build 12321 0.0 0.0 12784 1000 ? S 20:16 0:00 grep osmo
Socket: in 1 tries, connected to 127.0.0.1:4245 <socket.socket fd=4, family=AddressFamily.AF_INET, type=SocketKind.SOCK_STREAM, proto=0, laddr=('127.0.0.1', 46424), raddr=('127.0.0.1', 4245)> (1 sockets open) Socket: closing 127.0.0.1:4245 <socket.socket fd=4, family=AddressFamily.AF_INET, type=SocketKind.SOCK_STREAM, proto=0, laddr=('127.0.0.1', 46424), raddr=('127.0.0.1', 4245)> (0 sockets open) Terminating took 0.897s ok testVtyCDR (__main__.TestVTYSGSN) ... Launching: PWD=/build './src/sgsn/osmo-sgsn' '-c' '/build/tests/../doc/examples/osmo-sgsn/osmo-sgsn-accept-all.cfg'
ls -l /proc/12278/fd
total 0 lr-x------ 1 build build 64 Dec 2 20:16 0 -> pipe:[213067122] l-wx------ 1 build build 64 Dec 2 20:16 1 -> pipe:[213067123] l-wx------ 1 build build 64 Dec 2 20:16 2 -> pipe:[213067124] l-wx------ 1 build build 64 Dec 2 20:16 3 -> /dev/null
ss -tn
State Recv-Q Send-Q Local Address:Port Peer Address:Port
ss -tln
State Recv-Q Send-Q Local Address:Port Peer Address:Port
ps xua | grep osmo
build 12323 0.0 0.0 21475109004 29420 ? R 20:16 0:00 ./src/sgsn/osmo-sgsn -c /build/tests/../doc/examples/osmo-sgsn/osmo-sgsn-accept-all.cfg build 12330 0.0 0.0 4280 740 ? S 20:16 0:00 /bin/sh -c ps xua | grep osmo build 12332 0.0 0.0 4280 84 ? R 20:16 0:00 /bin/sh -c ps xua | grep osmo
Socket: in 1 tries, connected to 127.0.0.1:4245 <socket.socket fd=4, family=AddressFamily.AF_INET, type=SocketKind.SOCK_STREAM, proto=0, laddr=('127.0.0.1', 46430), raddr=('127.0.0.1', 4245)> (1 sockets open) Socket: closing 127.0.0.1:4245 <socket.socket fd=4, family=AddressFamily.AF_INET, type=SocketKind.SOCK_STREAM, proto=0, laddr=('127.0.0.1', 46430), raddr=('127.0.0.1', 4245)> (0 sockets open) Terminating took 0.897s ok testVtyEasyAPN (__main__.TestVTYSGSN) ... Launching: PWD=/build './src/sgsn/osmo-sgsn' '-c' '/build/tests/../doc/examples/osmo-sgsn/osmo-sgsn-accept-all.cfg'
ls -l /proc/12278/fd
total 0 lr-x------ 1 build build 64 Dec 2 20:16 0 -> pipe:[213067122] l-wx------ 1 build build 64 Dec 2 20:16 1 -> pipe:[213067123] l-wx------ 1 build build 64 Dec 2 20:16 2 -> pipe:[213067124] l-wx------ 1 build build 64 Dec 2 20:16 3 -> /dev/null
ss -tn
State Recv-Q Send-Q Local Address:Port Peer Address:Port
ss -tln
State Recv-Q Send-Q Local Address:Port Peer Address:Port
ps xua | grep osmo
build 12334 0.0 0.0 21475109004 30136 ? S 20:16 0:00 ./src/sgsn/osmo-sgsn -c /build/tests/../doc/examples/osmo-sgsn/osmo-sgsn-accept-all.cfg build 12341 0.0 0.0 4280 736 ? S 20:16 0:00 /bin/sh -c ps xua | grep osmo build 12343 0.0 0.0 12784 968 ? S 20:16 0:00 grep osmo
Socket: in 1 tries, connected to 127.0.0.1:4245 <socket.socket fd=4, family=AddressFamily.AF_INET, type=SocketKind.SOCK_STREAM, proto=0, laddr=('127.0.0.1', 46434), raddr=('127.0.0.1', 4245)> (1 sockets open) Socket: closing 127.0.0.1:4245 <socket.socket fd=4, family=AddressFamily.AF_INET, type=SocketKind.SOCK_STREAM, proto=0, laddr=('127.0.0.1', 46434), raddr=('127.0.0.1', 4245)> (0 sockets open) Terminating took 0.897s ok testVtyGgsn (__main__.TestVTYSGSN) ... Launching: PWD=/build './src/sgsn/osmo-sgsn' '-c' '/build/tests/../doc/examples/osmo-sgsn/osmo-sgsn-accept-all.cfg'
ls -l /proc/12278/fd
total 0 lr-x------ 1 build build 64 Dec 2 20:16 0 -> pipe:[213067122] l-wx------ 1 build build 64 Dec 2 20:16 1 -> pipe:[213067123] l-wx------ 1 build build 64 Dec 2 20:16 2 -> pipe:[213067124] l-wx------ 1 build build 64 Dec 2 20:16 3 -> /dev/null
ss -tn
State Recv-Q Send-Q Local Address:Port Peer Address:Port
ss -tln
State Recv-Q Send-Q Local Address:Port Peer Address:Port
ps xua | grep osmo
build 12345 0.0 0.0 21475109004 34256 ? R 20:16 0:00 ./src/sgsn/osmo-sgsn -c /build/tests/../doc/examples/osmo-sgsn/osmo-sgsn-accept-all.cfg build 12352 0.0 0.0 4280 748 ? S 20:16 0:00 /bin/sh -c ps xua | grep osmo build 12354 0.0 0.0 12784 956 ? S 20:16 0:00 grep osmo
Socket: in 1 tries, connected to 127.0.0.1:4245 <socket.socket fd=4, family=AddressFamily.AF_INET, type=SocketKind.SOCK_STREAM, proto=0, laddr=('127.0.0.1', 46440), raddr=('127.0.0.1', 4245)> (1 sockets open) Socket: closing 127.0.0.1:4245 <socket.socket fd=4, family=AddressFamily.AF_INET, type=SocketKind.SOCK_STREAM, proto=0, laddr=('127.0.0.1', 46440), raddr=('127.0.0.1', 4245)> (0 sockets open) Terminating took 0.897s ok testVtyShow (__main__.TestVTYSGSN) ... Launching: PWD=/build './src/sgsn/osmo-sgsn' '-c' '/build/tests/../doc/examples/osmo-sgsn/osmo-sgsn-accept-all.cfg'
ls -l /proc/12278/fd
total 0 lr-x------ 1 build build 64 Dec 2 20:16 0 -> pipe:[213067122] l-wx------ 1 build build 64 Dec 2 20:16 1 -> pipe:[213067123] l-wx------ 1 build build 64 Dec 2 20:16 2 -> pipe:[213067124] l-wx------ 1 build build 64 Dec 2 20:16 3 -> /dev/null
ss -tn
State Recv-Q Send-Q Local Address:Port Peer Address:Port
ss -tln
State Recv-Q Send-Q Local Address:Port Peer Address:Port LISTEN 0 10 127.0.0.1:4245 *:* LISTEN 0 10 127.0.0.1:4251 *:*
ps xua | grep osmo
build 12356 0.0 0.0 21475109004 28804 ? S 20:16 0:00 ./src/sgsn/osmo-sgsn -c /build/tests/../doc/examples/osmo-sgsn/osmo-sgsn-accept-all.cfg build 12363 0.0 0.0 4280 704 ? S 20:16 0:00 /bin/sh -c ps xua | grep osmo build 12365 0.0 0.0 12784 968 ? S 20:16 0:00 grep osmo
Socket: in 1 tries, connected to 127.0.0.1:4245 <socket.socket fd=4, family=AddressFamily.AF_INET, type=SocketKind.SOCK_STREAM, proto=0, laddr=('127.0.0.1', 46448), raddr=('127.0.0.1', 4245)> (1 sockets open) Socket: closing 127.0.0.1:4245 <socket.socket fd=4, family=AddressFamily.AF_INET, type=SocketKind.SOCK_STREAM, proto=0, laddr=('127.0.0.1', 46448), raddr=('127.0.0.1', 4245)> (0 sockets open) Terminating took 0.897s ok testVtySubscriber (__main__.TestVTYSGSN) ... Launching: PWD=/build './src/sgsn/osmo-sgsn' '-c' '/build/tests/../doc/examples/osmo-sgsn/osmo-sgsn-accept-all.cfg'
ls -l /proc/12278/fd
total 0 lr-x------ 1 build build 64 Dec 2 20:16 0 -> pipe:[213067122] l-wx------ 1 build build 64 Dec 2 20:16 1 -> pipe:[213067123] l-wx------ 1 build build 64 Dec 2 20:16 2 -> pipe:[213067124] l-wx------ 1 build build 64 Dec 2 20:16 3 -> /dev/null
ss -tn
State Recv-Q Send-Q Local Address:Port Peer Address:Port
ss -tln
State Recv-Q Send-Q Local Address:Port Peer Address:Port
ps xua | grep osmo
build 12367 0.0 0.0 21475109004 30520 ? R 20:16 0:00 ./src/sgsn/osmo-sgsn -c /build/tests/../doc/examples/osmo-sgsn/osmo-sgsn-accept-all.cfg build 12374 0.0 0.0 4280 752 ? S 20:16 0:00 /bin/sh -c ps xua | grep osmo build 12376 0.0 0.0 12784 964 ? S 20:16 0:00 grep osmo
Socket: in 1 tries, connected to 127.0.0.1:4245 <socket.socket fd=4, family=AddressFamily.AF_INET, type=SocketKind.SOCK_STREAM, proto=0, laddr=('127.0.0.1', 46452), raddr=('127.0.0.1', 4245)> (1 sockets open) Socket: closing 127.0.0.1:4245 <socket.socket fd=4, family=AddressFamily.AF_INET, type=SocketKind.SOCK_STREAM, proto=0, laddr=('127.0.0.1', 46452), raddr=('127.0.0.1', 4245)> (0 sockets open) Terminating took 0.897s ok testVtyTimers (__main__.TestVTYSGSN) ... Launching: PWD=/build './src/sgsn/osmo-sgsn' '-c' '/build/tests/../doc/examples/osmo-sgsn/osmo-sgsn-accept-all.cfg'
ls -l /proc/12278/fd
total 0 lr-x------ 1 build build 64 Dec 2 20:16 0 -> pipe:[213067122] l-wx------ 1 build build 64 Dec 2 20:16 1 -> pipe:[213067123] l-wx------ 1 build build 64 Dec 2 20:16 2 -> pipe:[213067124] l-wx------ 1 build build 64 Dec 2 20:16 3 -> /dev/null
ss -tn
State Recv-Q Send-Q Local Address:Port Peer Address:Port
ss -tln
State Recv-Q Send-Q Local Address:Port Peer Address:Port
ps xua | grep osmo
build 12378 0.0 0.0 21475109004 34636 ? R 20:16 0:00 ./src/sgsn/osmo-sgsn -c /build/tests/../doc/examples/osmo-sgsn/osmo-sgsn-accept-all.cfg build 12385 0.0 0.0 4280 744 ? S 20:16 0:00 /bin/sh -c ps xua | grep osmo build 12387 0.0 0.0 4280 84 ? R 20:16 0:00 /bin/sh -c ps xua | grep osmo
Socket: in 1 tries, connected to 127.0.0.1:4245 <socket.socket fd=4, family=AddressFamily.AF_INET, type=SocketKind.SOCK_STREAM, proto=0, laddr=('127.0.0.1', 46460), raddr=('127.0.0.1', 4245)> (1 sockets open) Socket: closing 127.0.0.1:4245 <socket.socket fd=4, family=AddressFamily.AF_INET, type=SocketKind.SOCK_STREAM, proto=0, laddr=('127.0.0.1', 46460), raddr=('127.0.0.1', 4245)> (0 sockets open) Terminating took 0.897s ok testVtyTree (__main__.TestVTYSGSN) ... Launching: PWD=/build './src/sgsn/osmo-sgsn' '-c' '/build/tests/../doc/examples/osmo-sgsn/osmo-sgsn-accept-all.cfg'
ls -l /proc/12278/fd
total 0 lr-x------ 1 build build 64 Dec 2 20:16 0 -> pipe:[213067122] l-wx------ 1 build build 64 Dec 2 20:16 1 -> pipe:[213067123] l-wx------ 1 build build 64 Dec 2 20:16 2 -> pipe:[213067124] l-wx------ 1 build build 64 Dec 2 20:16 3 -> /dev/null
ss -tn
State Recv-Q Send-Q Local Address:Port Peer Address:Port
ss -tln
State Recv-Q Send-Q Local Address:Port Peer Address:Port
ps xua | grep osmo
build 12389 0.0 0.0 21475109004 37840 ? R 20:16 0:00 ./src/sgsn/osmo-sgsn -c /build/tests/../doc/examples/osmo-sgsn/osmo-sgsn-accept-all.cfg build 12396 0.0 0.0 4280 740 ? S 20:16 0:00 /bin/sh -c ps xua | grep osmo build 12398 0.0 0.0 12784 956 ? S 20:16 0:00 grep osmo
Socket: in 1 tries, connected to 127.0.0.1:4245 <socket.socket fd=4, family=AddressFamily.AF_INET, type=SocketKind.SOCK_STREAM, proto=0, laddr=('127.0.0.1', 46464), raddr=('127.0.0.1', 4245)> (1 sockets open) Socket: closing 127.0.0.1:4245 <socket.socket fd=4, family=AddressFamily.AF_INET, type=SocketKind.SOCK_STREAM, proto=0, laddr=('127.0.0.1', 46464), raddr=('127.0.0.1', 4245)> (0 sockets open) Terminating took 0.897s ok
====================================================================== FAIL: testVtyShow (__main__.TestVTYGbproxy) ---------------------------------------------------------------------- Traceback (most recent call last): File "./vty_test_runner.py", line 98, in testVtyShow self.assertTrue(res.find('UDP bind') >= 0) AssertionError: False is not true
---------------------------------------------------------------------- Ran 11 tests in 15.830s
FAILED (failures=1) Makefile:711: recipe for target 'vty-python-test' failed make[7]: Leaving directory '/build/tests' make[7]: *** [vty-python-test] Error 1 Makefile:728: recipe for target 'vty-test' failed make[6]: Leaving directory '/build/tests' make[6]: *** [vty-test] Error 2 Makefile:705: recipe for target 'python-tests' failed make[5]: Leaving directory '/build/tests' make[5]: *** [python-tests] Error 2 make[4]: *** [check-local] Error 2 Makefile:736: recipe for target 'check-local' failed make[4]: Leaving directory '/build/tests' Makefile:565: recipe for target 'check-am' failed make[3]: Leaving directory '/build/tests' make[3]: *** [check-am] Error 2 Makefile:417: recipe for target 'check-recursive' failed make[2]: Leaving directory '/build/tests' make[2]: *** [check-recursive] Error 1 Makefile:461: recipe for target 'check-recursive' failed make[1]: Leaving directory '/build' make[1]: *** [check-recursive] Error 1 Makefile:752: recipe for target 'check' failed make: *** [check] Error 2 + cat-testlogs.sh Build step 'Execute shell' marked build as failure [WARNINGS]Skipping publisher since build result is FAILURE
Changes:
------------------------------------------ [...truncated 427.20 KB...] l-wx------ 1 build build 64 Dec 2 20:45 2 -> pipe:[214110673] l-wx------ 1 build build 64 Dec 2 20:45 3 -> /dev/null
ss -tn
State Recv-Q Send-Q Local Address:Port Peer Address:Port
ss -tln
State Recv-Q Send-Q Local Address:Port Peer Address:Port
ps xua | grep osmo
build 12544 0.0 0.0 21475109004 32164 ? S 20:46 0:00 ./src/sgsn/osmo-sgsn -c /build/tests/../doc/examples/osmo-sgsn/osmo-sgsn-accept-all.cfg build 12551 0.0 0.0 4280 768 ? S 20:46 0:00 /bin/sh -c ps xua | grep osmo build 12553 0.0 0.0 12784 1012 ? S 20:46 0:00 grep osmo
Socket: in 1 tries, connected to 127.0.0.1:4245 <socket.socket fd=4, family=AddressFamily.AF_INET, type=SocketKind.SOCK_STREAM, proto=0, laddr=('127.0.0.1', 46862), raddr=('127.0.0.1', 4245)> (1 sockets open) Socket: closing 127.0.0.1:4245 <socket.socket fd=4, family=AddressFamily.AF_INET, type=SocketKind.SOCK_STREAM, proto=0, laddr=('127.0.0.1', 46862), raddr=('127.0.0.1', 4245)> (0 sockets open) Terminating took 0.897s ok testVtyCDR (__main__.TestVTYSGSN) ... Launching: PWD=/build './src/sgsn/osmo-sgsn' '-c' '/build/tests/../doc/examples/osmo-sgsn/osmo-sgsn-accept-all.cfg'
ls -l /proc/12510/fd
total 0 lr-x------ 1 build build 64 Dec 2 20:45 0 -> pipe:[214110671] l-wx------ 1 build build 64 Dec 2 20:45 1 -> pipe:[214110672] l-wx------ 1 build build 64 Dec 2 20:45 2 -> pipe:[214110673] l-wx------ 1 build build 64 Dec 2 20:45 3 -> /dev/null
ss -tn
State Recv-Q Send-Q Local Address:Port Peer Address:Port
ss -tln
State Recv-Q Send-Q Local Address:Port Peer Address:Port
ps xua | grep osmo
build 12555 0.0 0.0 21475109004 26236 ? S 20:46 0:00 ./src/sgsn/osmo-sgsn -c /build/tests/../doc/examples/osmo-sgsn/osmo-sgsn-accept-all.cfg build 12562 0.0 0.0 4280 760 ? S 20:46 0:00 /bin/sh -c ps xua | grep osmo build 12564 0.0 0.0 12784 984 ? S 20:46 0:00 grep osmo
Socket: in 1 tries, connected to 127.0.0.1:4245 <socket.socket fd=4, family=AddressFamily.AF_INET, type=SocketKind.SOCK_STREAM, proto=0, laddr=('127.0.0.1', 46866), raddr=('127.0.0.1', 4245)> (1 sockets open) Socket: closing 127.0.0.1:4245 <socket.socket fd=4, family=AddressFamily.AF_INET, type=SocketKind.SOCK_STREAM, proto=0, laddr=('127.0.0.1', 46866), raddr=('127.0.0.1', 4245)> (0 sockets open) Terminating took 0.897s ok testVtyEasyAPN (__main__.TestVTYSGSN) ... Launching: PWD=/build './src/sgsn/osmo-sgsn' '-c' '/build/tests/../doc/examples/osmo-sgsn/osmo-sgsn-accept-all.cfg'
ls -l /proc/12510/fd
total 0 lr-x------ 1 build build 64 Dec 2 20:45 0 -> pipe:[214110671] l-wx------ 1 build build 64 Dec 2 20:45 1 -> pipe:[214110672] l-wx------ 1 build build 64 Dec 2 20:45 2 -> pipe:[214110673] l-wx------ 1 build build 64 Dec 2 20:45 3 -> /dev/null
ss -tn
State Recv-Q Send-Q Local Address:Port Peer Address:Port
ss -tln
State Recv-Q Send-Q Local Address:Port Peer Address:Port
ps xua | grep osmo
build 12566 0.0 0.0 21475109004 28544 ? S 20:46 0:00 ./src/sgsn/osmo-sgsn -c /build/tests/../doc/examples/osmo-sgsn/osmo-sgsn-accept-all.cfg build 12573 0.0 0.0 4280 712 ? S 20:46 0:00 /bin/sh -c ps xua | grep osmo build 12575 0.0 0.0 12784 956 ? S 20:46 0:00 grep osmo
Socket: in 1 tries, connected to 127.0.0.1:4245 <socket.socket fd=4, family=AddressFamily.AF_INET, type=SocketKind.SOCK_STREAM, proto=0, laddr=('127.0.0.1', 46870), raddr=('127.0.0.1', 4245)> (1 sockets open) Socket: closing 127.0.0.1:4245 <socket.socket fd=4, family=AddressFamily.AF_INET, type=SocketKind.SOCK_STREAM, proto=0, laddr=('127.0.0.1', 46870), raddr=('127.0.0.1', 4245)> (0 sockets open) Terminating took 0.897s ok testVtyGgsn (__main__.TestVTYSGSN) ... Launching: PWD=/build './src/sgsn/osmo-sgsn' '-c' '/build/tests/../doc/examples/osmo-sgsn/osmo-sgsn-accept-all.cfg'
ls -l /proc/12510/fd
total 0 lr-x------ 1 build build 64 Dec 2 20:45 0 -> pipe:[214110671] l-wx------ 1 build build 64 Dec 2 20:45 1 -> pipe:[214110672] l-wx------ 1 build build 64 Dec 2 20:45 2 -> pipe:[214110673] l-wx------ 1 build build 64 Dec 2 20:45 3 -> /dev/null
ss -tn
State Recv-Q Send-Q Local Address:Port Peer Address:Port
ss -tln
State Recv-Q Send-Q Local Address:Port Peer Address:Port
ps xua | grep osmo
build 12577 0.0 0.0 21475109004 28748 ? S 20:46 0:00 ./src/sgsn/osmo-sgsn -c /build/tests/../doc/examples/osmo-sgsn/osmo-sgsn-accept-all.cfg build 12584 0.0 0.0 4280 768 ? S 20:46 0:00 /bin/sh -c ps xua | grep osmo build 12586 0.0 0.0 12784 972 ? S 20:46 0:00 grep osmo
Socket: in 1 tries, connected to 127.0.0.1:4245 <socket.socket fd=4, family=AddressFamily.AF_INET, type=SocketKind.SOCK_STREAM, proto=0, laddr=('127.0.0.1', 46874), raddr=('127.0.0.1', 4245)> (1 sockets open) Socket: closing 127.0.0.1:4245 <socket.socket fd=4, family=AddressFamily.AF_INET, type=SocketKind.SOCK_STREAM, proto=0, laddr=('127.0.0.1', 46874), raddr=('127.0.0.1', 4245)> (0 sockets open) Terminating took 0.897s ok testVtyShow (__main__.TestVTYSGSN) ... Launching: PWD=/build './src/sgsn/osmo-sgsn' '-c' '/build/tests/../doc/examples/osmo-sgsn/osmo-sgsn-accept-all.cfg'
ls -l /proc/12510/fd
total 0 lr-x------ 1 build build 64 Dec 2 20:45 0 -> pipe:[214110671] l-wx------ 1 build build 64 Dec 2 20:45 1 -> pipe:[214110672] l-wx------ 1 build build 64 Dec 2 20:45 2 -> pipe:[214110673] l-wx------ 1 build build 64 Dec 2 20:45 3 -> /dev/null
ss -tn
State Recv-Q Send-Q Local Address:Port Peer Address:Port
ss -tln
State Recv-Q Send-Q Local Address:Port Peer Address:Port
ps xua | grep osmo
build 12588 0.0 0.0 21475109004 28820 ? S 20:46 0:00 ./src/sgsn/osmo-sgsn -c /build/tests/../doc/examples/osmo-sgsn/osmo-sgsn-accept-all.cfg build 12595 0.0 0.0 4280 704 ? S 20:46 0:00 /bin/sh -c ps xua | grep osmo build 12597 0.0 0.0 12784 932 ? S 20:46 0:00 grep osmo
Socket: in 1 tries, connected to 127.0.0.1:4245 <socket.socket fd=4, family=AddressFamily.AF_INET, type=SocketKind.SOCK_STREAM, proto=0, laddr=('127.0.0.1', 46878), raddr=('127.0.0.1', 4245)> (1 sockets open) Socket: closing 127.0.0.1:4245 <socket.socket fd=4, family=AddressFamily.AF_INET, type=SocketKind.SOCK_STREAM, proto=0, laddr=('127.0.0.1', 46878), raddr=('127.0.0.1', 4245)> (0 sockets open) Terminating took 0.897s ok testVtySubscriber (__main__.TestVTYSGSN) ... Launching: PWD=/build './src/sgsn/osmo-sgsn' '-c' '/build/tests/../doc/examples/osmo-sgsn/osmo-sgsn-accept-all.cfg'
ls -l /proc/12510/fd
total 0 lr-x------ 1 build build 64 Dec 2 20:45 0 -> pipe:[214110671] l-wx------ 1 build build 64 Dec 2 20:45 1 -> pipe:[214110672] l-wx------ 1 build build 64 Dec 2 20:45 2 -> pipe:[214110673] l-wx------ 1 build build 64 Dec 2 20:45 3 -> /dev/null
ss -tn
State Recv-Q Send-Q Local Address:Port Peer Address:Port
ss -tln
State Recv-Q Send-Q Local Address:Port Peer Address:Port
ps xua | grep osmo
build 12599 0.0 0.0 21475109004 28468 ? S 20:46 0:00 ./src/sgsn/osmo-sgsn -c /build/tests/../doc/examples/osmo-sgsn/osmo-sgsn-accept-all.cfg build 12606 0.0 0.0 4280 680 ? S 20:46 0:00 /bin/sh -c ps xua | grep osmo build 12608 0.0 0.0 12784 1028 ? S 20:46 0:00 grep osmo
Socket: in 1 tries, connected to 127.0.0.1:4245 <socket.socket fd=4, family=AddressFamily.AF_INET, type=SocketKind.SOCK_STREAM, proto=0, laddr=('127.0.0.1', 46882), raddr=('127.0.0.1', 4245)> (1 sockets open) Socket: closing 127.0.0.1:4245 <socket.socket fd=4, family=AddressFamily.AF_INET, type=SocketKind.SOCK_STREAM, proto=0, laddr=('127.0.0.1', 46882), raddr=('127.0.0.1', 4245)> (0 sockets open) Terminating took 0.897s ok testVtyTimers (__main__.TestVTYSGSN) ... Launching: PWD=/build './src/sgsn/osmo-sgsn' '-c' '/build/tests/../doc/examples/osmo-sgsn/osmo-sgsn-accept-all.cfg'
ls -l /proc/12510/fd
total 0 lr-x------ 1 build build 64 Dec 2 20:45 0 -> pipe:[214110671] l-wx------ 1 build build 64 Dec 2 20:45 1 -> pipe:[214110672] l-wx------ 1 build build 64 Dec 2 20:45 2 -> pipe:[214110673] l-wx------ 1 build build 64 Dec 2 20:45 3 -> /dev/null
ss -tn
State Recv-Q Send-Q Local Address:Port Peer Address:Port
ss -tln
State Recv-Q Send-Q Local Address:Port Peer Address:Port
ps xua | grep osmo
build 12610 0.0 0.0 21475109004 31476 ? S 20:46 0:00 ./src/sgsn/osmo-sgsn -c /build/tests/../doc/examples/osmo-sgsn/osmo-sgsn-accept-all.cfg build 12617 0.0 0.0 4280 772 ? S 20:46 0:00 /bin/sh -c ps xua | grep osmo build 12619 0.0 0.0 12784 980 ? S 20:46 0:00 grep osmo
Socket: in 1 tries, connected to 127.0.0.1:4245 <socket.socket fd=4, family=AddressFamily.AF_INET, type=SocketKind.SOCK_STREAM, proto=0, laddr=('127.0.0.1', 46886), raddr=('127.0.0.1', 4245)> (1 sockets open) Socket: closing 127.0.0.1:4245 <socket.socket fd=4, family=AddressFamily.AF_INET, type=SocketKind.SOCK_STREAM, proto=0, laddr=('127.0.0.1', 46886), raddr=('127.0.0.1', 4245)> (0 sockets open) Terminating took 0.897s ok testVtyTree (__main__.TestVTYSGSN) ... Launching: PWD=/build './src/sgsn/osmo-sgsn' '-c' '/build/tests/../doc/examples/osmo-sgsn/osmo-sgsn-accept-all.cfg'
ls -l /proc/12510/fd
total 0 lr-x------ 1 build build 64 Dec 2 20:45 0 -> pipe:[214110671] l-wx------ 1 build build 64 Dec 2 20:45 1 -> pipe:[214110672] l-wx------ 1 build build 64 Dec 2 20:45 2 -> pipe:[214110673] l-wx------ 1 build build 64 Dec 2 20:45 3 -> /dev/null
ss -tn
State Recv-Q Send-Q Local Address:Port Peer Address:Port
ss -tln
State Recv-Q Send-Q Local Address:Port Peer Address:Port
ps xua | grep osmo
build 12621 0.0 0.0 21475109004 26284 ? S 20:46 0:00 ./src/sgsn/osmo-sgsn -c /build/tests/../doc/examples/osmo-sgsn/osmo-sgsn-accept-all.cfg build 12628 0.0 0.0 4280 792 ? S 20:46 0:00 /bin/sh -c ps xua | grep osmo build 12630 0.0 0.0 12784 928 ? S 20:46 0:00 grep osmo
Socket: in 1 tries, connected to 127.0.0.1:4245 <socket.socket fd=4, family=AddressFamily.AF_INET, type=SocketKind.SOCK_STREAM, proto=0, laddr=('127.0.0.1', 46890), raddr=('127.0.0.1', 4245)> (1 sockets open) Socket: closing 127.0.0.1:4245 <socket.socket fd=4, family=AddressFamily.AF_INET, type=SocketKind.SOCK_STREAM, proto=0, laddr=('127.0.0.1', 46890), raddr=('127.0.0.1', 4245)> (0 sockets open) Terminating took 0.897s ok
====================================================================== FAIL: testVtyShow (__main__.TestVTYGbproxy) ---------------------------------------------------------------------- Traceback (most recent call last): File "./vty_test_runner.py", line 98, in testVtyShow self.assertTrue(res.find('UDP bind') >= 0) AssertionError: False is not true
---------------------------------------------------------------------- Ran 11 tests in 15.827s
FAILED (failures=1) make[7]: *** [vty-python-test] Error 1 Makefile:711: recipe for target 'vty-python-test' failed make[7]: Leaving directory '/build/tests' make[6]: *** [vty-test] Error 2 Makefile:728: recipe for target 'vty-test' failed make[6]: Leaving directory '/build/tests' make[5]: *** [python-tests] Error 2 Makefile:705: recipe for target 'python-tests' failed make[5]: Leaving directory '/build/tests' make[4]: *** [check-local] Error 2 Makefile:736: recipe for target 'check-local' failed make[4]: Leaving directory '/build/tests' Makefile:565: recipe for target 'check-am' failed make[3]: Leaving directory '/build/tests' make[3]: *** [check-am] Error 2 Makefile:417: recipe for target 'check-recursive' failed make[2]: Leaving directory '/build/tests' make[2]: *** [check-recursive] Error 1 Makefile:461: recipe for target 'check-recursive' failed make[1]: Leaving directory '/build' make[1]: *** [check-recursive] Error 1 Makefile:752: recipe for target 'check' failed make: *** [check] Error 2 + cat-testlogs.sh Build step 'Execute shell' marked build as failure [WARNINGS]Skipping publisher since build result is FAILURE
Changes:
------------------------------------------ [...truncated 428.93 KB...]
ss -tln
State Recv-Q Send-Q Local Address:Port Peer Address:Port LISTEN 0 10 127.0.0.1:4245 *:* LISTEN 0 10 127.0.0.1:4251 *:*
ps xua | grep osmo
build 12449 0.0 0.0 21475109000 25360 ? R 21:06 0:00 ./src/sgsn/osmo-sgsn -c /build/tests/../doc/examples/osmo-sgsn/osmo-sgsn-accept-all.cfg build 12456 0.0 0.0 4276 736 ? S 21:06 0:00 /bin/sh -c ps xua | grep osmo build 12458 0.0 0.0 4276 88 ? R 21:06 0:00 /bin/sh -c ps xua | grep osmo
Socket: in 1 tries, connected to 127.0.0.1:4245 <socket.socket fd=4, family=AddressFamily.AF_INET, type=SocketKind.SOCK_STREAM, proto=0, laddr=('127.0.0.1', 34236), raddr=('127.0.0.1', 4245)> (1 sockets open) Socket: closing 127.0.0.1:4245 <socket.socket fd=4, family=AddressFamily.AF_INET, type=SocketKind.SOCK_STREAM, proto=0, laddr=('127.0.0.1', 34236), raddr=('127.0.0.1', 4245)> (0 sockets open) Terminating took 0.897s ok testVtyCDR (__main__.TestVTYSGSN) ... Launching: PWD=/build './src/sgsn/osmo-sgsn' '-c' '/build/tests/../doc/examples/osmo-sgsn/osmo-sgsn-accept-all.cfg'
ls -l /proc/12415/fd
total 0 lr-x------ 1 build build 64 Dec 2 21:06 0 -> pipe:[3023118204] l-wx------ 1 build build 64 Dec 2 21:06 1 -> pipe:[3023118205] l-wx------ 1 build build 64 Dec 2 21:06 2 -> pipe:[3023118206] l-wx------ 1 build build 64 Dec 2 21:06 3 -> /dev/null
ss -tn
State Recv-Q Send-Q Local Address:Port Peer Address:Port
ss -tln
State Recv-Q Send-Q Local Address:Port Peer Address:Port
ps xua | grep osmo
build 12460 0.0 0.0 21474976640 17748 ? D 21:06 0:00 ./src/sgsn/osmo-sgsn -c /build/tests/../doc/examples/osmo-sgsn/osmo-sgsn-accept-all.cfg build 12467 0.0 0.0 4276 716 ? S 21:06 0:00 /bin/sh -c ps xua | grep osmo build 12469 0.0 0.0 12780 964 ? S 21:06 0:00 grep osmo
Socket: in 1 tries, connected to 127.0.0.1:4245 <socket.socket fd=4, family=AddressFamily.AF_INET, type=SocketKind.SOCK_STREAM, proto=0, laddr=('127.0.0.1', 34240), raddr=('127.0.0.1', 4245)> (1 sockets open) Socket: closing 127.0.0.1:4245 <socket.socket fd=4, family=AddressFamily.AF_INET, type=SocketKind.SOCK_STREAM, proto=0, laddr=('127.0.0.1', 34240), raddr=('127.0.0.1', 4245)> (0 sockets open) Terminating took 0.897s ok testVtyEasyAPN (__main__.TestVTYSGSN) ... Launching: PWD=/build './src/sgsn/osmo-sgsn' '-c' '/build/tests/../doc/examples/osmo-sgsn/osmo-sgsn-accept-all.cfg'
ls -l /proc/12415/fd
total 0 lr-x------ 1 build build 64 Dec 2 21:06 0 -> pipe:[3023118204] l-wx------ 1 build build 64 Dec 2 21:06 1 -> pipe:[3023118205] l-wx------ 1 build build 64 Dec 2 21:06 2 -> pipe:[3023118206] l-wx------ 1 build build 64 Dec 2 21:06 3 -> /dev/null
ss -tn
State Recv-Q Send-Q Local Address:Port Peer Address:Port
ss -tln
State Recv-Q Send-Q Local Address:Port Peer Address:Port
ps xua | grep osmo
build 12471 0.0 0.0 21474976640 17868 ? D 21:06 0:00 ./src/sgsn/osmo-sgsn -c /build/tests/../doc/examples/osmo-sgsn/osmo-sgsn-accept-all.cfg build 12478 0.0 0.0 4276 724 ? S 21:06 0:00 /bin/sh -c ps xua | grep osmo build 12480 0.0 0.0 12780 968 ? S 21:06 0:00 grep osmo
Socket: in 1 tries, connected to 127.0.0.1:4245 <socket.socket fd=4, family=AddressFamily.AF_INET, type=SocketKind.SOCK_STREAM, proto=0, laddr=('127.0.0.1', 34256), raddr=('127.0.0.1', 4245)> (1 sockets open) Socket: closing 127.0.0.1:4245 <socket.socket fd=4, family=AddressFamily.AF_INET, type=SocketKind.SOCK_STREAM, proto=0, laddr=('127.0.0.1', 34256), raddr=('127.0.0.1', 4245)> (0 sockets open) Terminating took 0.897s ok testVtyGgsn (__main__.TestVTYSGSN) ... Launching: PWD=/build './src/sgsn/osmo-sgsn' '-c' '/build/tests/../doc/examples/osmo-sgsn/osmo-sgsn-accept-all.cfg'
ls -l /proc/12415/fd
total 0 lr-x------ 1 build build 64 Dec 2 21:06 0 -> pipe:[3023118204] l-wx------ 1 build build 64 Dec 2 21:06 1 -> pipe:[3023118205] l-wx------ 1 build build 64 Dec 2 21:06 2 -> pipe:[3023118206] l-wx------ 1 build build 64 Dec 2 21:06 3 -> /dev/null
ss -tn
State Recv-Q Send-Q Local Address:Port Peer Address:Port
ss -tln
State Recv-Q Send-Q Local Address:Port Peer Address:Port LISTEN 0 10 127.0.0.1:4245 *:* LISTEN 0 10 127.0.0.1:4251 *:*
ps xua | grep osmo
build 12482 0.0 0.0 21475109000 17916 ? S 21:07 0:00 ./src/sgsn/osmo-sgsn -c /build/tests/../doc/examples/osmo-sgsn/osmo-sgsn-accept-all.cfg build 12489 0.0 0.0 4276 716 ? S 21:07 0:00 /bin/sh -c ps xua | grep osmo build 12491 0.0 0.0 4276 88 ? R 21:07 0:00 /bin/sh -c ps xua | grep osmo
Socket: in 1 tries, connected to 127.0.0.1:4245 <socket.socket fd=4, family=AddressFamily.AF_INET, type=SocketKind.SOCK_STREAM, proto=0, laddr=('127.0.0.1', 34270), raddr=('127.0.0.1', 4245)> (1 sockets open) Socket: closing 127.0.0.1:4245 <socket.socket fd=4, family=AddressFamily.AF_INET, type=SocketKind.SOCK_STREAM, proto=0, laddr=('127.0.0.1', 34270), raddr=('127.0.0.1', 4245)> (0 sockets open) Terminating took 0.897s ok testVtyShow (__main__.TestVTYSGSN) ... Launching: PWD=/build './src/sgsn/osmo-sgsn' '-c' '/build/tests/../doc/examples/osmo-sgsn/osmo-sgsn-accept-all.cfg'
ls -l /proc/12415/fd
total 0 lr-x------ 1 build build 64 Dec 2 21:06 0 -> pipe:[3023118204] l-wx------ 1 build build 64 Dec 2 21:06 1 -> pipe:[3023118205] l-wx------ 1 build build 64 Dec 2 21:06 2 -> pipe:[3023118206] l-wx------ 1 build build 64 Dec 2 21:06 3 -> /dev/null
ss -tn
State Recv-Q Send-Q Local Address:Port Peer Address:Port
ss -tln
State Recv-Q Send-Q Local Address:Port Peer Address:Port LISTEN 0 10 127.0.0.1:4245 *:* LISTEN 0 10 127.0.0.1:4251 *:*
ps xua | grep osmo
build 12493 0.0 0.0 21475109000 18084 ? S 21:07 0:00 ./src/sgsn/osmo-sgsn -c /build/tests/../doc/examples/osmo-sgsn/osmo-sgsn-accept-all.cfg build 12500 0.0 0.0 4276 728 ? S 21:07 0:00 /bin/sh -c ps xua | grep osmo build 12502 0.0 0.0 10976 920 ? R 21:07 0:00 grep osmo
Socket: in 1 tries, connected to 127.0.0.1:4245 <socket.socket fd=4, family=AddressFamily.AF_INET, type=SocketKind.SOCK_STREAM, proto=0, laddr=('127.0.0.1', 34286), raddr=('127.0.0.1', 4245)> (1 sockets open) Socket: closing 127.0.0.1:4245 <socket.socket fd=4, family=AddressFamily.AF_INET, type=SocketKind.SOCK_STREAM, proto=0, laddr=('127.0.0.1', 34286), raddr=('127.0.0.1', 4245)> (0 sockets open) Terminating took 0.897s ok testVtySubscriber (__main__.TestVTYSGSN) ... Launching: PWD=/build './src/sgsn/osmo-sgsn' '-c' '/build/tests/../doc/examples/osmo-sgsn/osmo-sgsn-accept-all.cfg'
ls -l /proc/12415/fd
total 0 lr-x------ 1 build build 64 Dec 2 21:06 0 -> pipe:[3023118204] l-wx------ 1 build build 64 Dec 2 21:06 1 -> pipe:[3023118205] l-wx------ 1 build build 64 Dec 2 21:06 2 -> pipe:[3023118206] l-wx------ 1 build build 64 Dec 2 21:06 3 -> /dev/null
ss -tn
State Recv-Q Send-Q Local Address:Port Peer Address:Port
ss -tln
State Recv-Q Send-Q Local Address:Port Peer Address:Port
ps xua | grep osmo
build 12504 0.0 0.0 21475109000 20472 ? R 21:07 0:00 ./src/sgsn/osmo-sgsn -c /build/tests/../doc/examples/osmo-sgsn/osmo-sgsn-accept-all.cfg build 12511 0.0 0.0 4276 724 ? S 21:07 0:00 /bin/sh -c ps xua | grep osmo build 12513 0.0 0.0 12780 940 ? S 21:07 0:00 grep osmo
Socket: in 1 tries, connected to 127.0.0.1:4245 <socket.socket fd=4, family=AddressFamily.AF_INET, type=SocketKind.SOCK_STREAM, proto=0, laddr=('127.0.0.1', 34310), raddr=('127.0.0.1', 4245)> (1 sockets open) Socket: closing 127.0.0.1:4245 <socket.socket fd=4, family=AddressFamily.AF_INET, type=SocketKind.SOCK_STREAM, proto=0, laddr=('127.0.0.1', 34310), raddr=('127.0.0.1', 4245)> (0 sockets open) Terminating took 0.897s ok testVtyTimers (__main__.TestVTYSGSN) ... Launching: PWD=/build './src/sgsn/osmo-sgsn' '-c' '/build/tests/../doc/examples/osmo-sgsn/osmo-sgsn-accept-all.cfg'
ls -l /proc/12415/fd
total 0 lr-x------ 1 build build 64 Dec 2 21:06 0 -> pipe:[3023118204] l-wx------ 1 build build 64 Dec 2 21:06 1 -> pipe:[3023118205] l-wx------ 1 build build 64 Dec 2 21:06 2 -> pipe:[3023118206] l-wx------ 1 build build 64 Dec 2 21:06 3 -> /dev/null
ss -tn
State Recv-Q Send-Q Local Address:Port Peer Address:Port
ss -tln
State Recv-Q Send-Q Local Address:Port Peer Address:Port
ps xua | grep osmo
build 12515 0.0 0.0 21475042820 24944 ? R 21:07 0:00 ./src/sgsn/osmo-sgsn -c /build/tests/../doc/examples/osmo-sgsn/osmo-sgsn-accept-all.cfg build 12522 0.0 0.0 4276 712 ? S 21:07 0:00 /bin/sh -c ps xua | grep osmo build 12524 0.0 0.0 4276 84 ? R 21:07 0:00 /bin/sh -c ps xua | grep osmo
Socket: in 1 tries, connected to 127.0.0.1:4245 <socket.socket fd=4, family=AddressFamily.AF_INET, type=SocketKind.SOCK_STREAM, proto=0, laddr=('127.0.0.1', 34314), raddr=('127.0.0.1', 4245)> (1 sockets open) Socket: closing 127.0.0.1:4245 <socket.socket fd=4, family=AddressFamily.AF_INET, type=SocketKind.SOCK_STREAM, proto=0, laddr=('127.0.0.1', 34314), raddr=('127.0.0.1', 4245)> (0 sockets open) Terminating took 0.897s ok testVtyTree (__main__.TestVTYSGSN) ... Launching: PWD=/build './src/sgsn/osmo-sgsn' '-c' '/build/tests/../doc/examples/osmo-sgsn/osmo-sgsn-accept-all.cfg'
ls -l /proc/12415/fd
total 0 lr-x------ 1 build build 64 Dec 2 21:06 0 -> pipe:[3023118204] l-wx------ 1 build build 64 Dec 2 21:06 1 -> pipe:[3023118205] l-wx------ 1 build build 64 Dec 2 21:06 2 -> pipe:[3023118206] l-wx------ 1 build build 64 Dec 2 21:06 3 -> /dev/null
ss -tn
State Recv-Q Send-Q Local Address:Port Peer Address:Port
ss -tln
State Recv-Q Send-Q Local Address:Port Peer Address:Port
ps xua | grep osmo
build 12526 0.0 0.0 21474976640 17788 ? D 21:07 0:00 ./src/sgsn/osmo-sgsn -c /build/tests/../doc/examples/osmo-sgsn/osmo-sgsn-accept-all.cfg build 12533 0.0 0.0 4276 716 ? S 21:07 0:00 /bin/sh -c ps xua | grep osmo build 12535 0.0 0.0 12780 944 ? S 21:07 0:00 grep osmo
Socket: in 1 tries, connected to 127.0.0.1:4245 <socket.socket fd=4, family=AddressFamily.AF_INET, type=SocketKind.SOCK_STREAM, proto=0, laddr=('127.0.0.1', 34316), raddr=('127.0.0.1', 4245)> (1 sockets open) Socket: closing 127.0.0.1:4245 <socket.socket fd=4, family=AddressFamily.AF_INET, type=SocketKind.SOCK_STREAM, proto=0, laddr=('127.0.0.1', 34316), raddr=('127.0.0.1', 4245)> (0 sockets open) Terminating took 0.897s ok
====================================================================== FAIL: testVtyShow (__main__.TestVTYGbproxy) ---------------------------------------------------------------------- Traceback (most recent call last): File "./vty_test_runner.py", line 98, in testVtyShow self.assertTrue(res.find('UDP bind') >= 0) AssertionError: False is not true
---------------------------------------------------------------------- Ran 11 tests in 15.891s
FAILED (failures=1) make[7]: *** [vty-python-test] Error 1 Makefile:711: recipe for target 'vty-python-test' failed make[7]: Leaving directory '/build/tests' make[6]: *** [vty-test] Error 2 Makefile:728: recipe for target 'vty-test' failed make[6]: Leaving directory '/build/tests' make[5]: *** [python-tests] Error 2 Makefile:705: recipe for target 'python-tests' failed make[5]: Leaving directory '/build/tests' make[4]: *** [check-local] Error 2 Makefile:736: recipe for target 'check-local' failed make[4]: Leaving directory '/build/tests' Makefile:565: recipe for target 'check-am' failed make[3]: Leaving directory '/build/tests' make[3]: *** [check-am] Error 2 Makefile:417: recipe for target 'check-recursive' failed make[2]: Leaving directory '/build/tests' make[2]: *** [check-recursive] Error 1 Makefile:461: recipe for target 'check-recursive' failed make[1]: *** [check-recursive] Error 1 make: *** [check] Error 2 make[1]: Leaving directory '/build' Makefile:752: recipe for target 'check' failed + cat-testlogs.sh Build step 'Execute shell' marked build as failure [WARNINGS]Skipping publisher since build result is FAILURE
Changes:
------------------------------------------ [...truncated 428.71 KB...]
ss -tn
State Recv-Q Send-Q Local Address:Port Peer Address:Port
ss -tln
State Recv-Q Send-Q Local Address:Port Peer Address:Port LISTEN 0 10 127.0.0.1:4245 *:* LISTEN 0 10 127.0.0.1:4251 *:*
ps xua | grep osmo
build 12320 0.0 0.0 21475109004 31844 ? S 21:07 0:00 ./src/sgsn/osmo-sgsn -c /build/tests/../doc/examples/osmo-sgsn/osmo-sgsn-accept-all.cfg build 12327 0.0 0.0 4280 748 ? S 21:07 0:00 /bin/sh -c ps xua | grep osmo build 12329 0.0 0.0 12784 992 ? R 21:07 0:00 grep osmo
Socket: in 1 tries, connected to 127.0.0.1:4245 <socket.socket fd=4, family=AddressFamily.AF_INET, type=SocketKind.SOCK_STREAM, proto=0, laddr=('127.0.0.1', 47774), raddr=('127.0.0.1', 4245)> (1 sockets open) Socket: closing 127.0.0.1:4245 <socket.socket fd=4, family=AddressFamily.AF_INET, type=SocketKind.SOCK_STREAM, proto=0, laddr=('127.0.0.1', 47774), raddr=('127.0.0.1', 4245)> (0 sockets open) Terminating took 0.897s ok testVtyCDR (__main__.TestVTYSGSN) ... Launching: PWD=/build './src/sgsn/osmo-sgsn' '-c' '/build/tests/../doc/examples/osmo-sgsn/osmo-sgsn-accept-all.cfg'
ls -l /proc/12286/fd
total 0 lr-x------ 1 build build 64 Dec 2 21:07 0 -> pipe:[214863634] l-wx------ 1 build build 64 Dec 2 21:07 1 -> pipe:[214863635] l-wx------ 1 build build 64 Dec 2 21:07 2 -> pipe:[214863636] l-wx------ 1 build build 64 Dec 2 21:07 3 -> /dev/null
ss -tn
State Recv-Q Send-Q Local Address:Port Peer Address:Port
ss -tln
State Recv-Q Send-Q Local Address:Port Peer Address:Port
ps xua | grep osmo
build 12331 0.0 0.0 21475109004 28516 ? S 21:07 0:00 ./src/sgsn/osmo-sgsn -c /build/tests/../doc/examples/osmo-sgsn/osmo-sgsn-accept-all.cfg build 12338 0.0 0.0 4280 736 ? S 21:07 0:00 /bin/sh -c ps xua | grep osmo build 12340 0.0 0.0 12784 940 ? R 21:07 0:00 grep osmo
Socket: in 1 tries, connected to 127.0.0.1:4245 <socket.socket fd=4, family=AddressFamily.AF_INET, type=SocketKind.SOCK_STREAM, proto=0, laddr=('127.0.0.1', 47780), raddr=('127.0.0.1', 4245)> (1 sockets open) Socket: closing 127.0.0.1:4245 <socket.socket fd=4, family=AddressFamily.AF_INET, type=SocketKind.SOCK_STREAM, proto=0, laddr=('127.0.0.1', 47780), raddr=('127.0.0.1', 4245)> (0 sockets open) Terminating took 0.897s ok testVtyEasyAPN (__main__.TestVTYSGSN) ... Launching: PWD=/build './src/sgsn/osmo-sgsn' '-c' '/build/tests/../doc/examples/osmo-sgsn/osmo-sgsn-accept-all.cfg'
ls -l /proc/12286/fd
total 0 lr-x------ 1 build build 64 Dec 2 21:07 0 -> pipe:[214863634] l-wx------ 1 build build 64 Dec 2 21:07 1 -> pipe:[214863635] l-wx------ 1 build build 64 Dec 2 21:07 2 -> pipe:[214863636] l-wx------ 1 build build 64 Dec 2 21:07 3 -> /dev/null
ss -tn
State Recv-Q Send-Q Local Address:Port Peer Address:Port
ss -tln
State Recv-Q Send-Q Local Address:Port Peer Address:Port LISTEN 0 10 127.0.0.1:4245 *:* LISTEN 0 10 127.0.0.1:4251 *:*
ps xua | grep osmo
build 12342 0.0 0.0 21475109004 28812 ? S 21:07 0:00 ./src/sgsn/osmo-sgsn -c /build/tests/../doc/examples/osmo-sgsn/osmo-sgsn-accept-all.cfg build 12349 0.0 0.0 4280 700 ? S 21:07 0:00 /bin/sh -c ps xua | grep osmo build 12351 0.0 0.0 12784 972 ? S 21:07 0:00 grep osmo
Socket: in 1 tries, connected to 127.0.0.1:4245 <socket.socket fd=4, family=AddressFamily.AF_INET, type=SocketKind.SOCK_STREAM, proto=0, laddr=('127.0.0.1', 47782), raddr=('127.0.0.1', 4245)> (1 sockets open) Socket: closing 127.0.0.1:4245 <socket.socket fd=4, family=AddressFamily.AF_INET, type=SocketKind.SOCK_STREAM, proto=0, laddr=('127.0.0.1', 47782), raddr=('127.0.0.1', 4245)> (0 sockets open) Terminating took 0.897s ok testVtyGgsn (__main__.TestVTYSGSN) ... Launching: PWD=/build './src/sgsn/osmo-sgsn' '-c' '/build/tests/../doc/examples/osmo-sgsn/osmo-sgsn-accept-all.cfg'
ls -l /proc/12286/fd
total 0 lr-x------ 1 build build 64 Dec 2 21:07 0 -> pipe:[214863634] l-wx------ 1 build build 64 Dec 2 21:07 1 -> pipe:[214863635] l-wx------ 1 build build 64 Dec 2 21:07 2 -> pipe:[214863636] l-wx------ 1 build build 64 Dec 2 21:07 3 -> /dev/null
ss -tn
State Recv-Q Send-Q Local Address:Port Peer Address:Port
ss -tln
State Recv-Q Send-Q Local Address:Port Peer Address:Port
ps xua | grep osmo
build 12353 0.0 0.0 21475042824 33092 ? R 21:07 0:00 ./src/sgsn/osmo-sgsn -c /build/tests/../doc/examples/osmo-sgsn/osmo-sgsn-accept-all.cfg build 12360 0.0 0.0 4280 736 ? S 21:07 0:00 /bin/sh -c ps xua | grep osmo build 12362 0.0 0.0 12784 1024 ? S 21:07 0:00 grep osmo
Socket: in 1 tries, connected to 127.0.0.1:4245 <socket.socket fd=4, family=AddressFamily.AF_INET, type=SocketKind.SOCK_STREAM, proto=0, laddr=('127.0.0.1', 47788), raddr=('127.0.0.1', 4245)> (1 sockets open) Socket: closing 127.0.0.1:4245 <socket.socket fd=4, family=AddressFamily.AF_INET, type=SocketKind.SOCK_STREAM, proto=0, laddr=('127.0.0.1', 47788), raddr=('127.0.0.1', 4245)> (0 sockets open) Terminating took 0.897s ok testVtyShow (__main__.TestVTYSGSN) ... Launching: PWD=/build './src/sgsn/osmo-sgsn' '-c' '/build/tests/../doc/examples/osmo-sgsn/osmo-sgsn-accept-all.cfg'
ls -l /proc/12286/fd
total 0 lr-x------ 1 build build 64 Dec 2 21:07 0 -> pipe:[214863634] l-wx------ 1 build build 64 Dec 2 21:07 1 -> pipe:[214863635] l-wx------ 1 build build 64 Dec 2 21:07 2 -> pipe:[214863636] l-wx------ 1 build build 64 Dec 2 21:07 3 -> /dev/null
ss -tn
State Recv-Q Send-Q Local Address:Port Peer Address:Port
ss -tln
State Recv-Q Send-Q Local Address:Port Peer Address:Port
ps xua | grep osmo
build 12364 0.0 0.0 21475042824 26384 ? R 21:07 0:00 ./src/sgsn/osmo-sgsn -c /build/tests/../doc/examples/osmo-sgsn/osmo-sgsn-accept-all.cfg build 12371 0.0 0.0 4280 756 ? S 21:07 0:00 /bin/sh -c ps xua | grep osmo build 12373 0.0 0.0 12784 940 ? S 21:07 0:00 grep osmo
Socket: in 1 tries, connected to 127.0.0.1:4245 <socket.socket fd=4, family=AddressFamily.AF_INET, type=SocketKind.SOCK_STREAM, proto=0, laddr=('127.0.0.1', 47790), raddr=('127.0.0.1', 4245)> (1 sockets open) Socket: closing 127.0.0.1:4245 <socket.socket fd=4, family=AddressFamily.AF_INET, type=SocketKind.SOCK_STREAM, proto=0, laddr=('127.0.0.1', 47790), raddr=('127.0.0.1', 4245)> (0 sockets open) Terminating took 0.897s ok testVtySubscriber (__main__.TestVTYSGSN) ... Launching: PWD=/build './src/sgsn/osmo-sgsn' '-c' '/build/tests/../doc/examples/osmo-sgsn/osmo-sgsn-accept-all.cfg'
ls -l /proc/12286/fd
total 0 lr-x------ 1 build build 64 Dec 2 21:07 0 -> pipe:[214863634] l-wx------ 1 build build 64 Dec 2 21:07 1 -> pipe:[214863635] l-wx------ 1 build build 64 Dec 2 21:07 2 -> pipe:[214863636] l-wx------ 1 build build 64 Dec 2 21:07 3 -> /dev/null
ss -tn
State Recv-Q Send-Q Local Address:Port Peer Address:Port
ss -tln
State Recv-Q Send-Q Local Address:Port Peer Address:Port
ps xua | grep osmo
build 12375 0.0 0.0 21475109004 35196 ? R 21:07 0:00 ./src/sgsn/osmo-sgsn -c /build/tests/../doc/examples/osmo-sgsn/osmo-sgsn-accept-all.cfg build 12382 0.0 0.0 4280 756 ? S 21:07 0:00 /bin/sh -c ps xua | grep osmo build 12384 0.0 0.0 12784 948 ? S 21:07 0:00 grep osmo
Socket: in 1 tries, connected to 127.0.0.1:4245 <socket.socket fd=4, family=AddressFamily.AF_INET, type=SocketKind.SOCK_STREAM, proto=0, laddr=('127.0.0.1', 47792), raddr=('127.0.0.1', 4245)> (1 sockets open) Socket: closing 127.0.0.1:4245 <socket.socket fd=4, family=AddressFamily.AF_INET, type=SocketKind.SOCK_STREAM, proto=0, laddr=('127.0.0.1', 47792), raddr=('127.0.0.1', 4245)> (0 sockets open) Terminating took 0.897s ok testVtyTimers (__main__.TestVTYSGSN) ... Launching: PWD=/build './src/sgsn/osmo-sgsn' '-c' '/build/tests/../doc/examples/osmo-sgsn/osmo-sgsn-accept-all.cfg'
ls -l /proc/12286/fd
total 0 lr-x------ 1 build build 64 Dec 2 21:07 0 -> pipe:[214863634] l-wx------ 1 build build 64 Dec 2 21:07 1 -> pipe:[214863635] l-wx------ 1 build build 64 Dec 2 21:07 2 -> pipe:[214863636] l-wx------ 1 build build 64 Dec 2 21:07 3 -> /dev/null
ss -tn
State Recv-Q Send-Q Local Address:Port Peer Address:Port
ss -tln
State Recv-Q Send-Q Local Address:Port Peer Address:Port
ps xua | grep osmo
build 12386 0.0 0.0 21475109004 34320 ? R 21:07 0:00 ./src/sgsn/osmo-sgsn -c /build/tests/../doc/examples/osmo-sgsn/osmo-sgsn-accept-all.cfg build 12393 0.0 0.0 4280 796 ? S 21:07 0:00 /bin/sh -c ps xua | grep osmo build 12395 0.0 0.0 12784 968 ? S 21:07 0:00 grep osmo
Socket: in 1 tries, connected to 127.0.0.1:4245 <socket.socket fd=4, family=AddressFamily.AF_INET, type=SocketKind.SOCK_STREAM, proto=0, laddr=('127.0.0.1', 47794), raddr=('127.0.0.1', 4245)> (1 sockets open) Socket: closing 127.0.0.1:4245 <socket.socket fd=4, family=AddressFamily.AF_INET, type=SocketKind.SOCK_STREAM, proto=0, laddr=('127.0.0.1', 47794), raddr=('127.0.0.1', 4245)> (0 sockets open) Terminating took 0.897s ok testVtyTree (__main__.TestVTYSGSN) ... Launching: PWD=/build './src/sgsn/osmo-sgsn' '-c' '/build/tests/../doc/examples/osmo-sgsn/osmo-sgsn-accept-all.cfg'
ls -l /proc/12286/fd
total 0 lr-x------ 1 build build 64 Dec 2 21:07 0 -> pipe:[214863634] l-wx------ 1 build build 64 Dec 2 21:07 1 -> pipe:[214863635] l-wx------ 1 build build 64 Dec 2 21:07 2 -> pipe:[214863636] l-wx------ 1 build build 64 Dec 2 21:07 3 -> /dev/null
ss -tn
State Recv-Q Send-Q Local Address:Port Peer Address:Port
ss -tln
State Recv-Q Send-Q Local Address:Port Peer Address:Port
ps xua | grep osmo
build 12397 0.0 0.0 21475109004 30932 ? S 21:07 0:00 ./src/sgsn/osmo-sgsn -c /build/tests/../doc/examples/osmo-sgsn/osmo-sgsn-accept-all.cfg build 12404 0.0 0.0 4280 712 ? S 21:07 0:00 /bin/sh -c ps xua | grep osmo build 12406 0.0 0.0 12784 968 ? S 21:07 0:00 grep osmo
Socket: in 1 tries, connected to 127.0.0.1:4245 <socket.socket fd=4, family=AddressFamily.AF_INET, type=SocketKind.SOCK_STREAM, proto=0, laddr=('127.0.0.1', 47796), raddr=('127.0.0.1', 4245)> (1 sockets open) Socket: closing 127.0.0.1:4245 <socket.socket fd=4, family=AddressFamily.AF_INET, type=SocketKind.SOCK_STREAM, proto=0, laddr=('127.0.0.1', 47796), raddr=('127.0.0.1', 4245)> (0 sockets open) Terminating took 0.897s ok
====================================================================== FAIL: testVtyShow (__main__.TestVTYGbproxy) ---------------------------------------------------------------------- Traceback (most recent call last): File "./vty_test_runner.py", line 98, in testVtyShow self.assertTrue(res.find('UDP bind') >= 0) AssertionError: False is not true
---------------------------------------------------------------------- Ran 11 tests in 15.881s
FAILED (failures=1) Makefile:711: recipe for target 'vty-python-test' failed make[7]: Leaving directory '/build/tests' make[7]: *** [vty-python-test] Error 1 Makefile:728: recipe for target 'vty-test' failed make[6]: *** [vty-test] Error 2 make[6]: Leaving directory '/build/tests' Makefile:705: recipe for target 'python-tests' failed make[5]: Leaving directory '/build/tests' make[5]: *** [python-tests] Error 2 Makefile:736: recipe for target 'check-local' failed make[4]: *** [check-local] Error 2 make[4]: Leaving directory '/build/tests' make[3]: *** [check-am] Error 2 Makefile:565: recipe for target 'check-am' failed make[3]: Leaving directory '/build/tests' Makefile:417: recipe for target 'check-recursive' failed make[2]: Leaving directory '/build/tests' make[2]: *** [check-recursive] Error 1 make[1]: *** [check-recursive] Error 1 Makefile:461: recipe for target 'check-recursive' failed make[1]: Leaving directory '/build' Makefile:752: recipe for target 'check' failed make: *** [check] Error 2 + cat-testlogs.sh Build step 'Execute shell' marked build as failure [WARNINGS]Skipping publisher since build result is FAILURE
Changes:
------------------------------------------ [...truncated 398.16 KB...]
ss -tn
State Recv-Q Send-Q Local Address:Port Peer Address:Port
ss -tln
State Recv-Q Send-Q Local Address:Port Peer Address:Port
ps xua | grep osmo
build 12573 0.0 0.0 21475044908 30144 ? R 21:11 0:00 ./src/sgsn/osmo-sgsn -c /build/tests/../doc/examples/osmo-sgsn/osmo-sgsn-accept-all.cfg build 12580 0.0 0.0 4280 720 ? S 21:11 0:00 /bin/sh -c ps xua | grep osmo build 12582 0.0 0.0 12784 932 ? S 21:11 0:00 grep osmo
Socket: in 1 tries, connected to 127.0.0.1:4245 <socket.socket fd=4, family=AddressFamily.AF_INET, type=SocketKind.SOCK_STREAM, proto=0, laddr=('127.0.0.1', 48402), raddr=('127.0.0.1', 4245)> (1 sockets open) Socket: closing 127.0.0.1:4245 <socket.socket fd=4, family=AddressFamily.AF_INET, type=SocketKind.SOCK_STREAM, proto=0, laddr=('127.0.0.1', 48402), raddr=('127.0.0.1', 4245)> (0 sockets open) Terminating took 0.897s ok testVtyCDR (__main__.TestVTYSGSN) ... Launching: PWD=/build './src/sgsn/osmo-sgsn' '-c' '/build/tests/../doc/examples/osmo-sgsn/osmo-sgsn-accept-all.cfg'
ls -l /proc/12539/fd
total 0 lr-x------ 1 build build 64 Dec 2 21:11 0 -> pipe:[215489133] l-wx------ 1 build build 64 Dec 2 21:11 1 -> pipe:[215489134] l-wx------ 1 build build 64 Dec 2 21:11 2 -> pipe:[215489135] l-wx------ 1 build build 64 Dec 2 21:11 3 -> /dev/null
ss -tn
State Recv-Q Send-Q Local Address:Port Peer Address:Port
ss -tln
State Recv-Q Send-Q Local Address:Port Peer Address:Port
ps xua | grep osmo
build 12584 0.0 0.0 21475111088 37344 ? R 21:11 0:00 ./src/sgsn/osmo-sgsn -c /build/tests/../doc/examples/osmo-sgsn/osmo-sgsn-accept-all.cfg build 12591 0.0 0.0 4280 708 ? S 21:11 0:00 /bin/sh -c ps xua | grep osmo build 12593 0.0 0.0 12784 1028 ? S 21:11 0:00 grep osmo
Socket: in 1 tries, connected to 127.0.0.1:4245 <socket.socket fd=4, family=AddressFamily.AF_INET, type=SocketKind.SOCK_STREAM, proto=0, laddr=('127.0.0.1', 48410), raddr=('127.0.0.1', 4245)> (1 sockets open) Socket: closing 127.0.0.1:4245 <socket.socket fd=4, family=AddressFamily.AF_INET, type=SocketKind.SOCK_STREAM, proto=0, laddr=('127.0.0.1', 48410), raddr=('127.0.0.1', 4245)> (0 sockets open) Terminating took 0.897s ok testVtyEasyAPN (__main__.TestVTYSGSN) ... Launching: PWD=/build './src/sgsn/osmo-sgsn' '-c' '/build/tests/../doc/examples/osmo-sgsn/osmo-sgsn-accept-all.cfg'
ls -l /proc/12539/fd
total 0 lr-x------ 1 build build 64 Dec 2 21:11 0 -> pipe:[215489133] l-wx------ 1 build build 64 Dec 2 21:11 1 -> pipe:[215489134] l-wx------ 1 build build 64 Dec 2 21:11 2 -> pipe:[215489135] l-wx------ 1 build build 64 Dec 2 21:11 3 -> /dev/null
ss -tn
State Recv-Q Send-Q Local Address:Port Peer Address:Port
ss -tln
State Recv-Q Send-Q Local Address:Port Peer Address:Port
ps xua | grep osmo
build 12595 0.0 0.0 21475044908 32248 ? R 21:11 0:00 ./src/sgsn/osmo-sgsn -c /build/tests/../doc/examples/osmo-sgsn/osmo-sgsn-accept-all.cfg build 12602 0.0 0.0 4280 772 ? S 21:11 0:00 /bin/sh -c ps xua | grep osmo build 12604 0.0 0.0 12784 932 ? S 21:11 0:00 grep osmo
Socket: in 1 tries, connected to 127.0.0.1:4245 <socket.socket fd=4, family=AddressFamily.AF_INET, type=SocketKind.SOCK_STREAM, proto=0, laddr=('127.0.0.1', 48418), raddr=('127.0.0.1', 4245)> (1 sockets open) Socket: closing 127.0.0.1:4245 <socket.socket fd=4, family=AddressFamily.AF_INET, type=SocketKind.SOCK_STREAM, proto=0, laddr=('127.0.0.1', 48418), raddr=('127.0.0.1', 4245)> (0 sockets open) Terminating took 0.897s ok testVtyGgsn (__main__.TestVTYSGSN) ... Launching: PWD=/build './src/sgsn/osmo-sgsn' '-c' '/build/tests/../doc/examples/osmo-sgsn/osmo-sgsn-accept-all.cfg'
ls -l /proc/12539/fd
total 0 lr-x------ 1 build build 64 Dec 2 21:11 0 -> pipe:[215489133] l-wx------ 1 build build 64 Dec 2 21:11 1 -> pipe:[215489134] l-wx------ 1 build build 64 Dec 2 21:11 2 -> pipe:[215489135] l-wx------ 1 build build 64 Dec 2 21:11 3 -> /dev/null
ss -tn
State Recv-Q Send-Q Local Address:Port Peer Address:Port
ss -tln
State Recv-Q Send-Q Local Address:Port Peer Address:Port
ps xua | grep osmo
build 12606 0.0 0.0 21475044908 34256 ? R 21:11 0:00 ./src/sgsn/osmo-sgsn -c /build/tests/../doc/examples/osmo-sgsn/osmo-sgsn-accept-all.cfg build 12613 0.0 0.0 4280 708 ? S 21:11 0:00 /bin/sh -c ps xua | grep osmo build 12615 0.0 0.0 12784 940 ? S 21:11 0:00 grep osmo
Socket: in 1 tries, connected to 127.0.0.1:4245 <socket.socket fd=4, family=AddressFamily.AF_INET, type=SocketKind.SOCK_STREAM, proto=0, laddr=('127.0.0.1', 48420), raddr=('127.0.0.1', 4245)> (1 sockets open) Socket: closing 127.0.0.1:4245 <socket.socket fd=4, family=AddressFamily.AF_INET, type=SocketKind.SOCK_STREAM, proto=0, laddr=('127.0.0.1', 48420), raddr=('127.0.0.1', 4245)> (0 sockets open) Terminating took 0.897s ok testVtyShow (__main__.TestVTYSGSN) ... Launching: PWD=/build './src/sgsn/osmo-sgsn' '-c' '/build/tests/../doc/examples/osmo-sgsn/osmo-sgsn-accept-all.cfg'
ls -l /proc/12539/fd
total 0 lr-x------ 1 build build 64 Dec 2 21:11 0 -> pipe:[215489133] l-wx------ 1 build build 64 Dec 2 21:11 1 -> pipe:[215489134] l-wx------ 1 build build 64 Dec 2 21:11 2 -> pipe:[215489135] l-wx------ 1 build build 64 Dec 2 21:11 3 -> /dev/null
ss -tn
State Recv-Q Send-Q Local Address:Port Peer Address:Port
ss -tln
State Recv-Q Send-Q Local Address:Port Peer Address:Port LISTEN 0 10 127.0.0.1:4245 *:* LISTEN 0 10 127.0.0.1:4251 *:*
ps xua | grep osmo
build 12617 0.0 0.0 21475111088 28828 ? S 21:11 0:00 ./src/sgsn/osmo-sgsn -c /build/tests/../doc/examples/osmo-sgsn/osmo-sgsn-accept-all.cfg build 12624 0.0 0.0 4280 744 ? S 21:11 0:00 /bin/sh -c ps xua | grep osmo build 12626 0.0 0.0 12784 1016 ? S 21:11 0:00 grep osmo
Socket: in 1 tries, connected to 127.0.0.1:4245 <socket.socket fd=4, family=AddressFamily.AF_INET, type=SocketKind.SOCK_STREAM, proto=0, laddr=('127.0.0.1', 48422), raddr=('127.0.0.1', 4245)> (1 sockets open) Socket: closing 127.0.0.1:4245 <socket.socket fd=4, family=AddressFamily.AF_INET, type=SocketKind.SOCK_STREAM, proto=0, laddr=('127.0.0.1', 48422), raddr=('127.0.0.1', 4245)> (0 sockets open) Terminating took 0.897s ok testVtySubscriber (__main__.TestVTYSGSN) ... Launching: PWD=/build './src/sgsn/osmo-sgsn' '-c' '/build/tests/../doc/examples/osmo-sgsn/osmo-sgsn-accept-all.cfg'
ls -l /proc/12539/fd
total 0 lr-x------ 1 build build 64 Dec 2 21:11 0 -> pipe:[215489133] l-wx------ 1 build build 64 Dec 2 21:11 1 -> pipe:[215489134] l-wx------ 1 build build 64 Dec 2 21:11 2 -> pipe:[215489135] l-wx------ 1 build build 64 Dec 2 21:11 3 -> /dev/null
ss -tn
State Recv-Q Send-Q Local Address:Port Peer Address:Port
ss -tln
State Recv-Q Send-Q Local Address:Port Peer Address:Port
ps xua | grep osmo
build 12628 0.0 0.0 21475044908 36208 ? R 21:11 0:00 ./src/sgsn/osmo-sgsn -c /build/tests/../doc/examples/osmo-sgsn/osmo-sgsn-accept-all.cfg build 12635 0.0 0.0 4280 768 ? S 21:11 0:00 /bin/sh -c ps xua | grep osmo build 12637 0.0 0.0 12784 940 ? S 21:11 0:00 grep osmo
Socket: in 1 tries, connected to 127.0.0.1:4245 <socket.socket fd=4, family=AddressFamily.AF_INET, type=SocketKind.SOCK_STREAM, proto=0, laddr=('127.0.0.1', 48426), raddr=('127.0.0.1', 4245)> (1 sockets open) Socket: closing 127.0.0.1:4245 <socket.socket fd=4, family=AddressFamily.AF_INET, type=SocketKind.SOCK_STREAM, proto=0, laddr=('127.0.0.1', 48426), raddr=('127.0.0.1', 4245)> (0 sockets open) Terminating took 0.897s ok testVtyTimers (__main__.TestVTYSGSN) ... Launching: PWD=/build './src/sgsn/osmo-sgsn' '-c' '/build/tests/../doc/examples/osmo-sgsn/osmo-sgsn-accept-all.cfg'
ls -l /proc/12539/fd
total 0 lr-x------ 1 build build 64 Dec 2 21:11 0 -> pipe:[215489133] l-wx------ 1 build build 64 Dec 2 21:11 1 -> pipe:[215489134] l-wx------ 1 build build 64 Dec 2 21:11 2 -> pipe:[215489135] l-wx------ 1 build build 64 Dec 2 21:11 3 -> /dev/null
ss -tn
State Recv-Q Send-Q Local Address:Port Peer Address:Port
ss -tln
State Recv-Q Send-Q Local Address:Port Peer Address:Port
ps xua | grep osmo
build 12639 0.0 0.0 21475111088 30056 ? S 21:11 0:00 ./src/sgsn/osmo-sgsn -c /build/tests/../doc/examples/osmo-sgsn/osmo-sgsn-accept-all.cfg build 12646 0.0 0.0 4280 760 ? S 21:11 0:00 /bin/sh -c ps xua | grep osmo build 12648 0.0 0.0 12784 928 ? S 21:11 0:00 grep osmo
Socket: in 1 tries, connected to 127.0.0.1:4245 <socket.socket fd=4, family=AddressFamily.AF_INET, type=SocketKind.SOCK_STREAM, proto=0, laddr=('127.0.0.1', 48430), raddr=('127.0.0.1', 4245)> (1 sockets open) Socket: closing 127.0.0.1:4245 <socket.socket fd=4, family=AddressFamily.AF_INET, type=SocketKind.SOCK_STREAM, proto=0, laddr=('127.0.0.1', 48430), raddr=('127.0.0.1', 4245)> (0 sockets open) Terminating took 0.897s ok testVtyTree (__main__.TestVTYSGSN) ... Launching: PWD=/build './src/sgsn/osmo-sgsn' '-c' '/build/tests/../doc/examples/osmo-sgsn/osmo-sgsn-accept-all.cfg'
ls -l /proc/12539/fd
total 0 lr-x------ 1 build build 64 Dec 2 21:11 0 -> pipe:[215489133] l-wx------ 1 build build 64 Dec 2 21:11 1 -> pipe:[215489134] l-wx------ 1 build build 64 Dec 2 21:11 2 -> pipe:[215489135] l-wx------ 1 build build 64 Dec 2 21:11 3 -> /dev/null
ss -tn
State Recv-Q Send-Q Local Address:Port Peer Address:Port
ss -tln
State Recv-Q Send-Q Local Address:Port Peer Address:Port LISTEN 0 10 127.0.0.1:4245 *:* LISTEN 0 10 127.0.0.1:4251 *:*
ps xua | grep osmo
build 12650 0.0 0.0 21475111088 31776 ? S 21:11 0:00 ./src/sgsn/osmo-sgsn -c /build/tests/../doc/examples/osmo-sgsn/osmo-sgsn-accept-all.cfg build 12657 0.0 0.0 4280 756 ? S 21:11 0:00 /bin/sh -c ps xua | grep osmo build 12659 0.0 0.0 12784 928 ? S 21:11 0:00 grep osmo
Socket: in 1 tries, connected to 127.0.0.1:4245 <socket.socket fd=4, family=AddressFamily.AF_INET, type=SocketKind.SOCK_STREAM, proto=0, laddr=('127.0.0.1', 48432), raddr=('127.0.0.1', 4245)> (1 sockets open) Socket: closing 127.0.0.1:4245 <socket.socket fd=4, family=AddressFamily.AF_INET, type=SocketKind.SOCK_STREAM, proto=0, laddr=('127.0.0.1', 48432), raddr=('127.0.0.1', 4245)> (0 sockets open) Terminating took 0.897s ok
====================================================================== FAIL: testVtyShow (__main__.TestVTYGbproxy) ---------------------------------------------------------------------- Traceback (most recent call last): File "./vty_test_runner.py", line 98, in testVtyShow self.assertTrue(res.find('UDP bind') >= 0) AssertionError: False is not true
---------------------------------------------------------------------- Ran 11 tests in 15.832s
FAILED (failures=1) Makefile:711: recipe for target 'vty-python-test' failed make[7]: Leaving directory '/build/tests' make[7]: *** [vty-python-test] Error 1 make[6]: *** [vty-test] Error 2 Makefile:728: recipe for target 'vty-test' failed make[6]: Leaving directory '/build/tests' make[5]: *** [python-tests] Error 2 Makefile:705: recipe for target 'python-tests' failed make[5]: Leaving directory '/build/tests' make[4]: *** [check-local] Error 2 Makefile:736: recipe for target 'check-local' failed make[4]: Leaving directory '/build/tests' make[3]: *** [check-am] Error 2 Makefile:565: recipe for target 'check-am' failed make[3]: Leaving directory '/build/tests' make[2]: *** [check-recursive] Error 1 Makefile:417: recipe for target 'check-recursive' failed make[2]: Leaving directory '/build/tests' Makefile:461: recipe for target 'check-recursive' failed make[1]: Leaving directory '/build' Makefile:752: recipe for target 'check' failed make[1]: *** [check-recursive] Error 1 make: *** [check] Error 2 + cat-testlogs.sh Build step 'Execute shell' marked build as failure [WARNINGS]Skipping publisher since build result is FAILURE
Changes:
------------------------------------------ [...truncated 431.35 KB...]
ss -tln
State Recv-Q Send-Q Local Address:Port Peer Address:Port LISTEN 0 10 127.0.0.1:4245 *:* LISTEN 0 10 127.0.0.1:4251 *:*
ps xua | grep osmo
build 12343 0.0 0.0 21475111088 28780 ? S 21:18 0:00 ./src/sgsn/osmo-sgsn -c /build/tests/../doc/examples/osmo-sgsn/osmo-sgsn-accept-all.cfg build 12350 0.0 0.0 4280 700 ? S 21:18 0:00 /bin/sh -c ps xua | grep osmo build 12352 0.0 0.0 12784 984 ? R 21:18 0:00 grep osmo
Socket: in 1 tries, connected to 127.0.0.1:4245 <socket.socket fd=4, family=AddressFamily.AF_INET, type=SocketKind.SOCK_STREAM, proto=0, laddr=('127.0.0.1', 49466), raddr=('127.0.0.1', 4245)> (1 sockets open) Socket: closing 127.0.0.1:4245 <socket.socket fd=4, family=AddressFamily.AF_INET, type=SocketKind.SOCK_STREAM, proto=0, laddr=('127.0.0.1', 49466), raddr=('127.0.0.1', 4245)> (0 sockets open) Terminating took 0.897s ok testVtyCDR (__main__.TestVTYSGSN) ... Launching: PWD=/build './src/sgsn/osmo-sgsn' '-c' '/build/tests/../doc/examples/osmo-sgsn/osmo-sgsn-accept-all.cfg'
ls -l /proc/12309/fd
total 0 lr-x------ 1 build build 64 Dec 2 21:18 0 -> pipe:[216369312] l-wx------ 1 build build 64 Dec 2 21:18 1 -> pipe:[216369313] l-wx------ 1 build build 64 Dec 2 21:18 2 -> pipe:[216369314] l-wx------ 1 build build 64 Dec 2 21:18 3 -> /dev/null
ss -tn
State Recv-Q Send-Q Local Address:Port Peer Address:Port
ss -tln
State Recv-Q Send-Q Local Address:Port Peer Address:Port
ps xua | grep osmo
build 12354 0.0 0.0 21475111088 31656 ? S 21:18 0:00 ./src/sgsn/osmo-sgsn -c /build/tests/../doc/examples/osmo-sgsn/osmo-sgsn-accept-all.cfg build 12361 0.0 0.0 4280 768 ? S 21:18 0:00 /bin/sh -c ps xua | grep osmo build 12363 0.0 0.0 4280 84 ? R 21:18 0:00 /bin/sh -c ps xua | grep osmo
Socket: in 1 tries, connected to 127.0.0.1:4245 <socket.socket fd=4, family=AddressFamily.AF_INET, type=SocketKind.SOCK_STREAM, proto=0, laddr=('127.0.0.1', 49468), raddr=('127.0.0.1', 4245)> (1 sockets open) Socket: closing 127.0.0.1:4245 <socket.socket fd=4, family=AddressFamily.AF_INET, type=SocketKind.SOCK_STREAM, proto=0, laddr=('127.0.0.1', 49468), raddr=('127.0.0.1', 4245)> (0 sockets open) Terminating took 0.897s ok testVtyEasyAPN (__main__.TestVTYSGSN) ... Launching: PWD=/build './src/sgsn/osmo-sgsn' '-c' '/build/tests/../doc/examples/osmo-sgsn/osmo-sgsn-accept-all.cfg'
ls -l /proc/12309/fd
total 0 lr-x------ 1 build build 64 Dec 2 21:18 0 -> pipe:[216369312] l-wx------ 1 build build 64 Dec 2 21:18 1 -> pipe:[216369313] l-wx------ 1 build build 64 Dec 2 21:18 2 -> pipe:[216369314] l-wx------ 1 build build 64 Dec 2 21:18 3 -> /dev/null
ss -tn
State Recv-Q Send-Q Local Address:Port Peer Address:Port
ss -tln
State Recv-Q Send-Q Local Address:Port Peer Address:Port
ps xua | grep osmo
build 12365 0.0 0.0 21475111088 32048 ? S 21:18 0:00 ./src/sgsn/osmo-sgsn -c /build/tests/../doc/examples/osmo-sgsn/osmo-sgsn-accept-all.cfg build 12372 0.0 0.0 4280 736 ? S 21:18 0:00 /bin/sh -c ps xua | grep osmo build 12374 0.0 0.0 12784 956 ? S 21:18 0:00 grep osmo
Socket: in 1 tries, connected to 127.0.0.1:4245 <socket.socket fd=4, family=AddressFamily.AF_INET, type=SocketKind.SOCK_STREAM, proto=0, laddr=('127.0.0.1', 49470), raddr=('127.0.0.1', 4245)> (1 sockets open) Socket: closing 127.0.0.1:4245 <socket.socket fd=4, family=AddressFamily.AF_INET, type=SocketKind.SOCK_STREAM, proto=0, laddr=('127.0.0.1', 49470), raddr=('127.0.0.1', 4245)> (0 sockets open) Terminating took 0.897s ok testVtyGgsn (__main__.TestVTYSGSN) ... Launching: PWD=/build './src/sgsn/osmo-sgsn' '-c' '/build/tests/../doc/examples/osmo-sgsn/osmo-sgsn-accept-all.cfg'
ls -l /proc/12309/fd
total 0 lr-x------ 1 build build 64 Dec 2 21:18 0 -> pipe:[216369312] l-wx------ 1 build build 64 Dec 2 21:18 1 -> pipe:[216369313] l-wx------ 1 build build 64 Dec 2 21:18 2 -> pipe:[216369314] l-wx------ 1 build build 64 Dec 2 21:18 3 -> /dev/null
ss -tn
State Recv-Q Send-Q Local Address:Port Peer Address:Port
ss -tln
State Recv-Q Send-Q Local Address:Port Peer Address:Port LISTEN 0 10 127.0.0.1:4245 *:* LISTEN 0 10 127.0.0.1:4251 *:*
ps xua | grep osmo
build 12376 1.0 0.0 21475111088 28496 ? S 21:18 0:00 ./src/sgsn/osmo-sgsn -c /build/tests/../doc/examples/osmo-sgsn/osmo-sgsn-accept-all.cfg build 12383 0.0 0.0 4280 696 ? S 21:18 0:00 /bin/sh -c ps xua | grep osmo build 12385 0.0 0.0 4280 84 ? R 21:18 0:00 /bin/sh -c ps xua | grep osmo
Socket: in 1 tries, connected to 127.0.0.1:4245 <socket.socket fd=4, family=AddressFamily.AF_INET, type=SocketKind.SOCK_STREAM, proto=0, laddr=('127.0.0.1', 49472), raddr=('127.0.0.1', 4245)> (1 sockets open) Socket: closing 127.0.0.1:4245 <socket.socket fd=4, family=AddressFamily.AF_INET, type=SocketKind.SOCK_STREAM, proto=0, laddr=('127.0.0.1', 49472), raddr=('127.0.0.1', 4245)> (0 sockets open) Terminating took 0.897s ok testVtyShow (__main__.TestVTYSGSN) ... Launching: PWD=/build './src/sgsn/osmo-sgsn' '-c' '/build/tests/../doc/examples/osmo-sgsn/osmo-sgsn-accept-all.cfg'
ls -l /proc/12309/fd
total 0 lr-x------ 1 build build 64 Dec 2 21:18 0 -> pipe:[216369312] l-wx------ 1 build build 64 Dec 2 21:18 1 -> pipe:[216369313] l-wx------ 1 build build 64 Dec 2 21:18 2 -> pipe:[216369314] l-wx------ 1 build build 64 Dec 2 21:18 3 -> /dev/null
ss -tn
State Recv-Q Send-Q Local Address:Port Peer Address:Port
ss -tln
State Recv-Q Send-Q Local Address:Port Peer Address:Port
ps xua | grep osmo
build 12387 0.0 0.0 21475111088 37044 ? R 21:18 0:00 ./src/sgsn/osmo-sgsn -c /build/tests/../doc/examples/osmo-sgsn/osmo-sgsn-accept-all.cfg build 12394 0.0 0.0 4280 772 ? S 21:18 0:00 /bin/sh -c ps xua | grep osmo build 12396 0.0 0.0 12784 956 ? S 21:18 0:00 grep osmo
Socket: in 1 tries, connected to 127.0.0.1:4245 <socket.socket fd=4, family=AddressFamily.AF_INET, type=SocketKind.SOCK_STREAM, proto=0, laddr=('127.0.0.1', 49474), raddr=('127.0.0.1', 4245)> (1 sockets open) Socket: closing 127.0.0.1:4245 <socket.socket fd=4, family=AddressFamily.AF_INET, type=SocketKind.SOCK_STREAM, proto=0, laddr=('127.0.0.1', 49474), raddr=('127.0.0.1', 4245)> (0 sockets open) Terminating took 0.897s ok testVtySubscriber (__main__.TestVTYSGSN) ... Launching: PWD=/build './src/sgsn/osmo-sgsn' '-c' '/build/tests/../doc/examples/osmo-sgsn/osmo-sgsn-accept-all.cfg'
ls -l /proc/12309/fd
total 0 lr-x------ 1 build build 64 Dec 2 21:18 0 -> pipe:[216369312] l-wx------ 1 build build 64 Dec 2 21:18 1 -> pipe:[216369313] l-wx------ 1 build build 64 Dec 2 21:18 2 -> pipe:[216369314] l-wx------ 1 build build 64 Dec 2 21:18 3 -> /dev/null
ss -tn
State Recv-Q Send-Q Local Address:Port Peer Address:Port
ss -tln
State Recv-Q Send-Q Local Address:Port Peer Address:Port LISTEN 0 10 127.0.0.1:4245 *:* LISTEN 0 10 127.0.0.1:4251 *:*
ps xua | grep osmo
build 12398 0.0 0.0 21475111088 31704 ? S 21:18 0:00 ./src/sgsn/osmo-sgsn -c /build/tests/../doc/examples/osmo-sgsn/osmo-sgsn-accept-all.cfg build 12405 0.0 0.0 4280 704 ? S 21:18 0:00 /bin/sh -c ps xua | grep osmo build 12407 0.0 0.0 12784 976 ? S 21:18 0:00 grep osmo
Socket: in 1 tries, connected to 127.0.0.1:4245 <socket.socket fd=4, family=AddressFamily.AF_INET, type=SocketKind.SOCK_STREAM, proto=0, laddr=('127.0.0.1', 49476), raddr=('127.0.0.1', 4245)> (1 sockets open) Socket: closing 127.0.0.1:4245 <socket.socket fd=4, family=AddressFamily.AF_INET, type=SocketKind.SOCK_STREAM, proto=0, laddr=('127.0.0.1', 49476), raddr=('127.0.0.1', 4245)> (0 sockets open) Terminating took 0.897s ok testVtyTimers (__main__.TestVTYSGSN) ... Launching: PWD=/build './src/sgsn/osmo-sgsn' '-c' '/build/tests/../doc/examples/osmo-sgsn/osmo-sgsn-accept-all.cfg'
ls -l /proc/12309/fd
total 0 lr-x------ 1 build build 64 Dec 2 21:18 0 -> pipe:[216369312] l-wx------ 1 build build 64 Dec 2 21:18 1 -> pipe:[216369313] l-wx------ 1 build build 64 Dec 2 21:18 2 -> pipe:[216369314] l-wx------ 1 build build 64 Dec 2 21:18 3 -> /dev/null
ss -tn
State Recv-Q Send-Q Local Address:Port Peer Address:Port
ss -tln
State Recv-Q Send-Q Local Address:Port Peer Address:Port
ps xua | grep osmo
build 12409 0.0 0.0 21475044908 28616 ? R 21:18 0:00 ./src/sgsn/osmo-sgsn -c /build/tests/../doc/examples/osmo-sgsn/osmo-sgsn-accept-all.cfg build 12416 0.0 0.0 4280 772 ? S 21:18 0:00 /bin/sh -c ps xua | grep osmo build 12418 0.0 0.0 12784 1028 ? S 21:18 0:00 grep osmo
Socket: in 1 tries, connected to 127.0.0.1:4245 <socket.socket fd=4, family=AddressFamily.AF_INET, type=SocketKind.SOCK_STREAM, proto=0, laddr=('127.0.0.1', 49480), raddr=('127.0.0.1', 4245)> (1 sockets open) Socket: closing 127.0.0.1:4245 <socket.socket fd=4, family=AddressFamily.AF_INET, type=SocketKind.SOCK_STREAM, proto=0, laddr=('127.0.0.1', 49480), raddr=('127.0.0.1', 4245)> (0 sockets open) Terminating took 0.897s ok testVtyTree (__main__.TestVTYSGSN) ... Launching: PWD=/build './src/sgsn/osmo-sgsn' '-c' '/build/tests/../doc/examples/osmo-sgsn/osmo-sgsn-accept-all.cfg'
ls -l /proc/12309/fd
total 0 lr-x------ 1 build build 64 Dec 2 21:18 0 -> pipe:[216369312] l-wx------ 1 build build 64 Dec 2 21:18 1 -> pipe:[216369313] l-wx------ 1 build build 64 Dec 2 21:18 2 -> pipe:[216369314] l-wx------ 1 build build 64 Dec 2 21:18 3 -> /dev/null
ss -tn
State Recv-Q Send-Q Local Address:Port Peer Address:Port
ss -tln
State Recv-Q Send-Q Local Address:Port Peer Address:Port LISTEN 0 10 127.0.0.1:4245 *:* LISTEN 0 10 127.0.0.1:4251 *:*
ps xua | grep osmo
build 12420 0.0 0.0 21475111088 18292 ? S 21:18 0:00 ./src/sgsn/osmo-sgsn -c /build/tests/../doc/examples/osmo-sgsn/osmo-sgsn-accept-all.cfg build 12427 0.0 0.0 4280 704 ? S 21:18 0:00 /bin/sh -c ps xua | grep osmo build 12429 0.0 0.0 12784 960 ? S 21:18 0:00 grep osmo
Socket: in 1 tries, connected to 127.0.0.1:4245 <socket.socket fd=4, family=AddressFamily.AF_INET, type=SocketKind.SOCK_STREAM, proto=0, laddr=('127.0.0.1', 49482), raddr=('127.0.0.1', 4245)> (1 sockets open) Socket: closing 127.0.0.1:4245 <socket.socket fd=4, family=AddressFamily.AF_INET, type=SocketKind.SOCK_STREAM, proto=0, laddr=('127.0.0.1', 49482), raddr=('127.0.0.1', 4245)> (0 sockets open) Terminating took 0.897s ok
====================================================================== FAIL: testVtyShow (__main__.TestVTYGbproxy) ---------------------------------------------------------------------- Traceback (most recent call last): File "./vty_test_runner.py", line 98, in testVtyShow self.assertTrue(res.find('UDP bind') >= 0) AssertionError: False is not true
---------------------------------------------------------------------- Ran 11 tests in 16.021s
FAILED (failures=1) Makefile:711: recipe for target 'vty-python-test' failed make[7]: Leaving directory '/build/tests' make[7]: *** [vty-python-test] Error 1 make[6]: *** [vty-test] Error 2 Makefile:728: recipe for target 'vty-test' failed make[6]: Leaving directory '/build/tests' Makefile:705: recipe for target 'python-tests' failed make[5]: *** [python-tests] Error 2 make[5]: Leaving directory '/build/tests' Makefile:736: recipe for target 'check-local' failed make[4]: *** [check-local] Error 2 make[4]: Leaving directory '/build/tests' make[3]: *** [check-am] Error 2 Makefile:565: recipe for target 'check-am' failed make[3]: Leaving directory '/build/tests' Makefile:417: recipe for target 'check-recursive' failed make[2]: *** [check-recursive] Error 1 make[2]: Leaving directory '/build/tests' make[1]: *** [check-recursive] Error 1 Makefile:461: recipe for target 'check-recursive' failed make[1]: Leaving directory '/build' Makefile:752: recipe for target 'check' failed make: *** [check] Error 2 + cat-testlogs.sh Build step 'Execute shell' marked build as failure [WARNINGS]Skipping publisher since build result is FAILURE
jenkins-notifications@lists.osmocom.org