See https://jenkins.osmocom.org/jenkins/job/TTCN3-centos-bts-test/925/display/redirect?page=changes
Changes:
[Pau Espin Pedrol] ttcn3-{pgw,ggsn}-test: Update smf.yml with new metrics section location
------------------------------------------ [...truncated 33.69 KB...] tests/sysmobts/Makefile.am:30: but option 'subdir-objects' is disabled [0m[91mtests/sysmobts/Makefile.am:30: warning: source file '$(top_srcdir)/src/osmo-bts-sysmo/eeprom.c' is in a subdirectory, tests/sysmobts/Makefile.am:30: but option 'subdir-objects' is disabled [0m[91mtests/tx_power/Makefile.am:22: warning: source file '$(srcdir)/../stubs.c' is in a subdirectory, tests/tx_power/Makefile.am:22: but option 'subdir-objects' is disabled [0mchecking for a BSD-compatible install... /usr/bin/install -c checking whether build environment is sane... yes checking for a thread-safe mkdir -p... /usr/bin/mkdir -p checking for gawk... gawk checking whether make sets $(MAKE)... yes checking whether make supports nested variables... yes checking whether make supports nested variables... (cached) yes checking whether make sets $(MAKE)... (cached) yes checking for gcc... gcc checking whether the C compiler works... yes checking for C compiler default output file name... a.out checking for suffix of executables... checking whether we are cross compiling... no checking for suffix of object files... o checking whether we are using the GNU C compiler... yes checking whether gcc accepts -g... yes checking for gcc option to accept ISO C89... none needed checking whether gcc understands -c and -o together... yes checking whether make supports the include directive... yes (GNU style) checking dependency style of gcc... gcc3 checking build system type... x86_64-pc-linux-gnu checking host system type... x86_64-pc-linux-gnu checking how to print strings... printf checking for a sed that does not truncate output... /usr/bin/sed checking for grep that handles long lines and -e... /usr/bin/grep checking for egrep... /usr/bin/grep -E checking for fgrep... /usr/bin/grep -F checking for ld used by gcc... /usr/bin/ld checking if the linker (/usr/bin/ld) is GNU ld... yes checking for BSD- or MS-compatible name lister (nm)... /usr/bin/nm -B checking the name lister (/usr/bin/nm -B) interface... BSD nm checking whether ln -s works... yes checking the maximum length of command line arguments... 1572864 checking how to convert x86_64-pc-linux-gnu file names to x86_64-pc-linux-gnu format... func_convert_file_noop checking how to convert x86_64-pc-linux-gnu file names to toolchain format... func_convert_file_noop checking for /usr/bin/ld option to reload object files... -r checking for objdump... objdump checking how to recognize dependent libraries... pass_all checking for dlltool... no checking how to associate runtime and link libraries... printf %s\n checking for ar... ar checking for archiver @FILE support... @ checking for strip... strip checking for ranlib... ranlib checking command to parse /usr/bin/nm -B output from gcc object... ok checking for sysroot... no checking for a working dd... [91m./configure: line 6570: cmp: command not found [0m[91m./configure: line 6570: cmp: command not found [0m checking how to truncate binary pipes... /usr/bin/sed -e 4q [91m./configure: line 6747: /usr/bin/file: No such file or directory [0mchecking for mt... no checking if : is a manifest tool... no checking how to run the C preprocessor... gcc -E checking for ANSI C header files... yes checking for sys/types.h... yes checking for sys/stat.h... yes checking for stdlib.h... yes checking for string.h... yes checking for memory.h... yes checking for strings.h... yes checking for inttypes.h... yes checking for stdint.h... yes checking for unistd.h... yes checking for dlfcn.h... yes checking for objdir... .libs checking if gcc supports -fno-rtti -fno-exceptions... [91m./configure: line 8499: diff: command not found [0mno checking for gcc option to produce PIC... -fPIC -DPIC checking if gcc PIC flag -fPIC -DPIC works... yes checking if gcc static flag -static works... no checking if gcc supports -c -o file.o... yes checking if gcc supports -c -o file.o... (cached) yes checking whether the gcc linker (/usr/bin/ld) supports shared libraries... yes checking whether -lc should be explicitly linked in... no checking dynamic linker characteristics... GNU/Linux ld.so checking how to hardcode library paths into programs... immediate checking whether stripping libraries is possible... yes checking if libtool supports shared libraries... yes checking whether to build shared libraries... yes checking whether to build static libraries... yes checking for pkg-config... /usr/bin/pkg-config checking for pkg-config... /usr/bin/pkg-config checking pkg-config is at least version 0.20... yes checking for ANSI C header files... (cached) yes checking for LIBOSMOCORE... yes checking for LIBOSMOVTY... yes checking for LIBOSMOGSM... yes checking for LIBOSMOCTRL... yes checking for LIBOSMOCODEC... yes checking for LIBOSMOCODING... yes checking for LIBOSMOABIS... yes checking for LIBOSMOTRAU... yes checking for LIBOSMONETIF... yes checking whether to enable support for sysmobts calibration tool... no checking whether to enable support for sysmoBTS L1/PHY support... no checking whether to enable support for osmo-trx based L1/PHY support... yes checking whether to enable support for Octasic OCTPHY-2G... no checking whether to enable NuRAN Wireless Litecell 1.5 hardware support... no checking whether to enable NuRAN Wireless OC-2G hardware support... no checking whether to enable VTY/CTRL tests... no checking whether to include systemtap tracing support... no CFLAGS=" -std=gnu11" CPPFLAGS="" checking that generated files are newer than configure... done configure: creating ./config.status config.status: creating src/Makefile config.status: creating src/common/Makefile config.status: creating src/osmo-bts-virtual/Makefile config.status: creating src/osmo-bts-omldummy/Makefile config.status: creating src/osmo-bts-sysmo/Makefile config.status: creating src/osmo-bts-lc15/Makefile config.status: creating src/osmo-bts-oc2g/Makefile config.status: creating src/osmo-bts-trx/Makefile config.status: creating src/osmo-bts-octphy/Makefile config.status: creating include/Makefile config.status: creating include/osmo-bts/Makefile config.status: creating tests/Makefile config.status: creating tests/paging/Makefile config.status: creating tests/agch/Makefile config.status: creating tests/cipher/Makefile config.status: creating tests/sysmobts/Makefile config.status: creating tests/misc/Makefile config.status: creating tests/handover/Makefile config.status: creating tests/ta_control/Makefile config.status: creating tests/tx_power/Makefile config.status: creating tests/power/Makefile config.status: creating tests/meas/Makefile config.status: creating tests/amr/Makefile config.status: creating doc/Makefile config.status: creating doc/examples/Makefile config.status: creating doc/manuals/Makefile config.status: creating contrib/Makefile config.status: creating contrib/systemd/Makefile config.status: creating contrib/osmo-bts.spec config.status: creating Makefile config.status: creating btsconfig.h config.status: executing tests/atconfig commands config.status: executing depfiles commands config.status: executing libtool commands echo 1.5.0.49-5b9a > .version-t && mv .version-t .version make install-recursive make[1]: Entering directory '/tmp/osmo-bts' Making install in include make[2]: Entering directory '/tmp/osmo-bts/include' Making install in osmo-bts make[3]: Entering directory '/tmp/osmo-bts/include/osmo-bts' make[4]: Entering directory '/tmp/osmo-bts/include/osmo-bts' make[4]: Nothing to be done for 'install-exec-am'. make[4]: Nothing to be done for 'install-data-am'. make[4]: Leaving directory '/tmp/osmo-bts/include/osmo-bts' make[3]: Leaving directory '/tmp/osmo-bts/include/osmo-bts' make[3]: Entering directory '/tmp/osmo-bts/include' make[4]: Entering directory '/tmp/osmo-bts/include' make[4]: Nothing to be done for 'install-exec-am'. make[4]: Nothing to be done for 'install-data-am'. make[4]: Leaving directory '/tmp/osmo-bts/include' make[3]: Leaving directory '/tmp/osmo-bts/include' make[2]: Leaving directory '/tmp/osmo-bts/include' Making install in src make[2]: Entering directory '/tmp/osmo-bts/src' Making install in common make[3]: Entering directory '/tmp/osmo-bts/src/common' make install-am make[4]: Entering directory '/tmp/osmo-bts/src/common' CC gsm_data.o CC sysinfo.o CC logging.o CC abis.o CC abis_osmo.o CC oml.o CC osmux.o CC bts_trx.o CC bts.o CC rsl.o CC paging.o CC vty.o CC measurement.o CC lchan.o CC amr.o CC load_indication.o [91mosmux.c: In function 'osmux_handle_alloc': osmux.c:184:2: warning: implicit declaration of function 'osmux_xfrm_input_set_name'; did you mean 'osmux_xfrm_input_deliver'? [-Wimplicit-function-declaration] osmux_xfrm_input_set_name(h->in, name); ^~~~~~~~~~~~~~~~~~~~~~~~~ osmux_xfrm_input_deliver [0m CC pcu_sock.o CC handover.o CC msg_utils.o CC tx_power.o CC bts_ctrl_commands.o CC bts_ctrl_lookup.o CC l1sap.o CC bts_shutdown_fsm.o CC cbch.o CC power_control.o CC main.o CC phy_link.o CC dtx_dl_amr_fsm.o CC scheduler_mframe.o CC ta_control.o CC nm_common_fsm.o CC nm_bts_sm_fsm.o CC nm_bts_fsm.o CC nm_bb_transc_fsm.o CC nm_channel_fsm.o CC nm_radio_carrier_fsm.o CC scheduler.o AR libl1sched.a AR libbts.a make[5]: Entering directory '/tmp/osmo-bts/src/common' make[5]: Nothing to be done for 'install-exec-am'. make[5]: Nothing to be done for 'install-data-am'. make[5]: Leaving directory '/tmp/osmo-bts/src/common' make[4]: Leaving directory '/tmp/osmo-bts/src/common' make[3]: Leaving directory '/tmp/osmo-bts/src/common' Making install in osmo-bts-virtual make[3]: Entering directory '/tmp/osmo-bts/src/osmo-bts-virtual' CC main.o CC bts_model.o CC virtualbts_vty.o CC scheduler_virtbts.o CC l1_if.o CC virtual_um.o CC osmo_mcast_sock.o CCLD osmo-bts-virtual [91m../../src/common/libbts.a(osmux.o): In function `osmux_handle_alloc': osmux.c:(.text+0xd27): undefined reference to `osmux_xfrm_input_set_name' [0m[91mcollect2: error: ld returned 1 exit status [0m[91mmake[3]: *** [Makefile:472: osmo-bts-virtual] Error 1 [0mmake[3]: Leaving directory '/tmp/osmo-bts/src/osmo-bts-virtual' [91mmake[2]: *** [Makefile:390: install-recursive] Error 1 [0mmake[2]: Leaving directory '/tmp/osmo-bts/src' [91mmake[1]: *** [Makefile:443: install-recursive] Error 1 [0mmake[1]: Leaving directory '/tmp/osmo-bts' [91mmake: *** [Makefile:742: install] Error 2 [0mThe command '/bin/sh -c cd osmo-bts && git fetch && git checkout $OSMO_BTS_BRANCH && (git symbolic-ref -q HEAD && git reset --hard origin/$OSMO_BTS_BRANCH || exit 1); git rev-parse --abbrev-ref HEAD && git rev-parse HEAD && autoreconf -fi && ./configure --enable-trx && make "-j$(nproc)" install' returned a non-zero code: 2 ../make/Makefile:90: recipe for target 'docker-build' failed make: *** [docker-build] Error 2 make: Leaving directory 'https://jenkins.osmocom.org/jenkins/job/TTCN3-centos-bts-test/ws/osmo-bts-master' + exit 1 Build step 'Execute shell' marked build as failure Recording test results ERROR: Step ‘Publish JUnit test result report’ failed: No test report files were found. Configuration error?
See https://jenkins.osmocom.org/jenkins/job/TTCN3-centos-bts-test/927/display/redirect
Changes:
------------------------------------------ [...truncated 3.21 MB...] <error type='DTE'></error> </testcase> <testcase classname='BTS_Tests' name='TC_rll_unit_data_req_ACCH' time='5.150425'> <error type='DTE'></error> </testcase> <testcase classname='BTS_Tests' name='TC_rll_unit_data_ind_DCCH' time='5.115180'> <error type='DTE'></error> </testcase> <testcase classname='BTS_Tests' name='TC_rll_unit_data_ind_ACCH' time='5.106357'> <error type='DTE'></error> </testcase> <testcase classname='BTS_Tests' name='TC_chan_act_a51' time='5.078070'> <error type='DTE'></error> </testcase> <testcase classname='BTS_Tests' name='TC_chan_act_a52' time='5.123943'> <error type='DTE'></error> </testcase> <testcase classname='BTS_Tests' name='TC_chan_act_a53' time='5.053002'> <error type='DTE'></error> </testcase> <testcase classname='BTS_Tests' name='TC_chan_act_a54' time='5.040982'> <error type='DTE'></error> </testcase> <testcase classname='BTS_Tests' name='TC_encr_cmd_a51' time='5.056281'> <error type='DTE'></error> </testcase> <testcase classname='BTS_Tests' name='TC_encr_cmd_a52' time='5.047552'> <error type='DTE'></error> </testcase> <testcase classname='BTS_Tests' name='TC_encr_cmd_a53' time='5.055040'> <error type='DTE'></error> </testcase> <testcase classname='BTS_Tests' name='TC_encr_cmd_a54' time='5.071021'> <error type='DTE'></error> </testcase> <testcase classname='BTS_Tests' name='TC_err_rep_wrong_mdisc' time='10.039222'> <error type='DTE'></error> </testcase> <testcase classname='BTS_Tests' name='TC_err_rep_wrong_msg_type' time='9.961354'> <error type='DTE'></error> </testcase> <testcase classname='BTS_Tests' name='TC_err_rep_wrong_sequence' time='9.967281'> <error type='DTE'></error> </testcase> <testcase classname='BTS_Tests' name='TC_lapdm_selftest' time='0.002620'/> <testcase classname='BTS_Tests' name='TC_tch_sign_l2_fill_frame' time='0.899707'> <error type='DTE'></error> </testcase> <testcase classname='BTS_Tests' name='TC_tch_sign_l2_fill_frame_dtxd' time='5.090832'> <error type='DTE'></error> </testcase> <testcase classname='BTS_Tests' name='TC_chopped_ipa_ping' time='28.544471'/> <testcase classname='BTS_Tests' name='TC_chopped_ipa_payload' time='42.662905'/> <testcase classname='BTS_Tests' name='TC_ms_pwr_ctrl_constant' time='4.709195'> <error type='DTE'></error> </testcase> <testcase classname='BTS_Tests' name='TC_ms_pwr_ctrl_pf_ewma' time='5.091906'> <error type='DTE'></error> </testcase> <testcase classname='BTS_Tests' name='TC_speech_no_rtp_tchf' time='5.076193'> <error type='DTE'></error> </testcase> <testcase classname='BTS_Tests' name='TC_speech_no_rtp_tchh' time='5.021918'> <error type='DTE'></error> </testcase> <testcase classname='BTS_Tests' name='TC_speech_rtp_tchf' time='5.065110'> <error type='DTE'></error> </testcase> <testcase classname='BTS_Tests' name='TC_speech_rtp_tchh' time='5.068775'> <error type='DTE'></error> </testcase> <testcase classname='BTS_Tests' name='TC_speech_osmux_tchf' time='5.052997'> <error type='DTE'></error> </testcase> <testcase classname='BTS_Tests' name='TC_speech_osmux_tchh' time='5.053432'> <error type='DTE'></error> </testcase> <testcase classname='BTS_Tests' name='TC_early_immediate_assignment' time='5.047955'> <error type='DTE'></error> </testcase> <testcase classname='BTS_Tests' name='TC_acch_overpower_rxqual_thresh' time='5.055539'> <error type='DTE'></error> </testcase> <testcase classname='BTS_Tests' name='TC_acch_overpower_rxqual_thresh_dtx' time='5.059127'> <error type='DTE'></error> </testcase> <testcase classname='BTS_Tests' name='TC_acch_overpower_always_on_facch' time='5.051675'> <error type='DTE'></error> </testcase> <testcase classname='BTS_Tests' name='TC_acch_overpower_always_on_sacch' time='5.063642'> <error type='DTE'></error> </testcase> <testcase classname='BTS_Tests' name='TC_acch_overpower_limit' time='5.023380'> <error type='DTE'></error> </testcase> <testcase classname='BTS_Tests' name='TC_dyn_osmo_pdch_tchh_race_act' time='6.653837'/> <testcase classname='BTS_Tests' name='TC_dyn_osmo_pdch_sdcch8_race_act' time='6.838055'/> <testcase classname='BTS_Tests_SMSCB' name='TC_cbch_load_idle_no_cbch' time='15.008233'/> <testcase classname='BTS_Tests_SMSCB' name='TC_sms_cb_cmd_sdcch4_1block' time='4.911648'> <error type='DTE'>Dynamic test case error: Stand-alone receive statement failed in file L1CTL_PortType.ttcn, line 298.</error> </testcase> <testcase classname='BTS_Tests_SMSCB' name='TC_sms_cb_cmd_sdcch4_2block' time='5.058824'> <error type='DTE'>Dynamic test case error: Stand-alone receive statement failed in file L1CTL_PortType.ttcn, line 298.</error> </testcase> <testcase classname='BTS_Tests_SMSCB' name='TC_sms_cb_cmd_sdcch4_3block' time='5.048930'> <error type='DTE'>Dynamic test case error: Stand-alone receive statement failed in file L1CTL_PortType.ttcn, line 298.</error> </testcase> <testcase classname='BTS_Tests_SMSCB' name='TC_sms_cb_cmd_sdcch4_4block' time='5.042380'> <error type='DTE'>Dynamic test case error: Stand-alone receive statement failed in file L1CTL_PortType.ttcn, line 298.</error> </testcase> <testcase classname='BTS_Tests_SMSCB' name='TC_sms_cb_cmd_sdcch4_multi' time='5.044310'> <error type='DTE'>Dynamic test case error: Stand-alone receive statement failed in file L1CTL_PortType.ttcn, line 298.</error> </testcase> <testcase classname='BTS_Tests_SMSCB' name='TC_sms_cb_cmd_sdcch4_schedule' time='5.042471'> <error type='DTE'>Dynamic test case error: Stand-alone receive statement failed in file L1CTL_PortType.ttcn, line 298.</error> </testcase> <testcase classname='BTS_Tests_SMSCB' name='TC_sms_cb_cmd_sdcch4_default_only' time='5.047507'> <error type='DTE'>Dynamic test case error: Stand-alone receive statement failed in file L1CTL_PortType.ttcn, line 298.</error> </testcase> <testcase classname='BTS_Tests_SMSCB' name='TC_sms_cb_cmd_sdcch4_default_and_normal' time='5.038661'> <error type='DTE'>Dynamic test case error: Stand-alone receive statement failed in file L1CTL_PortType.ttcn, line 298.</error> </testcase> <testcase classname='BTS_Tests_SMSCB' name='TC_sms_cb_cmd_sdcch4_default_then_null' time='5.051408'> <error type='DTE'>Dynamic test case error: Stand-alone receive statement failed in file L1CTL_PortType.ttcn, line 298.</error> </testcase> <testcase classname='BTS_Tests_SMSCB' name='TC_cbc_sdcch4_load_idle' time='15.040241'/> <testcase classname='BTS_Tests_SMSCB' name='TC_cbc_sdcch4_load_overload' time='16.912376'/> <testcase classname='BTS_Tests_SMSCB' name='TC_sms_cb_cmd_sdcch8_1block' time='4.789973'> <error type='DTE'>Dynamic test case error: Stand-alone receive statement failed in file L1CTL_PortType.ttcn, line 298.</error> </testcase> <testcase classname='BTS_Tests_SMSCB' name='TC_sms_cb_cmd_sdcch8_2block' time='4.960140'> <error type='DTE'>Dynamic test case error: Stand-alone receive statement failed in file L1CTL_PortType.ttcn, line 298.</error> </testcase> <testcase classname='BTS_Tests_SMSCB' name='TC_sms_cb_cmd_sdcch8_3block' time='4.949849'> <error type='DTE'>Dynamic test case error: Stand-alone receive statement failed in file L1CTL_PortType.ttcn, line 298.</error> </testcase> <testcase classname='BTS_Tests_SMSCB' name='TC_sms_cb_cmd_sdcch8_4block' time='4.944042'> <error type='DTE'>Dynamic test case error: Stand-alone receive statement failed in file L1CTL_PortType.ttcn, line 298.</error> </testcase> <testcase classname='BTS_Tests_SMSCB' name='TC_sms_cb_cmd_sdcch8_multi' time='4.945798'> <error type='DTE'>Dynamic test case error: Stand-alone receive statement failed in file L1CTL_PortType.ttcn, line 298.</error> </testcase> <testcase classname='BTS_Tests_SMSCB' name='TC_sms_cb_cmd_sdcch8_schedule' time='4.946711'> <error type='DTE'>Dynamic test case error: Stand-alone receive statement failed in file L1CTL_PortType.ttcn, line 298.</error> </testcase> <testcase classname='BTS_Tests_SMSCB' name='TC_sms_cb_cmd_sdcch8_default_only' time='4.947399'> <error type='DTE'>Dynamic test case error: Stand-alone receive statement failed in file L1CTL_PortType.ttcn, line 298.</error> </testcase> <testcase classname='BTS_Tests_SMSCB' name='TC_sms_cb_cmd_sdcch8_default_and_normal' time='4.992038'> <error type='DTE'>Dynamic test case error: Stand-alone receive statement failed in file L1CTL_PortType.ttcn, line 298.</error> </testcase> <testcase classname='BTS_Tests_SMSCB' name='TC_cbc_sdcch8_load_idle' time='14.933225'/> <testcase classname='BTS_Tests_SMSCB' name='TC_cbc_sdcch8_load_overload' time='16.785508'/> <testcase classname='BTS_Tests_SMSCB' name='TC_etws_p1ro' time='4.794721'> <error type='DTE'>Dynamic test case error: Stand-alone receive statement failed in file L1CTL_PortType.ttcn, line 298.</error> </testcase> <testcase classname='BTS_Tests_SMSCB' name='TC_etws_p1ro_end' time='4.959092'> <error type='DTE'>Dynamic test case error: Stand-alone receive statement failed in file L1CTL_PortType.ttcn, line 298.</error> </testcase> <testcase classname='BTS_Tests_SMSCB' name='TC_etws_pcu' time='4.942238'> <error type='DTE'>Dynamic test case error: Stand-alone receive statement failed in file L1CTL_PortType.ttcn, line 298.</error> </testcase> <testcase classname='BTS_Tests_LAPDm' name='TC_sabm_ua_dcch_sapi0' time='4.969841'> <error type='DTE'></error> </testcase> <testcase classname='BTS_Tests_LAPDm' name='TC_sabm_ua_dcch_sapi0_nopayload' time='4.978756'> <error type='DTE'></error> </testcase> <testcase classname='BTS_Tests_LAPDm' name='TC_sabm_ua_dcch_sapi3' time='4.972061'> <error type='DTE'></error> </testcase> <testcase classname='BTS_Tests_LAPDm' name='TC_sabm_ua_dcch_sapi4' time='4.970482'> <error type='DTE'></error> </testcase> <testcase classname='BTS_Tests_LAPDm' name='TC_sabm_contention' time='4.966080'> <error type='DTE'></error> </testcase> <testcase classname='BTS_Tests_LAPDm' name='TC_sabm_retransmit' time='4.979674'> <error type='DTE'></error> </testcase> <testcase classname='BTS_Tests_LAPDm' name='TC_sabm_retransmit_bts' time='4.978409'> <error type='DTE'></error> </testcase> <testcase classname='BTS_Tests_LAPDm' name='TC_sabm_invalid_resp' time='4.975883'> <error type='DTE'></error> </testcase> <testcase classname='BTS_Tests_LAPDm' name='TC_sabm_dm' time='4.970783'> <error type='DTE'></error> </testcase> <testcase classname='BTS_Tests_LAPDm' name='TC_establish_ign_first_sabm' time='4.977560'> <error type='DTE'></error> </testcase> <testcase classname='BTS_Tests_LAPDm' name='TC_iframe_seq_and_ack' time='4.975601'> <error type='DTE'></error> </testcase> <testcase classname='BTS_Tests_LAPDm' name='TC_iframe_timer_recovery' time='4.972766'> <error type='DTE'></error> </testcase> <testcase classname='BTS_Tests_LAPDm' name='TC_ns_seq_error' time='4.978410'> <error type='DTE'></error> </testcase> <testcase classname='BTS_Tests_LAPDm' name='TC_nr_seq_error' time='4.971674'> <error type='DTE'></error> </testcase> <testcase classname='BTS_Tests_LAPDm' name='TC_rec_invalid_frame' time='4.973844'> <error type='DTE'></error> </testcase> <testcase classname='BTS_Tests_LAPDm' name='TC_segm_concat_dcch' time='4.980382'> <error type='DTE'></error> </testcase> <testcase classname='BTS_Tests_LAPDm' name='TC_segm_concat_sacch' time='4.970099'> <error type='DTE'></error> </testcase> <testcase classname='BTS_Tests_LAPDm' name='TC_t200_n200' time='4.972754'> <error type='DTE'></error> </testcase> <testcase classname='BTS_Tests_LAPDm' name='TC_rr_response_frame_loss' time='4.980539'> <error type='DTE'></error> </testcase> <testcase classname='BTS_Tests_LAPDm' name='TC_incorrect_cr' time='4.972311'> <error type='DTE'></error> </testcase> <testcase classname='BTS_Tests_LAPDm' name='TC_sabm_incorrect_c' time='4.978275'> <error type='DTE'></error> </testcase> <testcase classname='BTS_Tests_LAPDm' name='TC_normal_reestablishment' time='4.978321'> <error type='DTE'></error> </testcase> <testcase classname='BTS_Tests_LAPDm' name='TC_normal_reestablishment_state_unacked' time='4.974148'> <error type='DTE'></error> </testcase> <testcase classname='BTS_Tests_VAMOS' name='TC_vamos_chan_act_vff' time='6.220458'/> <testcase classname='BTS_Tests_VAMOS' name='TC_vamos_chan_act_vhh' time='6.197288'/> <testcase classname='BTS_Tests_VAMOS' name='TC_vamos_chan_act_hvhh' time='6.197013'/> <testcase classname='BTS_Tests_VAMOS' name='TC_vamos_chan_act_dyn_ipa_vff' time='6.204260'/> <testcase classname='BTS_Tests_VAMOS' name='TC_vamos_chan_act_dyn_osmo_vff' time='6.221423'/> <testcase classname='BTS_Tests_VAMOS' name='TC_vamos_chan_act_dyn_osmo_vhh' time='6.217528'/> <testcase classname='BTS_Tests_VAMOS' name='TC_vamos_chan_act_dyn_osmo_hvhh' time='6.211626'/> <testcase classname='BTS_Tests_VAMOS' name='TC_vamos_chan_mode_modify_vff' time='4.979468'/> <testcase classname='BTS_Tests_VAMOS' name='TC_vamos_chan_mode_modify_vhh' time='5.051415'/> <testcase classname='BTS_Tests_VAMOS' name='TC_vamos_chan_mode_modify_hvhh' time='5.033995'/> <testcase classname='BTS_Tests_VAMOS' name='TC_vamos_chan_mode_modify_dyn_ipa_vff' time='5.006769'/> <testcase classname='BTS_Tests_VAMOS' name='TC_vamos_chan_mode_modify_dyn_osmo_vff' time='5.014233'/> <testcase classname='BTS_Tests_VAMOS' name='TC_vamos_chan_mode_modify_dyn_osmo_vhh' time='5.085206'/> <testcase classname='BTS_Tests_VAMOS' name='TC_vamos_chan_mode_modify_dyn_osmo_hvhh' time='5.061581'/> </testsuite> Build step 'Execute shell' marked build as failure Recording test results [Checks API] No suitable checks publisher found.
See https://jenkins.osmocom.org/jenkins/job/TTCN3-centos-bts-test/928/display/redirect
Changes:
------------------------------------------ [...truncated 3.24 MB...] <error type='DTE'></error> </testcase> <testcase classname='BTS_Tests' name='TC_rll_unit_data_req_ACCH' time='4.998402'> <error type='DTE'></error> </testcase> <testcase classname='BTS_Tests' name='TC_rll_unit_data_ind_DCCH' time='5.012158'> <error type='DTE'></error> </testcase> <testcase classname='BTS_Tests' name='TC_rll_unit_data_ind_ACCH' time='5.011612'> <error type='DTE'></error> </testcase> <testcase classname='BTS_Tests' name='TC_chan_act_a51' time='4.970713'> <error type='DTE'></error> </testcase> <testcase classname='BTS_Tests' name='TC_chan_act_a52' time='4.961784'> <error type='DTE'></error> </testcase> <testcase classname='BTS_Tests' name='TC_chan_act_a53' time='4.969165'> <error type='DTE'></error> </testcase> <testcase classname='BTS_Tests' name='TC_chan_act_a54' time='4.978540'> <error type='DTE'></error> </testcase> <testcase classname='BTS_Tests' name='TC_encr_cmd_a51' time='4.975585'> <error type='DTE'></error> </testcase> <testcase classname='BTS_Tests' name='TC_encr_cmd_a52' time='4.971938'> <error type='DTE'></error> </testcase> <testcase classname='BTS_Tests' name='TC_encr_cmd_a53' time='4.972247'> <error type='DTE'></error> </testcase> <testcase classname='BTS_Tests' name='TC_encr_cmd_a54' time='4.973900'> <error type='DTE'></error> </testcase> <testcase classname='BTS_Tests' name='TC_err_rep_wrong_mdisc' time='9.963648'> <error type='DTE'></error> </testcase> <testcase classname='BTS_Tests' name='TC_err_rep_wrong_msg_type' time='9.863813'> <error type='DTE'></error> </testcase> <testcase classname='BTS_Tests' name='TC_err_rep_wrong_sequence' time='9.876111'> <error type='DTE'></error> </testcase> <testcase classname='BTS_Tests' name='TC_lapdm_selftest' time='0.002568'/> <testcase classname='BTS_Tests' name='TC_tch_sign_l2_fill_frame' time='0.814203'> <error type='DTE'></error> </testcase> <testcase classname='BTS_Tests' name='TC_tch_sign_l2_fill_frame_dtxd' time='4.987231'> <error type='DTE'></error> </testcase> <testcase classname='BTS_Tests' name='TC_chopped_ipa_ping' time='28.436230'/> <testcase classname='BTS_Tests' name='TC_chopped_ipa_payload' time='42.671597'/> <testcase classname='BTS_Tests' name='TC_ms_pwr_ctrl_constant' time='4.606886'> <error type='DTE'></error> </testcase> <testcase classname='BTS_Tests' name='TC_ms_pwr_ctrl_pf_ewma' time='5.001244'> <error type='DTE'></error> </testcase> <testcase classname='BTS_Tests' name='TC_speech_no_rtp_tchf' time='4.951678'> <error type='DTE'></error> </testcase> <testcase classname='BTS_Tests' name='TC_speech_no_rtp_tchh' time='4.951738'> <error type='DTE'></error> </testcase> <testcase classname='BTS_Tests' name='TC_speech_rtp_tchf' time='4.891510'> <error type='DTE'></error> </testcase> <testcase classname='BTS_Tests' name='TC_speech_rtp_tchh' time='4.966023'> <error type='DTE'></error> </testcase> <testcase classname='BTS_Tests' name='TC_speech_osmux_tchf' time='4.958516'> <error type='DTE'></error> </testcase> <testcase classname='BTS_Tests' name='TC_speech_osmux_tchh' time='4.960480'> <error type='DTE'></error> </testcase> <testcase classname='BTS_Tests' name='TC_early_immediate_assignment' time='4.955375'> <error type='DTE'></error> </testcase> <testcase classname='BTS_Tests' name='TC_acch_overpower_rxqual_thresh' time='4.952816'> <error type='DTE'></error> </testcase> <testcase classname='BTS_Tests' name='TC_acch_overpower_rxqual_thresh_dtx' time='4.955291'> <error type='DTE'></error> </testcase> <testcase classname='BTS_Tests' name='TC_acch_overpower_always_on_facch' time='4.953964'> <error type='DTE'></error> </testcase> <testcase classname='BTS_Tests' name='TC_acch_overpower_always_on_sacch' time='4.951185'> <error type='DTE'></error> </testcase> <testcase classname='BTS_Tests' name='TC_acch_overpower_limit' time='4.963131'> <error type='DTE'></error> </testcase> <testcase classname='BTS_Tests' name='TC_dyn_osmo_pdch_tchh_race_act' time='6.563947'/> <testcase classname='BTS_Tests' name='TC_dyn_osmo_pdch_sdcch8_race_act' time='6.786978'/> <testcase classname='BTS_Tests_SMSCB' name='TC_cbch_load_idle_no_cbch' time='14.923535'/> <testcase classname='BTS_Tests_SMSCB' name='TC_sms_cb_cmd_sdcch4_1block' time='4.809744'> <error type='DTE'>Dynamic test case error: Stand-alone receive statement failed in file L1CTL_PortType.ttcn, line 298.</error> </testcase> <testcase classname='BTS_Tests_SMSCB' name='TC_sms_cb_cmd_sdcch4_2block' time='4.967613'> <error type='DTE'>Dynamic test case error: Stand-alone receive statement failed in file L1CTL_PortType.ttcn, line 298.</error> </testcase> <testcase classname='BTS_Tests_SMSCB' name='TC_sms_cb_cmd_sdcch4_3block' time='4.934234'> <error type='DTE'>Dynamic test case error: Stand-alone receive statement failed in file L1CTL_PortType.ttcn, line 298.</error> </testcase> <testcase classname='BTS_Tests_SMSCB' name='TC_sms_cb_cmd_sdcch4_4block' time='4.940533'> <error type='DTE'>Dynamic test case error: Stand-alone receive statement failed in file L1CTL_PortType.ttcn, line 298.</error> </testcase> <testcase classname='BTS_Tests_SMSCB' name='TC_sms_cb_cmd_sdcch4_multi' time='4.945171'> <error type='DTE'>Dynamic test case error: Stand-alone receive statement failed in file L1CTL_PortType.ttcn, line 298.</error> </testcase> <testcase classname='BTS_Tests_SMSCB' name='TC_sms_cb_cmd_sdcch4_schedule' time='4.950682'> <error type='DTE'>Dynamic test case error: Stand-alone receive statement failed in file L1CTL_PortType.ttcn, line 298.</error> </testcase> <testcase classname='BTS_Tests_SMSCB' name='TC_sms_cb_cmd_sdcch4_default_only' time='4.950265'> <error type='DTE'>Dynamic test case error: Stand-alone receive statement failed in file L1CTL_PortType.ttcn, line 298.</error> </testcase> <testcase classname='BTS_Tests_SMSCB' name='TC_sms_cb_cmd_sdcch4_default_and_normal' time='4.988191'> <error type='DTE'>Dynamic test case error: Stand-alone receive statement failed in file L1CTL_PortType.ttcn, line 298.</error> </testcase> <testcase classname='BTS_Tests_SMSCB' name='TC_sms_cb_cmd_sdcch4_default_then_null' time='4.920871'> <error type='DTE'>Dynamic test case error: Stand-alone receive statement failed in file L1CTL_PortType.ttcn, line 298.</error> </testcase> <testcase classname='BTS_Tests_SMSCB' name='TC_cbc_sdcch4_load_idle' time='14.950848'/> <testcase classname='BTS_Tests_SMSCB' name='TC_cbc_sdcch4_load_overload' time='16.809490'/> <testcase classname='BTS_Tests_SMSCB' name='TC_sms_cb_cmd_sdcch8_1block' time='4.797415'> <error type='DTE'>Dynamic test case error: Stand-alone receive statement failed in file L1CTL_PortType.ttcn, line 298.</error> </testcase> <testcase classname='BTS_Tests_SMSCB' name='TC_sms_cb_cmd_sdcch8_2block' time='4.953225'> <error type='DTE'>Dynamic test case error: Stand-alone receive statement failed in file L1CTL_PortType.ttcn, line 298.</error> </testcase> <testcase classname='BTS_Tests_SMSCB' name='TC_sms_cb_cmd_sdcch8_3block' time='4.912255'> <error type='DTE'>Dynamic test case error: Stand-alone receive statement failed in file L1CTL_PortType.ttcn, line 298.</error> </testcase> <testcase classname='BTS_Tests_SMSCB' name='TC_sms_cb_cmd_sdcch8_4block' time='4.949382'> <error type='DTE'>Dynamic test case error: Stand-alone receive statement failed in file L1CTL_PortType.ttcn, line 298.</error> </testcase> <testcase classname='BTS_Tests_SMSCB' name='TC_sms_cb_cmd_sdcch8_multi' time='4.942257'> <error type='DTE'>Dynamic test case error: Stand-alone receive statement failed in file L1CTL_PortType.ttcn, line 298.</error> </testcase> <testcase classname='BTS_Tests_SMSCB' name='TC_sms_cb_cmd_sdcch8_schedule' time='4.944663'> <error type='DTE'>Dynamic test case error: Stand-alone receive statement failed in file L1CTL_PortType.ttcn, line 298.</error> </testcase> <testcase classname='BTS_Tests_SMSCB' name='TC_sms_cb_cmd_sdcch8_default_only' time='4.947575'> <error type='DTE'>Dynamic test case error: Stand-alone receive statement failed in file L1CTL_PortType.ttcn, line 298.</error> </testcase> <testcase classname='BTS_Tests_SMSCB' name='TC_sms_cb_cmd_sdcch8_default_and_normal' time='4.954737'> <error type='DTE'>Dynamic test case error: Stand-alone receive statement failed in file L1CTL_PortType.ttcn, line 298.</error> </testcase> <testcase classname='BTS_Tests_SMSCB' name='TC_cbc_sdcch8_load_idle' time='14.947694'/> <testcase classname='BTS_Tests_SMSCB' name='TC_cbc_sdcch8_load_overload' time='16.813525'/> <testcase classname='BTS_Tests_SMSCB' name='TC_etws_p1ro' time='4.789440'> <error type='DTE'>Dynamic test case error: Stand-alone receive statement failed in file L1CTL_PortType.ttcn, line 298.</error> </testcase> <testcase classname='BTS_Tests_SMSCB' name='TC_etws_p1ro_end' time='4.959049'> <error type='DTE'>Dynamic test case error: Stand-alone receive statement failed in file L1CTL_PortType.ttcn, line 298.</error> </testcase> <testcase classname='BTS_Tests_SMSCB' name='TC_etws_pcu' time='4.952896'> <error type='DTE'>Dynamic test case error: Stand-alone receive statement failed in file L1CTL_PortType.ttcn, line 298.</error> </testcase> <testcase classname='BTS_Tests_LAPDm' name='TC_sabm_ua_dcch_sapi0' time='4.973672'> <error type='DTE'></error> </testcase> <testcase classname='BTS_Tests_LAPDm' name='TC_sabm_ua_dcch_sapi0_nopayload' time='4.996849'> <error type='DTE'></error> </testcase> <testcase classname='BTS_Tests_LAPDm' name='TC_sabm_ua_dcch_sapi3' time='4.974787'> <error type='DTE'></error> </testcase> <testcase classname='BTS_Tests_LAPDm' name='TC_sabm_ua_dcch_sapi4' time='4.970521'> <error type='DTE'></error> </testcase> <testcase classname='BTS_Tests_LAPDm' name='TC_sabm_contention' time='4.972711'> <error type='DTE'></error> </testcase> <testcase classname='BTS_Tests_LAPDm' name='TC_sabm_retransmit' time='4.977829'> <error type='DTE'></error> </testcase> <testcase classname='BTS_Tests_LAPDm' name='TC_sabm_retransmit_bts' time='4.972905'> <error type='DTE'></error> </testcase> <testcase classname='BTS_Tests_LAPDm' name='TC_sabm_invalid_resp' time='4.982230'> <error type='DTE'></error> </testcase> <testcase classname='BTS_Tests_LAPDm' name='TC_sabm_dm' time='4.979966'> <error type='DTE'></error> </testcase> <testcase classname='BTS_Tests_LAPDm' name='TC_establish_ign_first_sabm' time='4.969095'> <error type='DTE'></error> </testcase> <testcase classname='BTS_Tests_LAPDm' name='TC_iframe_seq_and_ack' time='4.977091'> <error type='DTE'></error> </testcase> <testcase classname='BTS_Tests_LAPDm' name='TC_iframe_timer_recovery' time='4.973739'> <error type='DTE'></error> </testcase> <testcase classname='BTS_Tests_LAPDm' name='TC_ns_seq_error' time='4.969221'> <error type='DTE'></error> </testcase> <testcase classname='BTS_Tests_LAPDm' name='TC_nr_seq_error' time='4.973594'> <error type='DTE'></error> </testcase> <testcase classname='BTS_Tests_LAPDm' name='TC_rec_invalid_frame' time='4.973999'> <error type='DTE'></error> </testcase> <testcase classname='BTS_Tests_LAPDm' name='TC_segm_concat_dcch' time='4.969151'> <error type='DTE'></error> </testcase> <testcase classname='BTS_Tests_LAPDm' name='TC_segm_concat_sacch' time='4.971846'> <error type='DTE'></error> </testcase> <testcase classname='BTS_Tests_LAPDm' name='TC_t200_n200' time='4.971172'> <error type='DTE'></error> </testcase> <testcase classname='BTS_Tests_LAPDm' name='TC_rr_response_frame_loss' time='4.969019'> <error type='DTE'></error> </testcase> <testcase classname='BTS_Tests_LAPDm' name='TC_incorrect_cr' time='4.975359'> <error type='DTE'></error> </testcase> <testcase classname='BTS_Tests_LAPDm' name='TC_sabm_incorrect_c' time='4.972010'> <error type='DTE'></error> </testcase> <testcase classname='BTS_Tests_LAPDm' name='TC_normal_reestablishment' time='4.975881'> <error type='DTE'></error> </testcase> <testcase classname='BTS_Tests_LAPDm' name='TC_normal_reestablishment_state_unacked' time='4.972143'> <error type='DTE'></error> </testcase> <testcase classname='BTS_Tests_VAMOS' name='TC_vamos_chan_act_vff' time='6.218233'/> <testcase classname='BTS_Tests_VAMOS' name='TC_vamos_chan_act_vhh' time='6.211999'/> <testcase classname='BTS_Tests_VAMOS' name='TC_vamos_chan_act_hvhh' time='6.199329'/> <testcase classname='BTS_Tests_VAMOS' name='TC_vamos_chan_act_dyn_ipa_vff' time='6.201811'/> <testcase classname='BTS_Tests_VAMOS' name='TC_vamos_chan_act_dyn_osmo_vff' time='6.186191'/> <testcase classname='BTS_Tests_VAMOS' name='TC_vamos_chan_act_dyn_osmo_vhh' time='6.211986'/> <testcase classname='BTS_Tests_VAMOS' name='TC_vamos_chan_act_dyn_osmo_hvhh' time='6.171097'/> <testcase classname='BTS_Tests_VAMOS' name='TC_vamos_chan_mode_modify_vff' time='4.991325'/> <testcase classname='BTS_Tests_VAMOS' name='TC_vamos_chan_mode_modify_vhh' time='5.041294'/> <testcase classname='BTS_Tests_VAMOS' name='TC_vamos_chan_mode_modify_hvhh' time='5.026909'/> <testcase classname='BTS_Tests_VAMOS' name='TC_vamos_chan_mode_modify_dyn_ipa_vff' time='5.016930'/> <testcase classname='BTS_Tests_VAMOS' name='TC_vamos_chan_mode_modify_dyn_osmo_vff' time='5.008653'/> <testcase classname='BTS_Tests_VAMOS' name='TC_vamos_chan_mode_modify_dyn_osmo_vhh' time='5.051216'/> <testcase classname='BTS_Tests_VAMOS' name='TC_vamos_chan_mode_modify_dyn_osmo_hvhh' time='5.016501'/> </testsuite> Build step 'Execute shell' marked build as failure Recording test results [Checks API] No suitable checks publisher found.
See https://jenkins.osmocom.org/jenkins/job/TTCN3-centos-bts-test/931/display/redirect
Changes:
------------------------------------------ [...truncated 8.35 MB...] TC_conn_fail_crit-RSL-IPA(378)@7c99ff085355: CCM Tx:{ msg_type := IPAC_MSGT_ID_ACK (6), u := omit } TC_conn_fail_crit-RSL-IPA(378)@7c99ff085355: CCM Rx:{ msg_type := IPAC_MSGT_ID_ACK (6), u := omit } TC_conn_fail_crit-RSL(379)@7c99ff085355: A new IPA/RSL connection has been established (conn_id=5), waiting for IDENTITY RESPONSE... MTC@7c99ff085355: 2/4 RF Resource Indication(s) received TC_conn_fail_crit-RSL(379)@7c99ff085355: Got IDENTITY RESPONSE (conn_id=4): { { len := 28, tag := IPAC_IDTAG_UNITNAME (1), data := '6F736D6F2D6274732D30322D34322D61632D31322D30392D313400'O }, { len := 10, tag := IPAC_IDTAG_UNITID (8), data := '313233342F302F3200'O } } TC_conn_fail_crit-RSL(379)@7c99ff085355: Warning: The first argument (instr) of function regexp(), which is "1234/0/2" & char(0, 0, 0, 0), contains a character with zero character code at index 8. The rest of the string will be ignored during matching. TC_conn_fail_crit-RSL(379)@7c99ff085355: Mapped TRX#2 to TCP/IP conn_id=4 MTC@7c99ff085355: 3/4 transceiver(s) connected TC_conn_fail_crit-RSL-IPA(378)@7c99ff085355: CCM Rx:{ msg_type := IPAC_MSGT_ID_RESP (5), u := { resp := { { len := 28, tag := IPAC_IDTAG_UNITNAME (1), data := '6F736D6F2D6274732D30322D34322D61632D31322D30392D313400'O }, { len := 10, tag := IPAC_IDTAG_UNITID (8), data := '313233342F302F3300'O } } } } TC_conn_fail_crit-RSL-IPA(378)@7c99ff085355: IPA ID RESP: { { len := 28, tag := IPAC_IDTAG_UNITNAME (1), data := '6F736D6F2D6274732D30322D34322D61632D31322D30392D313400'O }, { len := 10, tag := IPAC_IDTAG_UNITID (8), data := '313233342F302F3300'O } } TC_conn_fail_crit-RSL-IPA(378)@7c99ff085355: CCM Tx:{ msg_type := IPAC_MSGT_ID_ACK (6), u := omit } TC_conn_fail_crit-RSL-IPA(378)@7c99ff085355: CCM Rx:{ msg_type := IPAC_MSGT_ID_ACK (6), u := omit } TC_conn_fail_crit-RSL(379)@7c99ff085355: Got IDENTITY RESPONSE (conn_id=5): { { len := 28, tag := IPAC_IDTAG_UNITNAME (1), data := '6F736D6F2D6274732D30322D34322D61632D31322D30392D313400'O }, { len := 10, tag := IPAC_IDTAG_UNITID (8), data := '313233342F302F3300'O } } MTC@7c99ff085355: 3/4 RF Resource Indication(s) received TC_conn_fail_crit-RSL(379)@7c99ff085355: Warning: The first argument (instr) of function regexp(), which is "1234/0/3" & char(0, 0, 0, 0), contains a character with zero character code at index 8. The rest of the string will be ignored during matching. TC_conn_fail_crit-RSL(379)@7c99ff085355: Mapped TRX#3 to TCP/IP conn_id=5 MTC@7c99ff085355: 4/4 transceiver(s) connected MTC@7c99ff085355: 4/4 RF Resource Indication(s) received MTC@7c99ff085355: Setting RSL_SYSTEM_INFO_3 (3): { header := { l2_plen := { l2_plen := 18, zero_one := '01'B }, skip_indicator := 0, rr_protocol_discriminator := 6, message_type := SYSTEM_INFORMATION_TYPE_3 (27) }, payload := { si3 := { cell_id := 23, lai := { mcc_mnc := '262F42'H, lac := 42 }, ctrl_chan_desc := { msc_r99 := true, att := true, bs_ag_blks_res := 1, ccch_conf := CCHAN_DESC_1CCCH_COMBINED (1), si22ind := false, cbq3 := CBQ3_IU_MODE_NOT_SUPPORTED (0), spare := '00'B, bs_pa_mfrms := 0, t3212 := 1 }, cell_options := { dn_ind := false, pwrc := false, dtx := MS_MAY_USE_UL_DTX (0), radio_link_tout_div4 := 7 }, cell_sel_par := { cell_resel_hyst_2dB := 2, ms_txpwr_max_cch := 7, acs := '0'B, neci := true, rxlev_access_min := 0 }, rach_control := { max_retrans := RACH_MAX_RETRANS_7 (3), tx_integer := '1001'B, cell_barr_access := false, re_not_allowed := true, acc := '0000010000000000'B }, rest_octets := { sel_params := { presence := '0'B, params := omit }, pwr_offset := { presence := '0'B, offset := omit }, si_2ter_ind := '0'B, early_cm_ind := '0'B, sched_where := { presence := '0'B, where := omit }, gprs_ind := { presence := '1'B, ind := { ra_colour := 0, si13_pos := '0'B } }, umts_early_cm_ind := '0'B, si2_quater_ind := { presence := '0'B, ind := omit }, iu_mode_ind := omit, si21_ind := { presence := '0'B, pos := omit } } } } } MTC@7c99ff085355: Setting RSL_SYSTEM_INFO_3 (3): '49061B001762F224002AC90001074740E504002C2B2B2B'O MTC@7c99ff085355: Setting RSL_SYSTEM_INFO_2 (2): { header := { l2_plen := { l2_plen := 22, zero_one := '01'B }, skip_indicator := 0, rr_protocol_discriminator := 6, message_type := SYSTEM_INFORMATION_TYPE_2 (26) }, payload := { si2 := { bcch_freq_list := '00000000000000000000000000000000'O, ncc_permitted := '11111111'B, rach_control := { max_retrans := RACH_MAX_RETRANS_7 (3), tx_integer := '1001'B, cell_barr_access := false, re_not_allowed := true, acc := '0000010000000000'B } } } } MTC@7c99ff085355: Setting RSL_SYSTEM_INFO_2 (2): '59061A00000000000000000000000000000000FFE50400'O MTC@7c99ff085355: Setting RSL_SYSTEM_INFO_4 (4): { header := { l2_plen := { l2_plen := 12, zero_one := '01'B }, skip_indicator := 0, rr_protocol_discriminator := 6, message_type := SYSTEM_INFORMATION_TYPE_4 (28) }, payload := { si4 := { lai := { mcc_mnc := '262F42'H, lac := 42 }, cell_sel_par := { cell_resel_hyst_2dB := 2, ms_txpwr_max_cch := 7, acs := '0'B, neci := true, rxlev_access_min := 0 }, rach_control := { max_retrans := RACH_MAX_RETRANS_7 (3), tx_integer := '1001'B, cell_barr_access := false, re_not_allowed := true, acc := '0000010000000000'B }, cbch_chan_desc := omit, cbch_mobile_alloc := omit, rest_octets := { sel_params := { presence := '0'B, params := omit }, pwr_offset := { presence := '0'B, offset := omit }, gprs_ind := { presence := '1'B, ind := { ra_colour := 0, si13_pos := '0'B } }, s_presence := '0'B, s := omit } } } } MTC@7c99ff085355: Setting RSL_SYSTEM_INFO_4 (4): '31061C62F224002A4740E50400012B2B2B2B2B2B2B2B2B'O MTC@7c99ff085355: Warning: dec_TrxcMessage(): Data remained at the end of the stream after successful decoding: '00'O MTC@7c99ff085355: Warning: dec_TrxcMessage(): Data remained at the end of the stream after successful decoding: '00'O MTC@7c99ff085355: Warning: dec_TrxcMessage(): Data remained at the end of the stream after successful decoding: '00'O MTC@7c99ff085355: Freq. hopping parameters: { enabled := true, maio_hsn := { maio := 1, hsn := 6 }, ma_map := { len := 1, ma := '10010000'B }, ma := { { pcs := false, uplink := false, spare := '0000'B, arfcn := 871 }, { pcs := false, uplink := false, spare := '0000'B, arfcn := 877 } } } TC_conn_fail_crit(381)@7c99ff085355: setverdict(pass): none -> pass TC_conn_fail_crit(381)@7c99ff085355: setverdict(pass): pass -> pass, component reason not changed TC_conn_fail_crit(381)@7c99ff085355: setverdict(pass): pass -> pass, component reason not changed TC_conn_fail_crit(381)@7c99ff085355: Final verdict of PTC: pass TC_conn_fail_crit-RSL(379)@7c99ff085355: Final verdict of PTC: none TC_conn_fail_crit-RSL-IPA(378)@7c99ff085355: Final verdict of PTC: none IPA-CTRL-CLI-IPA(380)@7c99ff085355: Final verdict of PTC: none MTC@7c99ff085355: Setting final verdict of the test case. MTC@7c99ff085355: Local verdict of MTC: none MTC@7c99ff085355: Local verdict of PTC TC_conn_fail_crit-RSL-IPA(378): none (none -> none) MTC@7c99ff085355: Local verdict of PTC TC_conn_fail_crit-RSL(379): none (none -> none) MTC@7c99ff085355: Local verdict of PTC IPA-CTRL-CLI-IPA(380): none (none -> none) MTC@7c99ff085355: Local verdict of PTC TC_conn_fail_crit(381): pass (none -> pass) MTC@7c99ff085355: Test case TC_conn_fail_crit finished. Verdict: pass MTC@7c99ff085355: Starting external command `../ttcn3-tcpdump-stop.sh BTS_Tests.TC_conn_fail_crit pass'. Sun Nov 27 14:06:56 UTC 2022 -e [1;32m====== BTS_Tests.TC_conn_fail_crit pass ======[0m
Saving talloc report from 172.18.9.20:4241 to BTS_Tests.TC_conn_fail_crit.talloc Waiting for packet dumper to finish... 0 (prev_count=-1, count=18767161) Waiting for packet dumper to finish... 1 (prev_count=18767161, count=19163230) MTC@7c99ff085355: External command `../ttcn3-tcpdump-stop.sh BTS_Tests.TC_conn_fail_crit pass' was executed successfully (exit status: 0). MTC@7c99ff085355: Starting external command `../ttcn3-tcpdump-start.sh BTS_Tests.TC_paging_imsi_80percent'. ------ BTS_Tests.TC_paging_imsi_80percent ------ Sun Nov 27 14:07:01 UTC 2022 NOTE: unable to use dumpcap due to missing capabilities or suid bit Waiting for packet dumper to start... 0 MTC@7c99ff085355: External command `../ttcn3-tcpdump-start.sh BTS_Tests.TC_paging_imsi_80percent' was executed successfully (exit status: 0). MTC@7c99ff085355: Test case TC_paging_imsi_80percent started. TC_paging_imsi_80percent-RSL-IPA(382)@7c99ff085355: Established a new IPA connection (conn_id=2) TC_paging_imsi_80percent-RSL-IPA(382)@7c99ff085355: CCM Tx:{ msg_type := IPAC_MSGT_ID_GET (4), u := { get := { { len := 1, tag := IPAC_IDTAG_UNITNAME (1) }, { len := 1, tag := IPAC_IDTAG_UNITID (8) } } } } TC_paging_imsi_80percent-RSL(383)@7c99ff085355: A new IPA/RSL connection has been established (conn_id=2), waiting for IDENTITY RESPONSE... TC_paging_imsi_80percent-RSL-IPA(382)@7c99ff085355: Established a new IPA connection (conn_id=3) TC_paging_imsi_80percent-RSL-IPA(382)@7c99ff085355: CCM Tx:{ msg_type := IPAC_MSGT_ID_GET (4), u := { get := { { len := 1, tag := IPAC_IDTAG_UNITNAME (1) }, { len := 1, tag := IPAC_IDTAG_UNITID (8) } } } } TC_paging_imsi_80percent-RSL(383)@7c99ff085355: A new IPA/RSL connection has been established (conn_id=3), waiting for IDENTITY RESPONSE... TC_paging_imsi_80percent-RSL-IPA(382)@7c99ff085355: Established a new IPA connection (conn_id=4) TC_paging_imsi_80percent-RSL-IPA(382)@7c99ff085355: CCM Tx:{ msg_type := IPAC_MSGT_ID_GET (4), u := { get := { { len := 1, tag := IPAC_IDTAG_UNITNAME (1) }, { len := 1, tag := IPAC_IDTAG_UNITID (8) } } } } TC_paging_imsi_80percent-RSL(383)@7c99ff085355: A new IPA/RSL connection has been established (conn_id=4), waiting for IDENTITY RESPONSE... TC_paging_imsi_80percent-RSL-IPA(382)@7c99ff085355: CCM Rx:{ msg_type := IPAC_MSGT_ID_RESP (5), u := { resp := { { len := 28, tag := IPAC_IDTAG_UNITNAME (1), data := '6F736D6F2D6274732D30322D34322D61632D31322D30392D313400'O }, { len := 10, tag := IPAC_IDTAG_UNITID (8), data := '313233342F302F3000'O } } } } TC_paging_imsi_80percent-RSL-IPA(382)@7c99ff085355: IPA ID RESP: { { len := 28, tag := IPAC_IDTAG_UNITNAME (1), data := '6F736D6F2D6274732D30322D34322D61632D31322D30392D313400'O }, { len := 10, tag := IPAC_IDTAG_UNITID (8), data := '313233342F302F3000'O } } TC_paging_imsi_80percent-RSL-IPA(382)@7c99ff085355: CCM Tx:{ msg_type := IPAC_MSGT_ID_ACK (6), u := omit } TC_paging_imsi_80percent-RSL-IPA(382)@7c99ff085355: CCM Rx:{ msg_type := IPAC_MSGT_ID_ACK (6), u := omit } TC_paging_imsi_80percent-RSL(383)@7c99ff085355: Got IDENTITY RESPONSE (conn_id=2): { { len := 28, tag := IPAC_IDTAG_UNITNAME (1), data := '6F736D6F2D6274732D30322D34322D61632D31322D30392D313400'O }, { len := 10, tag := IPAC_IDTAG_UNITID (8), data := '313233342F302F3000'O } } TC_paging_imsi_80percent-RSL(383)@7c99ff085355: Warning: The first argument (instr) of function regexp(), which is "1234/0/0" & char(0, 0, 0, 0), contains a character with zero character code at index 8. The rest of the string will be ignored during matching. TC_paging_imsi_80percent-RSL-IPA(382)@7c99ff085355: Established a new IPA connection (conn_id=5) TC_paging_imsi_80percent-RSL-IPA(382)@7c99ff085355: CCM Tx:{ msg_type := IPAC_MSGT_ID_GET (4), u := { get := { { len := 1, tag := IPAC_IDTAG_UNITNAME (1) }, { len := 1, tag := IPAC_IDTAG_UNITID (8) } } } } TC_paging_imsi_80percent-RSL(383)@7c99ff085355: Mapped TRX#0 to TCP/IP conn_id=2 MTC@7c99ff085355: 1/4 transceiver(s) connected TC_paging_imsi_80percent-RSL(383)@7c99ff085355: A new IPA/RSL connection has been established (conn_id=5), waiting for IDENTITY RESPONSE... TC_paging_imsi_80percent-RSL-IPA(382)@7c99ff085355: CCM Rx:{ msg_type := IPAC_MSGT_ID_RESP (5), u := { resp := { { len := 28, tag := IPAC_IDTAG_UNITNAME (1), data := '6F736D6F2D6274732D30322D34322D61632D31322D30392D313400'O }, { len := 10, tag := IPAC_IDTAG_UNITID (8), data := '313233342F302F3100'O } } } } TC_paging_imsi_80percent-RSL-IPA(382)@7c99ff085355: IPA ID RESP: { { len := 28, tag := IPAC_IDTAG_UNITNAME (1), data := '6F736D6F2D6274732D30322D34322D61632D31322D30392D313400'O }, { len := 10, tag := IPAC_IDTAG_UNITID (8), data := '313233342F302F3100'O } } TC_paging_imsi_80percent-RSL-IPA(382)@7c99ff085355: CCM Tx:{ msg_type := IPAC_MSGT_ID_ACK (6), u := omit } TC_paging_imsi_80percent-RSL-IPA(382)@7c99ff085355: CCM Rx:{ msg_type := IPAC_MSGT_ID_ACK (6), u := omit } TC_paging_imsi_80percent-RSL-IPA(382)@7c99ff085355: CCM Rx:{ msg_type := IPAC_MSGT_ID_RESP (5), u := { resp := { { len := 28, tag := IPAC_IDTAG_UNITNAME (1), data := '6F736D6F2D6274732D30322D34322D61632D31322D30392D313400'O }, { len := 10, tag := IPAC_IDTAG_UNITID (8), data := '313233342F302F3200'O } } } } TC_paging_imsi_80percent-RSL-IPA(382)@7c99ff085355: IPA ID RESP: { { len := 28, tag := IPAC_IDTAG_UNITNAME (1), data := '6F736D6F2D6274732D30322D34322D61632D31322D30392D313400'O }, { len := 10, tag := IPAC_IDTAG_UNITID (8), data := '313233342F302F3200'O } } TC_paging_imsi_80percent-RSL-IPA(382)@7c99ff085355: CCM Tx:{ msg_type := IPAC_MSGT_ID_ACK (6), u := omit } TC_paging_imsi_80percent-RSL-IPA(382)@7c99ff085355: CCM Rx:{ msg_type := IPAC_MSGT_ID_ACK (6), u := omit } MTC@7c99ff085355: 1/4 RF Resource Indication(s) received TC_paging_imsi_80percent-RSL-IPA(382)@7c99ff085355: CCM Rx:{ msg_type := IPAC_MSGT_ID_RESP (5), u := { resp := { { len := 28, tag := IPAC_IDTAG_UNITNAME (1), data := '6F736D6F2D6274732D30322D34322D61632D31322D30392D313400'O }, { len := 10, tag := IPAC_IDTAG_UNITID (8), data := '313233342F302F3300'O } } } } TC_paging_imsi_80percent-RSL-IPA(382)@7c99ff085355: IPA ID RESP: { { len := 28, tag := IPAC_IDTAG_UNITNAME (1), data := '6F736D6F2D6274732D30322D34322D61632D31322D30392D313400'O }, { len := 10, tag := IPAC_IDTAG_UNITID (8), data := '313233342F302F3300'O } } TC_paging_imsi_80percent-RSL-IPA(382)@7c99ff085355: CCM Tx:{ msg_type := IPAC_MSGT_ID_ACK (6), u := omit } TC_paging_imsi_80percent-RSL-IPA(382)@7c99ff085355: CCM Rx:{ msg_type := IPAC_MSGT_ID_ACK (6), u := omit } TC_paging_imsi_80percent-RSL(383)@7c99ff085355: Got IDENTITY RESPONSE (conn_id=3): { { len := 28, tag := IPAC_IDTAG_UNITNAME (1), data := '6F736D6F2D6274732D30322D34322D61632D31322D30392D313400'O }, { len := 10, tag := IPAC_IDTAG_UNITID (8), data := '313233342F302F3100'O } } TC_paging_imsi_80percent-RSL(383)@7c99ff085355: Warning: The first argument (instr) of function regexp(), which is "1234/0/1" & char(0, 0, 0, 0), contains a character with zero character code at index 8. The rest of the string will be ignored during matching. TC_paging_imsi_80percent-RSL(383)@7c99ff085355: Mapped TRX#1 to TCP/IP conn_id=3 MTC@7c99ff085355: 2/4 transceiver(s) connected TC_paging_imsi_80percent-RSL(383)@7c99ff085355: Got IDENTITY RESPONSE (conn_id=4): { { len := 28, tag := IPAC_IDTAG_UNITNAME (1), data := '6F736D6F2D6274732D30322D34322D61632D31322D30392D313400'O }, { len := 10, tag := IPAC_IDTAG_UNITID (8), data := '313233342F302F3200'O } } MTC@7c99ff085355: 2/4 RF Resource Indication(s) received TC_paging_imsi_80percent-RSL(383)@7c99ff085355: Warning: The first argument (instr) of function regexp(), which is "1234/0/2" & char(0, 0, 0, 0), contains a character with zero character code at index 8. The rest of the string will be ignored during matching. TC_paging_imsi_80percent-RSL(383)@7c99ff085355: Mapped TRX#2 to TCP/IP conn_id=4 MTC@7c99ff085355: 3/4 transceiver(s) connected TC_paging_imsi_80percent-RSL(383)@7c99ff085355: Got IDENTITY RESPONSE (conn_id=5): { { len := 28, tag := IPAC_IDTAG_UNITNAME (1), data := '6F736D6F2D6274732D30322D34322D61632D31322D30392D313400'O }, { len := 10, tag := IPAC_IDTAG_UNITID (8), data := '313233342F302F3300'O } } TC_paging_imsi_80percent-RSL(383)@7c99ff085355: Warning: The first argument (instr) of function regexp(), which is "1234/0/3" & char(0, 0, 0, 0), contains a character with zero character code at index 8. The rest of the string will be ignored during matching. MTC@7c99ff085355: 3/4 RF Resource Indication(s) received TC_paging_imsi_80percent-RSL(383)@7c99ff085355: Mapped TRX#3 to TCP/IP conn_id=5 MTC@7c99ff085355: 4/4 transceiver(s) connected MTC@7c99ff085355: 4/4 RF Resource Indication(s) received MTC@7c99ff085355: Setting RSL_SYSTEM_INFO_3 (3): { header := { l2_plen := { l2_plen := 18, zero_one := '01'B }, skip_indicator := 0, rr_protocol_discriminator := 6, message_type := SYSTEM_INFORMATION_TYPE_3 (27) }, payload := { si3 := { cell_id := 23, lai := { mcc_mnc := '262F42'H, lac := 42 }, ctrl_chan_desc := { msc_r99 := true, att := true, bs_ag_blks_res := 1, ccch_conf := CCHAN_DESC_1CCCH_COMBINED (1), si22ind := false, cbq3 := CBQ3_IU_MODE_NOT_SUPPORTED (0), spare := '00'B, bs_pa_mfrms := 0, t3212 := 1 }, cell_options := { dn_ind := false, pwrc := false, dtx := MS_MAY_USE_UL_DTX (0), radio_link_tout_div4 := 7 }, cell_sel_par := { cell_resel_hyst_2dB := 2, ms_txpwr_max_cch := 7, acs := '0'B, neci := true, rxlev_access_min := 0 }, rach_control := { max_retrans := RACH_MAX_RETRANS_7 (3), tx_integer := '1001'B, cell_barr_access := false, re_not_allowed := true, acc := '0000010000000000'B }, rest_octets := { sel_params := { presence := '0'B, params := omit }, pwr_offset := { presence := '0'B, offset := omit }, si_2ter_ind := '0'B, early_cm_ind := '0'B, sched_where := { presence := '0'B, where := omit }, gprs_ind := { presence := '1'B, ind := { ra_colour := 0, si13_pos := '0'B } }, umts_early_cm_ind := '0'B, si2_quater_ind := { presence := '0'B, ind := omit }, iu_mode_ind := omit, si21_ind := { presence := '0'B, pos := omit } } } } } MTC@7c99ff085355: Setting RSL_SYSTEM_INFO_3 (3): '49061B001762F224002AC90001074740E504002C2B2B2B'O MTC@7c99ff085355: Setting RSL_SYSTEM_INFO_2 (2): { header := { l2_plen := { l2_plen := 22, zero_one := '01'B }, skip_indicator := 0, rr_protocol_discriminator := 6, message_type := SYSTEM_INFORMATION_TYPE_2 (26) }, payload := { si2 := { bcch_freq_list := '00000000000000000000000000000000'O, ncc_permitted := '11111111'B, rach_control := { max_retrans := RACH_MAX_RETRANS_7 (3), tx_integer := '1001'B, cell_barr_access := false, re_not_allowed := true, acc := '0000010000000000'B } } } } MTC@7c99ff085355: Setting RSL_SYSTEM_INFO_2 (2): '59061A00000000000000000000000000000000FFE50400'O MTC@7c99ff085355: Setting RSL_SYSTEM_INFO_4 (4): { header := { l2_plen := { l2_plen := 12, zero_one := '01'B }, skip_indicator := 0, rr_protocol_discriminator := 6, message_type := SYSTEM_INFORMATION_TYPE_4 (28) }, payload := { si4 := { lai := { mcc_mnc := '262F42'H, lac := 42 }, cell_sel_par := { cell_resel_hyst_2dB := 2, ms_txpwr_max_cch := 7, acs := '0'B, neci := true, rxlev_access_min := 0 }, rach_control := { max_retrans := RACH_MAX_RETRANS_7 (3), tx_integer := '1001'B, cell_barr_access := false, re_not_allowed := true, acc := '0000010000000000'B }, cbch_chan_desc := omit, cbch_mobile_alloc := omit, rest_octets := { sel_params := { presence := '0'B, params := omit }, pwr_offset := { presence := '0'B, offset := omit }, gprs_ind := { presence := '1'B, ind := { ra_colour := 0, si13_pos := '0'B } }, s_presence := '0'B, s := omit } } } } MTC@7c99ff085355: Setting RSL_SYSTEM_INFO_4 (4): '31061C62F224002A4740E50400012B2B2B2B2B2B2B2B2B'O MTC@7c99ff085355: Warning: dec_TrxcMessage(): Data remained at the end of the stream after successful decoding: '00'O MTC@7c99ff085355: Warning: dec_TrxcMessage(): Data remained at the end of the stream after successful decoding: '00'O MTC@7c99ff085355: Warning: dec_TrxcMessage(): Data remained at the end of the stream after successful decoding: '00'O MTC@7c99ff085355: pch_blocks_total=271 pch_blocks_per_sec=13.594771 interval=0.073558 MTC@7c99ff085355: Rx LOAD_IND MTC@7c99ff085355: Rx LOAD_IND MTC@7c99ff085355: Rx LOAD_IND MTC@7c99ff085355: Rx LOAD_IND FATAL: command execution failed java.io.IOException at hudson.remoting.Channel.close(Channel.java:1470) at hudson.remoting.Channel.close(Channel.java:1447) at hudson.slaves.SlaveComputer.closeChannel(SlaveComputer.java:902) at hudson.slaves.SlaveComputer.kill(SlaveComputer.java:868) at hudson.model.AbstractCIBase.killComputer(AbstractCIBase.java:95) at jenkins.model.Jenkins.lambda$_cleanUpDisconnectComputers$11(Jenkins.java:3700) at hudson.model.Queue._withLock(Queue.java:1395) at hudson.model.Queue.withLock(Queue.java:1269) at jenkins.model.Jenkins._cleanUpDisconnectComputers(Jenkins.java:3696) at jenkins.model.Jenkins.cleanUp(Jenkins.java:3579) at hudson.WebAppMain.contextDestroyed(WebAppMain.java:377) at org.eclipse.jetty.server.handler.ContextHandler.callContextDestroyed(ContextHandler.java:1074) at org.eclipse.jetty.servlet.ServletContextHandler.callContextDestroyed(ServletContextHandler.java:584) at org.eclipse.jetty.server.handler.ContextHandler.contextDestroyed(ContextHandler.java:1037) at org.eclipse.jetty.servlet.ServletHandler.doStop(ServletHandler.java:319) at org.eclipse.jetty.util.component.AbstractLifeCycle.stop(AbstractLifeCycle.java:94) at org.eclipse.jetty.util.component.ContainerLifeCycle.stop(ContainerLifeCycle.java:180) at org.eclipse.jetty.util.component.ContainerLifeCycle.doStop(ContainerLifeCycle.java:201) at org.eclipse.jetty.server.handler.AbstractHandler.doStop(AbstractHandler.java:108) at org.eclipse.jetty.security.SecurityHandler.doStop(SecurityHandler.java:437) at org.eclipse.jetty.security.ConstraintSecurityHandler.doStop(ConstraintSecurityHandler.java:423) at org.eclipse.jetty.util.component.AbstractLifeCycle.stop(AbstractLifeCycle.java:94) at org.eclipse.jetty.util.component.ContainerLifeCycle.stop(ContainerLifeCycle.java:180) at org.eclipse.jetty.util.component.ContainerLifeCycle.doStop(ContainerLifeCycle.java:201) at org.eclipse.jetty.server.handler.AbstractHandler.doStop(AbstractHandler.java:108) at org.eclipse.jetty.server.session.SessionHandler.doStop(SessionHandler.java:520) at org.eclipse.jetty.util.component.AbstractLifeCycle.stop(AbstractLifeCycle.java:94) at org.eclipse.jetty.util.component.ContainerLifeCycle.stop(ContainerLifeCycle.java:180) at org.eclipse.jetty.util.component.ContainerLifeCycle.doStop(ContainerLifeCycle.java:201) at org.eclipse.jetty.server.handler.AbstractHandler.doStop(AbstractHandler.java:108) at org.eclipse.jetty.server.handler.ContextHandler.stopContext(ContextHandler.java:1060) at org.eclipse.jetty.servlet.ServletContextHandler.stopContext(ServletContextHandler.java:386) at org.eclipse.jetty.webapp.WebAppContext.stopWebapp(WebAppContext.java:1454) at org.eclipse.jetty.webapp.WebAppContext.stopContext(WebAppContext.java:1420) at org.eclipse.jetty.server.handler.ContextHandler.doStop(ContextHandler.java:1114) at org.eclipse.jetty.servlet.ServletContextHandler.doStop(ServletContextHandler.java:297) at org.eclipse.jetty.webapp.WebAppContext.doStop(WebAppContext.java:547) at org.eclipse.jetty.util.component.AbstractLifeCycle.stop(AbstractLifeCycle.java:94) at org.eclipse.jetty.util.component.ContainerLifeCycle.stop(ContainerLifeCycle.java:180) at org.eclipse.jetty.util.component.ContainerLifeCycle.doStop(ContainerLifeCycle.java:201) at org.eclipse.jetty.server.handler.AbstractHandler.doStop(AbstractHandler.java:108) at org.eclipse.jetty.server.Server.doStop(Server.java:470) at org.eclipse.jetty.util.component.AbstractLifeCycle.stop(AbstractLifeCycle.java:94) at winstone.Launcher.shutdown(Launcher.java:318) at winstone.ShutdownHook.run(ShutdownHook.java:25) Caused: hudson.remoting.ChannelClosedException: Channel "hudson.remoting.Channel@7718c090:build2-deb9build-ansible": Remote call on build2-deb9build-ansible failed. The channel is closing down or has closed down at hudson.remoting.Channel.call(Channel.java:993) at hudson.remoting.RemoteInvocationHandler.invoke(RemoteInvocationHandler.java:285) at com.sun.proxy.$Proxy62.isAlive(Unknown Source) at hudson.Launcher$RemoteLauncher$ProcImpl.isAlive(Launcher.java:1215) at hudson.Launcher$RemoteLauncher$ProcImpl.join(Launcher.java:1207) at hudson.tasks.CommandInterpreter.join(CommandInterpreter.java:195) at hudson.tasks.CommandInterpreter.perform(CommandInterpreter.java:145) at hudson.tasks.CommandInterpreter.perform(CommandInterpreter.java:92) at hudson.tasks.BuildStepMonitor$1.perform(BuildStepMonitor.java:20) at hudson.model.AbstractBuild$AbstractBuildExecution.perform(AbstractBuild.java:814) at hudson.model.Build$BuildExecution.build(Build.java:199) at hudson.model.Build$BuildExecution.doRun(Build.java:164) at hudson.model.AbstractBuild$AbstractBuildExecution.run(AbstractBuild.java:522) at hudson.model.Run.execute(Run.java:1896) at hudson.model.FreeStyleBuild.run(FreeStyleBuild.java:44) at hudson.model.ResourceController.execute(ResourceController.java:101) at hudson.model.Executor.run(Executor.java:442) FATAL: Unable to delete script file /tmp/jenkins5024183670254265536.sh java.io.IOException at hudson.remoting.Channel.close(Channel.java:1491) at hudson.remoting.Channel.close(Channel.java:1447) at hudson.slaves.SlaveComputer.closeChannel(SlaveComputer.java:902) at hudson.slaves.SlaveComputer.kill(SlaveComputer.java:868) at hudson.model.AbstractCIBase.killComputer(AbstractCIBase.java:95) at jenkins.model.Jenkins.lambda$_cleanUpDisconnectComputers$11(Jenkins.java:3700) at hudson.model.Queue._withLock(Queue.java:1395) at hudson.model.Queue.withLock(Queue.java:1269) at jenkins.model.Jenkins._cleanUpDisconnectComputers(Jenkins.java:3696) at jenkins.model.Jenkins.cleanUp(Jenkins.java:3579) at hudson.WebAppMain.contextDestroyed(WebAppMain.java:377) at org.eclipse.jetty.server.handler.ContextHandler.callContextDestroyed(ContextHandler.java:1074) at org.eclipse.jetty.servlet.ServletContextHandler.callContextDestroyed(ServletContextHandler.java:584) at org.eclipse.jetty.server.handler.ContextHandler.contextDestroyed(ContextHandler.java:1037) at org.eclipse.jetty.servlet.ServletHandler.doStop(ServletHandler.java:319) at org.eclipse.jetty.util.component.AbstractLifeCycle.stop(AbstractLifeCycle.java:94) at org.eclipse.jetty.util.component.ContainerLifeCycle.stop(ContainerLifeCycle.java:180) at org.eclipse.jetty.util.component.ContainerLifeCycle.doStop(ContainerLifeCycle.java:201) at org.eclipse.jetty.server.handler.AbstractHandler.doStop(AbstractHandler.java:108) at org.eclipse.jetty.security.SecurityHandler.doStop(SecurityHandler.java:437) at org.eclipse.jetty.security.ConstraintSecurityHandler.doStop(ConstraintSecurityHandler.java:423) at org.eclipse.jetty.util.component.AbstractLifeCycle.stop(AbstractLifeCycle.java:94) at org.eclipse.jetty.util.component.ContainerLifeCycle.stop(ContainerLifeCycle.java:180) at org.eclipse.jetty.util.component.ContainerLifeCycle.doStop(ContainerLifeCycle.java:201) at org.eclipse.jetty.server.handler.AbstractHandler.doStop(AbstractHandler.java:108) at org.eclipse.jetty.server.session.SessionHandler.doStop(SessionHandler.java:520) at org.eclipse.jetty.util.component.AbstractLifeCycle.stop(AbstractLifeCycle.java:94) at org.eclipse.jetty.util.component.ContainerLifeCycle.stop(ContainerLifeCycle.java:180) at org.eclipse.jetty.util.component.ContainerLifeCycle.doStop(ContainerLifeCycle.java:201) at org.eclipse.jetty.server.handler.AbstractHandler.doStop(AbstractHandler.java:108) at org.eclipse.jetty.server.handler.ContextHandler.stopContext(ContextHandler.java:1060) at org.eclipse.jetty.servlet.ServletContextHandler.stopContext(ServletContextHandler.java:386) at org.eclipse.jetty.webapp.WebAppContext.stopWebapp(WebAppContext.java:1454) at org.eclipse.jetty.webapp.WebAppContext.stopContext(WebAppContext.java:1420) at org.eclipse.jetty.server.handler.ContextHandler.doStop(ContextHandler.java:1114) at org.eclipse.jetty.servlet.ServletContextHandler.doStop(ServletContextHandler.java:297) at org.eclipse.jetty.webapp.WebAppContext.doStop(WebAppContext.java:547) at org.eclipse.jetty.util.component.AbstractLifeCycle.stop(AbstractLifeCycle.java:94) at org.eclipse.jetty.util.component.ContainerLifeCycle.stop(ContainerLifeCycle.java:180) at org.eclipse.jetty.util.component.ContainerLifeCycle.doStop(ContainerLifeCycle.java:201) at org.eclipse.jetty.server.handler.AbstractHandler.doStop(AbstractHandler.java:108) at org.eclipse.jetty.server.Server.doStop(Server.java:470) at org.eclipse.jetty.util.component.AbstractLifeCycle.stop(AbstractLifeCycle.java:94) at winstone.Launcher.shutdown(Launcher.java:318) at winstone.ShutdownHook.run(ShutdownHook.java:25) Caused: hudson.remoting.ChannelClosedException: Channel "hudson.remoting.Channel@7718c090:build2-deb9build-ansible": Remote call on build2-deb9build-ansible failed. The channel is closing down or has closed down at hudson.remoting.Channel.call(Channel.java:993) at hudson.FilePath.act(FilePath.java:1194) at hudson.FilePath.act(FilePath.java:1183) at hudson.FilePath.delete(FilePath.java:1730) at hudson.tasks.CommandInterpreter.perform(CommandInterpreter.java:163) at hudson.tasks.CommandInterpreter.perform(CommandInterpreter.java:92) at hudson.tasks.BuildStepMonitor$1.perform(BuildStepMonitor.java:20) at hudson.model.AbstractBuild$AbstractBuildExecution.perform(AbstractBuild.java:814) at hudson.model.Build$BuildExecution.build(Build.java:199) at hudson.model.Build$BuildExecution.doRun(Build.java:164) at hudson.model.AbstractBuild$AbstractBuildExecution.run(AbstractBuild.java:522) at hudson.model.Run.execute(Run.java:1896) at hudson.model.FreeStyleBuild.run(FreeStyleBuild.java:44) at hudson.model.ResourceController.execute(ResourceController.java:101) at hudson.model.Executor.run(Executor.java:442) Build step 'Execute shell' marked build as failure ERROR: Step ‘Publish JUnit test result report’ failed: no workspace for TTCN3-centos-bts-test #931
jenkins-notifications@lists.osmocom.org