Changes:
------------------------------------------ [...truncated 2.08 MiB...] model : 191 model name : 13th Gen Intel(R) Core(TM) i5-13500 stepping : 2 microcode : 0x37 cpu MHz : 3500.000 cache size : 24576 KB physical id : 0 siblings : 20 core id : 29 cpu cores : 14 apicid : 58 initial apicid : 58 fpu : yes fpu_exception : yes cpuid level : 32 wp : yes flags : fpu vme de pse tsc msr pae mce cx8 apic sep mtrr pge mca cmov pat pse36 clflush dts acpi mmx fxsr sse sse2 ss ht tm pbe syscall nx pdpe1gb rdtscp lm constant_tsc art arch_perfmon pebs bts rep_good nopl xtopology nonstop_tsc cpuid aperfmperf tsc_known_freq pni pclmulqdq dtes64 monitor ds_cpl vmx smx est tm2 ssse3 sdbg fma cx16 xtpr pdcm sse4_1 sse4_2 x2apic movbe popcnt tsc_deadline_timer aes xsave avx f16c rdrand lahf_lm abm 3dnowprefetch cpuid_fault epb ssbd ibrs ibpb stibp ibrs_enhanced tpr_shadow vnmi flexpriority ept vpid ept_ad fsgsbase tsc_adjust bmi1 avx2 smep bmi2 erms invpcid rdseed adx smap clflushopt clwb intel_pt sha_ni xsaveopt xsavec xgetbv1 xsaves avx_vnni dtherm ida arat pln pts hwp hwp_notify hwp_act_window hwp_epp hwp_pkg_req hfi umip pku ospke waitpkg gfni vaes vpclmulqdq tme rdpid movdiri movdir64b fsrm md_clear serialize pconfig arch_lbr ibt flush_l1d arch_capabilities vmx flags : vnmi preemption_timer posted_intr invvpid ept_x_only ept_ad ept_1gb flexpriority apicv tsc_offset vtpr mtf vapic ept vpid unrestricted_guest vapic_reg vid ple shadow_vmcs ept_mode_based_exec tsc_scaling usr_wait_pause bugs : spectre_v1 spectre_v2 spec_store_bypass swapgs eibrs_pbrsb rfds bhi bogomips : 4992.00 clflush size : 64 cache_alignment : 64 address sizes : 46 bits physical, 48 bits virtual power management:
processor : 18 vendor_id : GenuineIntel cpu family : 6 model : 191 model name : 13th Gen Intel(R) Core(TM) i5-13500 stepping : 2 microcode : 0x37 cpu MHz : 800.000 cache size : 24576 KB physical id : 0 siblings : 20 core id : 30 cpu cores : 14 apicid : 60 initial apicid : 60 fpu : yes fpu_exception : yes cpuid level : 32 wp : yes flags : fpu vme de pse tsc msr pae mce cx8 apic sep mtrr pge mca cmov pat pse36 clflush dts acpi mmx fxsr sse sse2 ss ht tm pbe syscall nx pdpe1gb rdtscp lm constant_tsc art arch_perfmon pebs bts rep_good nopl xtopology nonstop_tsc cpuid aperfmperf tsc_known_freq pni pclmulqdq dtes64 monitor ds_cpl vmx smx est tm2 ssse3 sdbg fma cx16 xtpr pdcm sse4_1 sse4_2 x2apic movbe popcnt tsc_deadline_timer aes xsave avx f16c rdrand lahf_lm abm 3dnowprefetch cpuid_fault epb ssbd ibrs ibpb stibp ibrs_enhanced tpr_shadow vnmi flexpriority ept vpid ept_ad fsgsbase tsc_adjust bmi1 avx2 smep bmi2 erms invpcid rdseed adx smap clflushopt clwb intel_pt sha_ni xsaveopt xsavec xgetbv1 xsaves avx_vnni dtherm ida arat pln pts hwp hwp_notify hwp_act_window hwp_epp hwp_pkg_req hfi umip pku ospke waitpkg gfni vaes vpclmulqdq tme rdpid movdiri movdir64b fsrm md_clear serialize pconfig arch_lbr ibt flush_l1d arch_capabilities vmx flags : vnmi preemption_timer posted_intr invvpid ept_x_only ept_ad ept_1gb flexpriority apicv tsc_offset vtpr mtf vapic ept vpid unrestricted_guest vapic_reg vid ple shadow_vmcs ept_mode_based_exec tsc_scaling usr_wait_pause bugs : spectre_v1 spectre_v2 spec_store_bypass swapgs eibrs_pbrsb rfds bhi bogomips : 4992.00 clflush size : 64 cache_alignment : 64 address sizes : 46 bits physical, 48 bits virtual power management:
processor : 19 vendor_id : GenuineIntel cpu family : 6 model : 191 model name : 13th Gen Intel(R) Core(TM) i5-13500 stepping : 2 microcode : 0x37 cpu MHz : 3505.030 cache size : 24576 KB physical id : 0 siblings : 20 core id : 31 cpu cores : 14 apicid : 62 initial apicid : 62 fpu : yes fpu_exception : yes cpuid level : 32 wp : yes flags : fpu vme de pse tsc msr pae mce cx8 apic sep mtrr pge mca cmov pat pse36 clflush dts acpi mmx fxsr sse sse2 ss ht tm pbe syscall nx pdpe1gb rdtscp lm constant_tsc art arch_perfmon pebs bts rep_good nopl xtopology nonstop_tsc cpuid aperfmperf tsc_known_freq pni pclmulqdq dtes64 monitor ds_cpl vmx smx est tm2 ssse3 sdbg fma cx16 xtpr pdcm sse4_1 sse4_2 x2apic movbe popcnt tsc_deadline_timer aes xsave avx f16c rdrand lahf_lm abm 3dnowprefetch cpuid_fault epb ssbd ibrs ibpb stibp ibrs_enhanced tpr_shadow vnmi flexpriority ept vpid ept_ad fsgsbase tsc_adjust bmi1 avx2 smep bmi2 erms invpcid rdseed adx smap clflushopt clwb intel_pt sha_ni xsaveopt xsavec xgetbv1 xsaves avx_vnni dtherm ida arat pln pts hwp hwp_notify hwp_act_window hwp_epp hwp_pkg_req hfi umip pku ospke waitpkg gfni vaes vpclmulqdq tme rdpid movdiri movdir64b fsrm md_clear serialize pconfig arch_lbr ibt flush_l1d arch_capabilities vmx flags : vnmi preemption_timer posted_intr invvpid ept_x_only ept_ad ept_1gb flexpriority apicv tsc_offset vtpr mtf vapic ept vpid unrestricted_guest vapic_reg vid ple shadow_vmcs ept_mode_based_exec tsc_scaling usr_wait_pause bugs : spectre_v1 spectre_v2 spec_store_bypass swapgs eibrs_pbrsb rfds bhi bogomips : 4992.00 clflush size : 64 cache_alignment : 64 address sizes : 46 bits physical, 48 bits virtual power management:
/bin/bash './testsuite' ENABLE_URING=yes ENABLE_URING_TESTS=yes ## -------------------------------------- ## ## libosmocore 1.10.0.64-ff3d test suite. ## ## -------------------------------------- ##
Regression tests.
1: a5 ok 2: abis ok 3: ctrl ok 4: kasumi ok 5: bits ok 6: bitvec ok 7: bitcomp ok 8: bitfield ok 9: conv ok 10: conv_gsm0503 ok 11: coding ok 12: msgb ok 13: gea ok 14: msgfile ok 15: sms ok 16: smscb ok 17: smscb_gsm0341 ok 18: smscb_cbsp ok 19: ussd ok 20: auth ok 21: auth_xor2g ok 22: comp128 ok 23: lapd ok 24: gsm0502 ok 25: dtx ok 26: gsm0808 ok 27: gsm29205 ok 28: gsm0408 ok 29: gsm48_rest_octets ok 30: gprs ok 31: logging_stream ok 32: logging_wqueue ok 33: logging_gsmtap ok 34: codec ok 35: codec_ecu_fr ok 36: codec_efr_sid ok 37: codec_fr_sid ok 38: codec_hr_sid ok 39: fr ok 40: loggingrb ok 41: strrb ok 42: vty ok 43: gprs-bssgp ok 44: gprs-bssgp-rim ok 45: gprs-ns ok 46: gprs-ns2 ok 47: utils ok 48: stats ok 49: write_queue ok 50: bssgp-fc ok 51: sim ok 52: timer ok 53: clk_override ok 54: tlv ok 55: gsup ok 56: fsm ok 57: fsm_dealloc ok 58: oap ok 59: oap_client ok 60: socket ok 61: socket_sctp ok 62: osmo-auc-gen ok 63: endian ok 64: sercomm ok 65: prbs ok 66: gsm23003 ok 67: gsm23236 ok 68: tdef ok 69: sockaddr_str ok 70: use_count ok 71: context ok 72: exec ok 73: i460_mux ok 74: bitgen ok 75: gad ok 76: bsslap ok 77: bssmap_le ok 78: it_q ok 79: base64 ok 80: time_cc ok 81: iuup ok 82: v110_frame_test ok 83: v110_ra1_test ok 84: v110_ta_test ok 85: gsm44021_frame_csd_test ok 86: osmo_io ok 87: osmo_io (uring) FAILED (testsuite.at:554) 88: soft_uart ok 89: rlp ok 90: jhash ok
## ------------- ## ## Test results. ## ## ------------- ##
ERROR: All 90 tests were run, 1 failed unexpectedly. ## -------------------------- ## ## testsuite.log was created. ## ## -------------------------- ##
Please send `tests/testsuite.log' and all information you think might help:
To: openbsc@lists.osmocom.org Subject: [libosmocore 1.10.0.64-ff3d] testsuite: 87 failed
You may investigate any problem if you feel able to do so, in which case the test suite provides a good starting point. Its output may be found below `tests/testsuite.dir'.
make[4]: *** [Makefile:3594: check-local] Error 1 make[4]: Leaving directory '/build/tests' make[3]: *** [Makefile:2922: check-am] Error 2 make[3]: Leaving directory '/build/tests' make[2]: Leaving directory '/build/tests' make[2]: *** [Makefile:2924: check] Error 2 make[1]: Leaving directory '/build' make[1]: *** [Makefile:747: check-recursive] Error 1 make: *** [Makefile:1046: check] Error 2 + cat-testlogs.sh
======================== ./tests/testsuite.dir/87/testsuite.log
# -*- compilation -*- 87. testsuite.at:549: testing osmo_io (uring) ... ./testsuite.at:554: LIBOSMO_IO_BACKEND=IO_URING $abs_top_builddir/tests/osmo_io/osmo_io_test /build/tests/testsuite.dir/at-groups/87/test-source: line 29: 71312 Aborted ( $at_check_trace; LIBOSMO_IO_BACKEND=IO_URING $abs_top_builddir/tests/osmo_io/osmo_io_test ) >> "$at_stdout" 2>> "$at_stderr" 5>&- --- experr 2025-01-28 23:55:48.564229424 +0000 +++ /build/tests/testsuite.dir/at-groups/87/stderr 2025-01-28 23:55:48.808228080 +0000 @@ -0,0 +1 @@ +Assert failed file_bytes_read == sizeof(TESTDATA) osmo_io/osmo_io_test.c:131 --- expout 2025-01-28 23:55:48.564229424 +0000 +++ /build/tests/testsuite.dir/at-groups/87/stdout 2025-01-28 23:55:48.808228080 +0000 @@ -3,16 +3,3 @@ file-iofd: write() returned rc=16 01 02 03 04 05 06 07 08 09 0a 0b 0c 0d 0e 0f 10 Enable read -file-iofd: read() msg with rc=16 -01 02 03 04 05 06 07 08 09 0a 0b 0c 0d 0e 0f 10 -file-iofd: read() msg with rc=0 - -Running test_connected -ep1: write() returned rc=0 -ep1: write() returned rc=16 -ep2: read() msg with len=16 -01 02 03 04 05 06 07 08 09 0a 0b 0c 0d 0e 0f 10 -Running test_unconnected -ep1: sendto() returned rc=16 -ep2: recvfrom() msg with len=16 -01 02 03 04 05 06 07 08 09 0a 0b 0c 0d 0e 0f 10 ./testsuite.at:554: exit code was 134, expected 0 87. testsuite.at:549: 87. osmo_io (uring) (testsuite.at:549): FAILED (testsuite.at:554) Build step 'Execute shell' marked build as failure $ ssh-agent -k unset SSH_AUTH_SOCK; unset SSH_AGENT_PID; echo Agent pid 724098 killed; [ssh-agent] Stopped. Archiving artifacts
jenkins-notifications@lists.osmocom.org