See https://jenkins.osmocom.org/jenkins/job/ttcn3-hnbgw-test-latest/173/display/redirect
Changes:
------------------------------------------ [...truncated 29.70 KB...] Setting up libtalloc2:amd64 (2.3.1-2+b1) ... Setting up libmnl0:amd64 (1.0.4-3) ... Setting up libsctp1:amd64 (1.0.18+dfsg-1) ... Setting up libosmocore19:amd64 (1.7.0) ... Setting up libasn1c1:amd64 (0.9.34) ... Setting up libosmo-hnbap0:amd64 (1.3.0) ... Setting up libosmo-rua0:amd64 (1.3.0) ... Setting up libosmovty9:amd64 (1.7.0) ... Setting up libosmo-mgcp-client9:amd64 (1.10.0) ... Setting up libosmogsm18:amd64 (1.7.0) ... Setting up libosmoctrl0:amd64 (1.7.0) ... Setting up libosmonetif8:amd64 (1.2.0) ... Setting up libosmo-sigtran7:amd64 (1.6.0) ... Setting up libosmo-ranap5:amd64 (1.3.0) ... Setting up osmo-hnbgw (1.3.0) ... Processing triggers for libc-bin (2.31-13+deb11u5) ... Removing intermediate container 6c4b3d9fb5af ---> 1ed6b7e0be1f Step 6/10 : WORKDIR /tmp ---> Running in 91570f290255 Removing intermediate container 91570f290255 ---> 4933e8838688 Step 7/10 : VOLUME /data ---> Running in 95ebb570bcaf Removing intermediate container 95ebb570bcaf ---> faf247005b6b Step 8/10 : COPY osmo-hnbgw.cfg /data/osmo-hnbgw.cfg ---> 43166a7c651c Step 9/10 : WORKDIR /data ---> Running in 0e0d9d48a46b Removing intermediate container 0e0d9d48a46b ---> 67a4a25d75e7 Step 10/10 : CMD ["/bin/sh", "-c", "/usr/bin/osmo-hnbgw -c /data/osmo-hnbgw.cfg >/data/osmo-hnbgw.log 2>&1"] ---> Running in f75c40cf4dcf Removing intermediate container f75c40cf4dcf ---> 5dd6e7a07395 [Warning] One or more build-args [OSMO_SIP_BRANCH LIBOSMOCORE_BRANCH OSMO_BSC_BRANCH OSMO_HLR_BRANCH OSMO_IUH_BRANCH OSMO_PCU_BRANCH OSMO_SGSN_BRANCH UPSTREAM_DISTRO OSMOCOM_REPO_MIRROR OSMO_MSC_BRANCH OSMO_TTCN3_BRANCH OSMO_UECUPS_BRANCH REGISTRY OSMO_GGSN_BRANCH OSMO_NITB_BRANCH OSMOCOM_REPO_TESTSUITE_MIRROR OSMO_CBC_BRANCH OSMO_GBPROXY_BRANCH OSMO_BTS_BRANCH OSMO_GSM_TESTER_BRANCH OSMO_HNBGW_BRANCH OSMO_HNODEB_BRANCH OSMO_STP_BRANCH UID OPEN5GS_BRANCH OSMOCOM_REPO_PATH OSMO_MGW_BRANCH OSMO_BB_BRANCH] were not consumed Successfully built 5dd6e7a07395 Successfully tagged osmocom-build/osmo-hnbgw-latest:latest rm -rf .common make: Leaving directory 'https://jenkins.osmocom.org/jenkins/job/ttcn3-hnbgw-test-latest/ws/osmo-hnbgw-latest' + docker_image_exists osmo-hnbgw-latest + docker images -q osmocom-build/osmo-hnbgw-latest + test -n 5dd6e7a07395 + list_osmo_packages debian-bullseye osmo-hnbgw-latest + local distro=debian-bullseye + local image=osmo-hnbgw-latest + local docker_run_sh=docker run --rm --entrypoint=/bin/sh osmocom-build/osmo-hnbgw-latest -c + [ -n ] + set +x
### Installed Osmocom packages in: osmo-hnbgw-latest ###
ii libosmo-hnbap0:amd64 1.3.0 amd64 Osmocom code for the Iuh interface (HNBAP, RUA, RANAP) ii libosmo-mgcp-client9:amd64 1.10.0 amd64 libosmo-mgcp-client: Osmocom's Media Gateway Control Protocol client utilities ii libosmo-ranap5:amd64 1.3.0 amd64 Osmocom code for the Iuh interface (HNBAP, RUA, RANAP) ii libosmo-rua0:amd64 1.3.0 amd64 Osmocom code for the Iuh interface (HNBAP, RUA, RANAP) ii libosmo-sigtran7:amd64 1.6.0 amd64 Osmocom SIGTRAN library (SCCP, SUA, M3UA and more) ii libosmocore19:amd64 1.7.0 amd64 Osmo Core library ii libosmoctrl0:amd64 1.7.0 amd64 Osmo control library ii libosmogsm18:amd64 1.7.0 amd64 Osmo GSM utility library ii libosmonetif8:amd64 1.2.0 amd64 Common/shared code regarding network interface for OpenBSC ii libosmovty9:amd64 1.7.0 amd64 Osmo VTY library ii osmo-hnbgw 1.3.0 amd64 OsmoHNBGW: Osmocom Home Node B Gateway ii osmocom-latest 1.0.0 amd64 Dummy package, which conflicts with: osmocom-nightly osmocom-next
+ [ registry.osmocom.org = registry.osmocom.org ] + docker_depends ttcn3-hnbgw-test + local feed + echo debian-bullseye-titan + depends=debian-bullseye-titan + [ -n debian-bullseye-titan ] + docker_images_require debian-bullseye-titan + local i + local from_line + local pull_arg + local upstream_distro_arg + local distro_arg + local depends + local dir + [ registry.osmocom.org = registry.osmocom.org ] + docker pull registry.osmocom.org/osmocom-build/debian-bullseye-titan Using default tag: latest latest: Pulling from osmocom-build/debian-bullseye-titan Digest: sha256:0091228815b09f201aadb6a9350c1cd41a29def2607aee2da50fe359d6fb2ebb Status: Image is up to date for registry.osmocom.org/osmocom-build/debian-bullseye-titan:latest registry.osmocom.org/osmocom-build/debian-bullseye-titan:latest + continue + docker_distro_from_image_name ttcn3-hnbgw-test + echo debian-bullseye + distro_arg=debian-bullseye + [ -z ] + docker_upstream_distro_from_image_name ttcn3-hnbgw-test + echo debian:bullseye + upstream_distro_arg=debian:bullseye + docker_dir_from_image_name ttcn3-hnbgw-test + echo ttcn3-hnbgw-test + dir=ttcn3-hnbgw-test + pull_arg=--pull + grep ^FROM ../ttcn3-hnbgw-test/Dockerfile + from_line=FROM $REGISTRY/$USER/debian-bullseye-titan + echo FROM $REGISTRY/$USER/debian-bullseye-titan + grep -q $USER + pull_arg= + echo Building image: ttcn3-hnbgw-test (export NO_DOCKER_IMAGE_BUILD=1 to prevent this) Building image: ttcn3-hnbgw-test (export NO_DOCKER_IMAGE_BUILD=1 to prevent this) + make -C ../ttcn3-hnbgw-test BUILD_ARGS= UPSTREAM_DISTRO=debian:bullseye DISTRO=debian-bullseye IMAGE=osmocom-build/ttcn3-hnbgw-test make: Entering directory 'https://jenkins.osmocom.org/jenkins/job/ttcn3-hnbgw-test-latest/ws/ttcn3-hnbgw-test' awk: fatal: cannot open file `.release' for reading: No such file or directory awk: fatal: cannot open file `.release' for reading: No such file or directory awk: fatal: cannot open file `.release' for reading: No such file or directory rm -rf .common cp -r https://jenkins.osmocom.org/jenkins/job/ttcn3-hnbgw-test-latest/ws/common .common INFO: .release created release=0.0.0 docker build \ --build-arg USER=osmocom-build \ --build-arg UID=1000 \ --build-arg REGISTRY=registry.osmocom.org \ --build-arg OSMO_TTCN3_BRANCH=master \ --build-arg UPSTREAM_DISTRO=debian:bullseye \ --build-arg DISTRO=debian-bullseye \ --build-arg OSMOCOM_REPO_MIRROR=https://downloads.osmocom.org \ --build-arg OSMOCOM_REPO_PATH=packages/osmocom: \ --build-arg OSMOCOM_REPO_VERSION=latest \ --build-arg OSMOCOM_REPO_TESTSUITE_MIRROR=https://downloads.osmocom.org \ --build-arg LIBOSMOCORE_BRANCH=master \ --build-arg OSMO_BB_BRANCH=master \ --build-arg OSMO_BSC_BRANCH=master \ --build-arg OSMO_BTS_BRANCH=master \ --build-arg OSMO_CBC_BRANCH=master \ --build-arg OSMO_GBPROXY_BRANCH=master \ --build-arg OSMO_GGSN_BRANCH=master \ --build-arg OSMO_GSM_TESTER_BRANCH=master \ --build-arg OSMO_HLR_BRANCH=master \ --build-arg OSMO_HNBGW_BRANCH=master \ --build-arg OSMO_HNODEB_BRANCH=master \ --build-arg OSMO_IUH_BRANCH=master \ --build-arg OSMO_MGW_BRANCH=master \ --build-arg OSMO_MSC_BRANCH=master \ --build-arg OSMO_NITB_BRANCH=master \ --build-arg OSMO_PCU_BRANCH=master \ --build-arg OSMO_SGSN_BRANCH=master \ --build-arg OSMO_SIP_BRANCH=master \ --build-arg OSMO_STP_BRANCH=master \ --build-arg OSMO_UECUPS_BRANCH=master \ --build-arg OPEN5GS_BRANCH=main \ -t osmocom-build/ttcn3-hnbgw-test:latest . Sending build context to Docker daemon 37.38kB Step 1/9 : ARG REGISTRY Step 2/9 : ARG USER Step 3/9 : FROM $REGISTRY/$USER/debian-bullseye-titan ---> 8ac06c46017d Step 4/9 : ARG OSMO_TTCN3_BRANCH="master" ---> Using cache ---> 46d55f726000 Step 5/9 : ADD https://gerrit.osmocom.org/plugins/gitiles/osmo-ttcn3-hacks/+/$OSMO_TTCN3_BR... /tmp/commit
---> Using cache ---> 84bb211c1b66 Step 6/9 : RUN ttcn3-docker-prepare "$OSMO_TTCN3_BRANCH" hnbgw ---> Running in 4d5bdabd74fb [91m+ OSMO_TTCN3_BRANCH=master + shift + cd /osmo-ttcn3-hacks [0m[91m+ git fetch [0m[91m+ git checkout master [0m[91mAlready on 'master' [0mYour branch is up to date with 'origin/master'. [91m+ git symbolic-ref -q HEAD [0mrefs/heads/master [91m+ git reset --hard origin/master [0mHEAD is now at 388decda Revert "WIP: ns: Add test for SNS Size NSEI IE" [91m+ git rev-parse --abbrev-ref HEAD [0mmaster [91m+ git rev-parse HEAD [0m388decda30a7c15347463e15c3100ce584367098 [91m+ diff -q /tmp/deps-Makefile deps/Makefile [0mFiles /tmp/deps-Makefile and deps/Makefile differ [91m+ make -j8 deps [0mmake -j16 -C deps [91mmake[1]: warning: -j16 forced in submake: resetting jobserver mode. [0mmake[1]: Entering directory '/osmo-ttcn3-hacks/deps' cd titan.ProtocolEmulations.M3UA && git fetch && if git rev-parse "origin/f086e78d74defa044d864f17adaad9433fedc961" 2>/dev/null; then set -x && git checkout -q -f "origin/f086e78d74defa044d864f17adaad9433fedc961"; else set -x && git checkout -q -f "f086e78d74defa044d864f17adaad9433fedc961"; fi cd titan.ProtocolModules.DIAMETER_ProtocolModule_Generator && git fetch && if git rev-parse "origin/ffd939595a08da1b8c8176aaa1f8578bfe02a912" 2>/dev/null; then set -x && git checkout -q -f "origin/ffd939595a08da1b8c8176aaa1f8578bfe02a912"; else set -x && git checkout -q -f "ffd939595a08da1b8c8176aaa1f8578bfe02a912"; fi cd titan.ProtocolModules.GTP_v13.5.0 && git fetch && if git rev-parse "origin/54219599037626c675610d3a44433d01af264fbb" 2>/dev/null; then set -x && git checkout -q -f "origin/54219599037626c675610d3a44433d01af264fbb"; else set -x && git checkout -q -f "54219599037626c675610d3a44433d01af264fbb"; fi cd titan.ProtocolModules.ICMP && git fetch && if git rev-parse "origin/e49d9fb9f7de637b4bf4803dc6b6e911a8661640" 2>/dev/null; then set -x && git checkout -q -f "origin/e49d9fb9f7de637b4bf4803dc6b6e911a8661640"; else set -x && git checkout -q -f "e49d9fb9f7de637b4bf4803dc6b6e911a8661640"; fi cd titan.ProtocolModules.ICMPv6 && git fetch && if git rev-parse "origin/46f4d9b6e1e3c794294a92588401a81e4881dd27" 2>/dev/null; then set -x && git checkout -q -f "origin/46f4d9b6e1e3c794294a92588401a81e4881dd27"; else set -x && git checkout -q -f "46f4d9b6e1e3c794294a92588401a81e4881dd27"; fi cd titan.ProtocolModules.IP && git fetch && if git rev-parse "origin/1be86705f39ae38f3c04b2109806ee20d25e91d0" 2>/dev/null; then set -x && git checkout -q -f "origin/1be86705f39ae38f3c04b2109806ee20d25e91d0"; else set -x && git checkout -q -f "1be86705f39ae38f3c04b2109806ee20d25e91d0"; fi cd titan.ProtocolModules.L2TP && git fetch && if git rev-parse "origin/17e76d3662bd0bb815158e8a9de1ec413f21b530" 2>/dev/null; then set -x && git checkout -q -f "origin/17e76d3662bd0bb815158e8a9de1ec413f21b530"; else set -x && git checkout -q -f "17e76d3662bd0bb815158e8a9de1ec413f21b530"; fi cd titan.ProtocolModules.LLC_v7.1.0 && git fetch && if git rev-parse "origin/09817f113255d7fb56f1d45d3dd629a093d9248d" 2>/dev/null; then set -x && git checkout -q -f "origin/09817f113255d7fb56f1d45d3dd629a093d9248d"; else set -x && git checkout -q -f "09817f113255d7fb56f1d45d3dd629a093d9248d"; fi cd titan.ProtocolModules.M3UA && git fetch && if git rev-parse "origin/c496d298876fed55c2b730278b7ee77982555563" 2>/dev/null; then set -x && git checkout -q -f "origin/c496d298876fed55c2b730278b7ee77982555563"; else set -x && git checkout -q -f "c496d298876fed55c2b730278b7ee77982555563"; fi cd titan.ProtocolModules.MobileL3_v13.4.0 && git fetch && if git rev-parse "origin/badbad680df216b3211260d56b14734eeb2c9028" 2>/dev/null; then set -x && git checkout -q -f "origin/badbad680df216b3211260d56b14734eeb2c9028"; else set -x && git checkout -q -f "badbad680df216b3211260d56b14734eeb2c9028"; fi cd titan.ProtocolModules.PFCP_v15.1.0 && git fetch && if git rev-parse "origin/d550ad9ddb6f9c823c9a555254cd76cf0e738d18" 2>/dev/null; then set -x && git checkout -q -f "origin/d550ad9ddb6f9c823c9a555254cd76cf0e738d18"; else set -x && git checkout -q -f "d550ad9ddb6f9c823c9a555254cd76cf0e738d18"; fi cd titan.TestPorts.TELNETasp && git fetch && if git rev-parse "origin/873fe539642542cd9a901c208f1ec11c6d2f5387" 2>/dev/null; then set -x && git checkout -q -f "origin/873fe539642542cd9a901c208f1ec11c6d2f5387"; else set -x && git checkout -q -f "873fe539642542cd9a901c208f1ec11c6d2f5387"; fi cd titan.TestPorts.UDPasp && git fetch && if git rev-parse "origin/54176e95850654e5e8b0ffa2f1b5f35c412b949c" 2>/dev/null; then set -x && git checkout -q -f "origin/54176e95850654e5e8b0ffa2f1b5f35c412b949c"; else set -x && git checkout -q -f "54176e95850654e5e8b0ffa2f1b5f35c412b949c"; fi cd titan.ProtocolEmulations.SCCP && git fetch && if git rev-parse "origin/R.7.A-11-gd4b7a6d" 2>/dev/null; then set -x && git checkout -q -f "origin/R.7.A-11-gd4b7a6d"; else set -x && git checkout -q -f "R.7.A-11-gd4b7a6d"; fi cd titan.ProtocolModules.BSSGP_v13.0.0 && git fetch && if git rev-parse "origin/e97d92a8b66bec399babea52f593771b76cb175a" 2>/dev/null; then set -x && git checkout -q -f "origin/e97d92a8b66bec399babea52f593771b76cb175a"; else set -x && git checkout -q -f "e97d92a8b66bec399babea52f593771b76cb175a"; fi cd titan.ProtocolModules.BSSMAP && git fetch && if git rev-parse "origin/24f967b2f77bfdd2e6eabf1e82fa76239095f772" 2>/dev/null; then set -x && git checkout -q -f "origin/24f967b2f77bfdd2e6eabf1e82fa76239095f772"; else set -x && git checkout -q -f "24f967b2f77bfdd2e6eabf1e82fa76239095f772"; fi [91mfatal: unable to access 'https://gitlab.eclipse.org/eclipse/titan/titan.ProtocolModules.PFCP_v15.1.0/': The requested URL returned error: 502 [0m[91mmake[1]: *** [Makefile:184: titan.ProtocolModules.PFCP_v15.1.0/update] Error 128 make[1]: *** Waiting for unfinished jobs.... [0morigin/24f967b2f77bfdd2e6eabf1e82fa76239095f772 [91m+ git checkout -q -f 24f967b2f77bfdd2e6eabf1e82fa76239095f772 [0m[91mfatal: unable to access 'https://gitlab.eclipse.org/eclipse/titan/titan.ProtocolModules.GTP_v13.5.0/': The requested URL returned error: 502 [0m[91mmake[1]: *** [Makefile:184: titan.ProtocolModules.GTP_v13.5.0/update] Error 128 [0m[91mfatal: unable to access 'https://gitlab.eclipse.org/eclipse/titan/titan.ProtocolModules.IP/': The requested URL returned error: 502 [0m[91mfatal: unable to access 'https://gitlab.eclipse.org/eclipse/titan/titan.TestPorts.TELNETasp/': The requested URL returned error: 502 [0m[91mfatal: unable to access 'https://gitlab.eclipse.org/eclipse/titan/titan.ProtocolModules.L2TP/': The requested URL returned error: 502 [0m[91mmake[1]: *** [Makefile:184: titan.ProtocolModules.IP/update] Error 128 [0m[91mmake[1]: *** [Makefile:184: titan.TestPorts.TELNETasp/update] Error 128 make[1]: *** [Makefile:184: titan.ProtocolModules.L2TP/update] Error 128 [0m[91mfatal: unable to access 'https://gitlab.eclipse.org/eclipse/titan/titan.ProtocolModules.M3UA/': The requested URL returned error: 502 [0m[91mmake[1]: *** [Makefile:184: titan.ProtocolModules.M3UA/update] Error 128 [0m[91mfatal: unable to access 'https://gitlab.eclipse.org/eclipse/titan/titan.ProtocolEmulations.M3UA/': The requested URL returned error: 502 [0m[91mmake[1]: *** [Makefile:184: titan.ProtocolEmulations.M3UA/update] Error 128 [0m[91mremote: GitLab is not responding fatal: unable to access 'https://gitlab.eclipse.org/eclipse/titan/titan.ProtocolModules.LLC_v7.1.0/': The requested URL returned error: 502 [0m[91mmake[1]: *** [Makefile:184: titan.ProtocolModules.LLC_v7.1.0/update] Error 128 [0m[91mremote: GitLab is not responding fatal: unable to access 'https://gitlab.eclipse.org/eclipse/titan/titan.ProtocolModules.ICMP/': The requested URL returned error: 502 [0m[91mmake[1]: *** [Makefile:184: titan.ProtocolModules.ICMP/update] Error 128 [0md4b7a6dbfe50483116052e46c6cd8168ff5692de [91m+ git checkout -q -f origin/R.7.A-11-gd4b7a6d [0m[91mwarning: redirecting to https://gitlab.eclipse.org/eclipse/titan/titan.ProtocolModules.DIAMETER_Prot... [0morigin/e97d92a8b66bec399babea52f593771b76cb175a [91m+ git checkout -q -f e97d92a8b66bec399babea52f593771b76cb175a [0m[91mwarning: redirecting to https://gitlab.eclipse.org/eclipse/titan/titan.ProtocolModules.MobileL3_v13.... [0m[91merror: RPC failed; HTTP 502 curl 22 The requested URL returned error: 502 fatal: expected flush after ref listing [0m[91mmake[1]: *** [Makefile:184: titan.ProtocolModules.DIAMETER_ProtocolModule_Generator/update] Error 128 [0m[91mwarning: redirecting to https://gitlab.eclipse.org/eclipse/titan/titan.ProtocolModules.ICMPv6.git/ [0m[91merror: RPC failed; HTTP 502 curl 22 The requested URL returned error: 502 fatal: expected flush after ref listing [0m[91mmake[1]: *** [Makefile:184: titan.ProtocolModules.ICMPv6/update] Error 128 [0m[91mwarning: redirecting to https://gitlab.eclipse.org/eclipse/titan/titan.TestPorts.UDPasp.git/ [0morigin/badbad680df216b3211260d56b14734eeb2c9028 [91m+ git checkout -q -f badbad680df216b3211260d56b14734eeb2c9028 [0morigin/54176e95850654e5e8b0ffa2f1b5f35c412b949c [91m+ git checkout -q -f 54176e95850654e5e8b0ffa2f1b5f35c412b949c [0mmake[1]: Leaving directory '/osmo-ttcn3-hacks/deps' [91mmake: *** [Makefile:70: deps] Error 2 [0mThe command '/bin/sh -c ttcn3-docker-prepare "$OSMO_TTCN3_BRANCH" hnbgw' returned a non-zero code: 2 make: *** [../make/Makefile:90: docker-build] Error 2 make: Leaving directory 'https://jenkins.osmocom.org/jenkins/job/ttcn3-hnbgw-test-latest/ws/ttcn3-hnbgw-test' + exit 1 Build step 'Execute shell' marked build as failure Recording test results ERROR: Step ‘Publish JUnit test result report’ failed: No test report files were found. Configuration error?
jenkins-notifications@lists.osmocom.org