See https://jenkins.osmocom.org/jenkins/job/Osmocom-build-tags-against-master/1707/display/redirect
Changes:
------------------------------------------ Started by timer Running as SYSTEM Building remotely on build4-deb12build-ansible (ttcn3 obs qemu osmocom-gerrit coverity osmocom-master) in workspace https://jenkins.osmocom.org/jenkins/job/Osmocom-build-tags-against-master/ws/ The recommended git tool is: NONE No credentials specified Wiping out workspace first. Cloning the remote Git repository Cloning repository https://gerrit.osmocom.org/osmo-ci
git init https://jenkins.osmocom.org/jenkins/job/Osmocom-build-tags-against-master/ws/ # timeout=10
Fetching upstream changes from https://gerrit.osmocom.org/osmo-ci
git --version # timeout=10 git --version # 'git version 2.39.2' git fetch --tags --force --progress -- https://gerrit.osmocom.org/osmo-ci +refs/heads/*:refs/remotes/origin/* # timeout=10 git config remote.origin.url https://gerrit.osmocom.org/osmo-ci # timeout=10 git config --add remote.origin.fetch +refs/heads/*:refs/remotes/origin/* # timeout=10
Avoid second fetch Seen branch in repository origin/fixeria/fixes Seen branch in repository origin/laforge/dahdi-wip Seen branch in repository origin/lynxis/staging Seen branch in repository origin/master Seen branch in repository origin/neels/obs Seen branch in repository origin/neels/test Seen branch in repository origin/neels/wip Seen branch in repository origin/osmith/centos-install-test Seen branch in repository origin/osmith/dependency-check Seen branch in repository origin/osmith/fix-python3 Seen branch in repository origin/osmith/gerrit-lint Seen branch in repository origin/osmith/gerrit-mail-on-success Seen branch in repository origin/osmith/ggsn-kernel-mod-test Seen branch in repository origin/osmith/obs-2021q1 Seen branch in repository origin/osmith/obs-check-builders Seen branch in repository origin/osmith/obs-fixes Seen branch in repository origin/osmith/obs-latest-fix Seen branch in repository origin/osmith/obs-mirror Seen branch in repository origin/osmith/obs-nftables Seen branch in repository origin/osmith/rpm Seen branch in repository origin/osmith/ttcn3-centos Seen branch in repository origin/osmith/ttcn3-latest Seen branch in repository origin/osmith/wip Seen branch in repository origin/osmith/wip-asan Seen branch in repository origin/osmith/wip-ci-packaging Seen branch in repository origin/osmith/wip-docuum Seen branch in repository origin/osmith/wip-manuals Seen branch in repository origin/osmith/wip-obs Seen branch in repository origin/osmith/wip-obs-asan Seen branch in repository origin/osmith/wip-os-6165 Seen branch in repository origin/osmith/wip-repo-install-qemu Seen branch in repository origin/pespin/limesuite-latest Seen branch in repository origin/pespin/open5gs Seen 33 remote branches
git show-ref --tags -d # timeout=10
Checking out Revision 81b714b636dcd1bfdd8162f39e7ad7053b409c21 (origin/master)
git config core.sparsecheckout # timeout=10 git checkout -f 81b714b636dcd1bfdd8162f39e7ad7053b409c21 # timeout=10
Commit message: "ansible: hosts: remove gtp0-deb(10,11)build"
git rev-list --no-walk 81b714b636dcd1bfdd8162f39e7ad7053b409c21 # timeout=10
[Osmocom-build-tags-against-master] $ /bin/sh -xe /tmp/jenkins1421058865045468310.sh + docker run --rm=true -e PARALLEL_MAKE=-j8 -u build -v https://jenkins.osmocom.org/jenkins/job/Osmocom-build-tags-against-master/ws/:/build -w /build osmocom-build/debian-bookworm-build scripts/osmocom-build-old-tags-against-master.sh Temp dir: /build/_temp Building libraries from current master... * libosmocore 714843a455a00da74377f4636b73aa8b5a308a27 --- BUILD FAILED: libosmocore-714843a455a00da74377f4636b73aa8b5a308a27.txt Showing last lines of build log below (full log in temp dir/jenkins artifacts): --- ## -------------------------- ##
Please send `tests/testsuite.log' and all information you think might help:
To: openbsc@lists.osmocom.org Subject: [libosmocore 1.9.0.15-7148] testsuite: 56 57 failed
You may investigate any problem if you feel able to do so, in which case the test suite provides a good starting point. Its output may be found below `tests/testsuite.dir'.
make[4]: *** [Makefile:3335: check-local] Error 1 make[4]: Leaving directory '/build/_deps/libosmocore/tests' make[3]: *** [Makefile:2703: check-am] Error 2 make[3]: Leaving directory '/build/_deps/libosmocore/tests' make[2]: *** [Makefile:2705: check] Error 2 make[2]: Leaving directory '/build/_deps/libosmocore/tests' make[1]: *** [Makefile:746: check-recursive] Error 1 make[1]: Leaving directory '/build/_deps/libosmocore' make: *** [Makefile:1045: check] Error 2 --- Build step 'Execute shell' marked build as failure Archiving artifacts
jenkins-notifications@lists.osmocom.org