See
<https://jenkins.osmocom.org/jenkins/job/master-osmo-sgsn/IU=--disable-iu,WITH_MANUALS=1,a3=default,a4=default,label=osmocom-master-debian9/22651/display/redirect>
Changes:
------------------------------------------
[...truncated 412.57 KB...]
logging print file 1
logging level gprs debug
logging level ns info
logging level obj notice
logging level lglobal notice
logging level llapd notice
logging level linp notice
logging level lmux notice
logging level lmi notice
logging level lmib notice
logging level lsms notice
logging level lctrl notice
logging level lgtp notice
logging level lstats notice
logging level lgsup notice
logging level loap notice
logging level lss7 notice
logging level lsccp notice
logging level lsua notice
logging level lm3ua notice
logging level lmgcp notice
logging level ljibuf notice
logging level lrspro notice
logging level lns notice
logging level lbssgp notice
!
stats interval 5
!
line vty
no login
!
ns
encapsulation framerelay-gre enabled 0
encapsulation udp local-ip 127.0.0.100
encapsulation udp local-port 23000
encapsulation udp use-reset-block-unblock enabled
nse 101 nsvci 101
nse 101 remote-role sgsn
nse 101 encapsulation udp
nse 101 remote-ip 192.168.100.239
nse 101 remote-port 7777
timer tns-block 3
timer tns-block-retries 3
timer tns-reset 3
timer tns-reset-retries 3
timer tns-test 30
timer tns-alive 3
timer tns-alive-retries 10
timer tsns-prov 3
timer unknown 0x8 3
timer unknown 0x9 3
gbproxy
sgsn nsei 101
ss -tn
State Recv-Q Send-Q Local
Address:Port Peer Address:Port
ss -tln
State Recv-Q Send-Q Local
Address:Port Peer Address:Port
LISTEN 0 10 127.0.0.1:4245 *:*
LISTEN 0 10 127.0.0.1:4251 *:*
ps xua | grep osmo
build 11999 1.8 0.0
53904 21092 ? S 12:14 0:00 /usr/bin/python3 /usr/local/bin/osmotestconfig.py
-p /build -w /build -v
build 12033 0.0 0.0 21475111140 17940 ? S 12:14 0:00 src/sgsn/osmo-sgsn -c
/build/doc/examples/osmo-sgsn/osmo-sgsn.cfg
build 12040 0.0 0.0 4280 772 ? S 12:14 0:00 /bin/sh -c ps xua | grep
osmo
build 12042 0.0 0.0 4280 88 ? R 12:14 0:00 /bin/sh -c ps xua | grep
osmo
Socket: in 1 tries, connected to 127.0.0.1:4245 <socket.socket fd=4,
family=AddressFamily.AF_INET, type=SocketKind.SOCK_STREAM, proto=0,
laddr=('127.0.0.1', 54198), raddr=('127.0.0.1', 4245)> (1 sockets
open)
Terminating took 0.897s
Socket: closing 127.0.0.1:4245 <socket.socket fd=4, family=AddressFamily.AF_INET,
type=SocketKind.SOCK_STREAM, proto=0, laddr=('127.0.0.1', 54198),
raddr=('127.0.0.1', 4245)> (0 sockets open)
Verifying src/sgsn/osmo-sgsn -c /build/writtenconfig/osmo-sgsn.cfgpj4wc__7, test
write_config
Launching: PWD=/build 'src/sgsn/osmo-sgsn' '-c'
'/build/writtenconfig/osmo-sgsn.cfgpj4wc__7'
ls -l /proc/11999/fd
total 0
lr-x------ 1 build build 64 Dec 15 12:14 0 -> pipe:[31284181]
l-wx------ 1 build build 64 Dec 15 12:14 1 -> pipe:[31284182]
l-wx------ 1 build build 64 Dec 15 12:14 2 -> pipe:[31284183]
l-wx------ 1 build build 64 Dec 15 12:14 3 -> /dev/null
ss -tn
State Recv-Q Send-Q Local
Address:Port Peer Address:Port
ss -tln
State Recv-Q Send-Q Local
Address:Port Peer Address:Port
LISTEN 0 10 127.0.0.1:4245 *:*
LISTEN 0 10 127.0.0.1:4251 *:*
ps xua | grep osmo
build 11999 1.8 0.0
54040 21180 ? S 12:14 0:00 /usr/bin/python3 /usr/local/bin/osmotestconfig.py
-p /build -w /build -v
build 12044 0.0 0.0 21475111140 17796 ? S 12:14 0:00 src/sgsn/osmo-sgsn -c
/build/writtenconfig/osmo-sgsn.cfgpj4wc__7
build 12051 0.0 0.0 4280 712 ? S 12:14 0:00 /bin/sh -c ps xua | grep
osmo
build 12053 0.0 0.0 12784 992 ? S 12:14 0:00 grep osmo
Socket: in 1 tries, connected to 127.0.0.1:4245 <socket.socket fd=4,
family=AddressFamily.AF_INET, type=SocketKind.SOCK_STREAM, proto=0,
laddr=('127.0.0.1', 54200), raddr=('127.0.0.1', 4245)> (1 sockets
open)
Terminating took 0.897s
Socket: closing 127.0.0.1:4245 <socket.socket fd=4, family=AddressFamily.AF_INET,
type=SocketKind.SOCK_STREAM, proto=0, laddr=('127.0.0.1', 54200),
raddr=('127.0.0.1', 4245)> (0 sockets open)
Verifying src/sgsn/osmo-sgsn -c /build/writtenconfig/osmo-sgsn.cfgpj4wc__7, test
token_vty_command
Launching: PWD=/build 'src/sgsn/osmo-sgsn' '-c'
'/build/writtenconfig/osmo-sgsn.cfgpj4wc__7'
ls -l /proc/11999/fd
total 0
lr-x------ 1 build build 64 Dec 15 12:14 0 -> pipe:[31284181]
l-wx------ 1 build build 64 Dec 15 12:14 1 -> pipe:[31284182]
l-wx------ 1 build build 64 Dec 15 12:14 2 -> pipe:[31284183]
l-wx------ 1 build build 64 Dec 15 12:14 3 -> /dev/null
ss -tn
State Recv-Q Send-Q Local
Address:Port Peer Address:Port
ss -tln
State Recv-Q Send-Q Local
Address:Port Peer Address:Port
LISTEN 0 10 127.0.0.1:4245 *:*
LISTEN 0 10 127.0.0.1:4251 *:*
ps xua | grep osmo
build 11999 1.1 0.0
54040 21180 ? S 12:14 0:00 /usr/bin/python3 /usr/local/bin/osmotestconfig.py
-p /build -w /build -v
build 12055 0.0 0.0 21475111140 18188 ? S 12:14 0:00 src/sgsn/osmo-sgsn -c
/build/writtenconfig/osmo-sgsn.cfgpj4wc__7
build 12062 0.0 0.0 4280 756 ? S 12:14 0:00 /bin/sh -c ps xua | grep
osmo
build 12064 0.0 0.0 12784 1028 ? S 12:14 0:00 grep osmo
Socket: in 1 tries, connected to 127.0.0.1:4245 <socket.socket fd=4,
family=AddressFamily.AF_INET, type=SocketKind.SOCK_STREAM, proto=0,
laddr=('127.0.0.1', 54202), raddr=('127.0.0.1', 4245)> (1 sockets
open)
Terminating took 0.897s
Socket: closing 127.0.0.1:4245 <socket.socket fd=4, family=AddressFamily.AF_INET,
type=SocketKind.SOCK_STREAM, proto=0, laddr=('127.0.0.1', 54202),
raddr=('127.0.0.1', 4245)> (0 sockets open)
Verifying src/gtphub/osmo-gtphub -c
/build/doc/examples/osmo-gtphub/osmo-gtphub-1iface.cfg, test verify_doc
Launching: PWD=/build 'src/gtphub/osmo-gtphub' '-c'
'/build/doc/examples/osmo-gtphub/osmo-gtphub-1iface.cfg'
ls -l /proc/11999/fd
total 0
lr-x------ 1 build build 64 Dec 15 12:14 0 -> pipe:[31284181]
l-wx------ 1 build build 64 Dec 15 12:14 1 -> pipe:[31284182]
l-wx------ 1 build build 64 Dec 15 12:14 2 -> pipe:[31284183]
l-wx------ 1 build build 64 Dec 15 12:14 3 -> /dev/null
ss -tn
State Recv-Q Send-Q Local
Address:Port Peer Address:Port
ss -tln
State Recv-Q Send-Q Local
Address:Port Peer Address:Port
LISTEN 0 10 127.0.0.1:4253 *:*
ps xua | grep osmo
build 11999 1.1 0.0
54040 21180 ? S 12:14 0:00 /usr/bin/python3 /usr/local/bin/osmotestconfig.py
-p /build -w /build -v
build 12066 0.0 0.0 21474963656 14244 ? S 12:14 0:00 src/gtphub/osmo-gtphub -c
/build/doc/examples/osmo-gtphub/osmo-gtphub-1iface.cfg
build 12073 0.0 0.0 4280 700 ? S 12:14 0:00 /bin/sh -c ps xua | grep
osmo
build 12075 0.0 0.0 12784 960 ? S 12:14 0:00 grep osmo
Socket: in 1 tries, connected to 127.0.0.1:4253 <socket.socket fd=4,
family=AddressFamily.AF_INET, type=SocketKind.SOCK_STREAM, proto=0,
laddr=('127.0.0.1', 45112), raddr=('127.0.0.1', 4253)> (1 sockets
open)
Terminating took 0.897s
Socket: closing 127.0.0.1:4253 <socket.socket fd=4, family=AddressFamily.AF_INET,
type=SocketKind.SOCK_STREAM, proto=0, laddr=('127.0.0.1', 45112),
raddr=('127.0.0.1', 4253)> (0 sockets open)
Verifying src/gtphub/osmo-gtphub -c /build/writtenconfig/osmo-gtphub-1iface.cfg32oj5k1t,
test write_config
Launching: PWD=/build 'src/gtphub/osmo-gtphub' '-c'
'/build/writtenconfig/osmo-gtphub-1iface.cfg32oj5k1t'
ls -l /proc/11999/fd
total 0
lr-x------ 1 build build 64 Dec 15 12:14 0 -> pipe:[31284181]
l-wx------ 1 build build 64 Dec 15 12:14 1 -> pipe:[31284182]
l-wx------ 1 build build 64 Dec 15 12:14 2 -> pipe:[31284183]
l-wx------ 1 build build 64 Dec 15 12:14 3 -> /dev/null
ss -tn
State Recv-Q Send-Q Local
Address:Port Peer Address:Port
ss -tln
State Recv-Q Send-Q Local
Address:Port Peer Address:Port
LISTEN 0 10 127.0.0.1:4253 *:*
ps xua | grep osmo
build 11999 1.0 0.0
54040 21180 ? S 12:14 0:00 /usr/bin/python3 /usr/local/bin/osmotestconfig.py
-p /build -w /build -v
build 12077 0.0 0.0 21474963656 14060 ? S 12:14 0:00 src/gtphub/osmo-gtphub -c
/build/writtenconfig/osmo-gtphub-1iface.cfg32oj5k1t
build 12084 0.0 0.0 4280 704 ? S 12:14 0:00 /bin/sh -c ps xua | grep
osmo
build 12086 0.0 0.0 12784 964 ? S 12:14 0:00 grep osmo
Socket: in 1 tries, connected to 127.0.0.1:4253 <socket.socket fd=4,
family=AddressFamily.AF_INET, type=SocketKind.SOCK_STREAM, proto=0,
laddr=('127.0.0.1', 45114), raddr=('127.0.0.1', 4253)> (1 sockets
open)
Terminating took 0.897s
Socket: closing 127.0.0.1:4253 <socket.socket fd=4, family=AddressFamily.AF_INET,
type=SocketKind.SOCK_STREAM, proto=0, laddr=('127.0.0.1', 45114),
raddr=('127.0.0.1', 4253)> (0 sockets open)
Verifying src/gtphub/osmo-gtphub -c /build/writtenconfig/osmo-gtphub-1iface.cfg32oj5k1t,
test token_vty_command
Launching: PWD=/build 'src/gtphub/osmo-gtphub' '-c'
'/build/writtenconfig/osmo-gtphub-1iface.cfg32oj5k1t'
ls -l /proc/11999/fd
total 0
lr-x------ 1 build build 64 Dec 15 12:14 0 -> pipe:[31284181]
l-wx------ 1 build build 64 Dec 15 12:14 1 -> pipe:[31284182]
l-wx------ 1 build build 64 Dec 15 12:14 2 -> pipe:[31284183]
l-wx------ 1 build build 64 Dec 15 12:14 3 -> /dev/null
ss -tn
State Recv-Q Send-Q Local
Address:Port Peer Address:Port
ss -tln
State Recv-Q Send-Q Local
Address:Port Peer Address:Port
LISTEN 0 10 127.0.0.1:4253 *:*
ps xua | grep osmo
build 11999 0.8 0.0
54040 21180 ? S 12:14 0:00 /usr/bin/python3 /usr/local/bin/osmotestconfig.py
-p /build -w /build -v
build 12088 0.0 0.0 21474963656 13864 ? S 12:14 0:00 src/gtphub/osmo-gtphub -c
/build/writtenconfig/osmo-gtphub-1iface.cfg32oj5k1t
build 12095 0.0 0.0 4280 772 ? S 12:14 0:00 /bin/sh -c ps xua | grep
osmo
build 12097 0.0 0.0 4280 88 ? R 12:14 0:00 /bin/sh -c ps xua | grep
osmo
ERRORS: 1
Socket: in 1 tries, connected to 127.0.0.1:4253 <socket.socket fd=4,
family=AddressFamily.AF_INET, type=SocketKind.SOCK_STREAM, proto=0,
laddr=('127.0.0.1', 45118), raddr=('127.0.0.1', 4253)> (1 sockets
open)
Terminating took 0.897s
Socket: closing 127.0.0.1:4253 <socket.socket fd=4, family=AddressFamily.AF_INET,
type=SocketKind.SOCK_STREAM, proto=0, laddr=('127.0.0.1', 45118),
raddr=('127.0.0.1', 4253)> (0 sockets open)
Makefile:710: recipe for target 'vty-python-test' failed
make[7]: Leaving directory '/build/tests'
make[7]: *** [vty-python-test] Error 1
Makefile:727: recipe for target 'vty-test' failed
make[6]: Leaving directory '/build/tests'
make[6]: *** [vty-test] Error 2
Makefile:704: recipe for target 'python-tests' failed
make[5]: Leaving directory '/build/tests'
make[5]: *** [python-tests] Error 2
Makefile:735: recipe for target 'check-local' failed
make[4]: *** [check-local] Error 2
make[4]: Leaving directory '/build/tests'
make[3]: *** [check-am] Error 2
Makefile:564: recipe for target 'check-am' failed
make[3]: Leaving directory '/build/tests'
Makefile:416: recipe for target 'check-recursive' failed
make[2]: Leaving directory '/build/tests'
make[2]: *** [check-recursive] Error 1
Makefile:461: recipe for target 'check-recursive' failed
make[1]: Leaving directory '/build'
make[1]: *** [check-recursive] Error 1
Makefile:752: recipe for target 'check' failed
make: *** [check] Error 2
+ cat-testlogs.sh
Build step 'Execute shell' marked build as failure
[WARNINGS]Skipping publisher since build result is FAILURE