See https://jenkins.osmocom.org/jenkins/job/TTCN3-centos7-pcap-client-test/1134/display/redirect
Changes:
------------------------------------------ [...truncated 21.49 KiB...] #7 2.620 Running transaction #7 4.428 Preparing : 1/1 #7 4.446 Installing : osmocom-nightly-202501162026-1.1.x86_64 1/23 #7 4.480 Installing : libmnl-1.0.5-7.1.x86_64 2/23 #7 4.536 Installing : libosmocore22-1.10.0.58.6cd7a.202501162026-1.1.x86 3/23 #7 4.571 Running scriptlet: libosmocore22-1.10.0.58.6cd7a.202501162026-1.1.x86 3/23 #7 4.612 Installing : libosmoisdn0-1.10.0.58.6cd7a.202501162026-1.1.x86_ 4/23 #7 4.647 Running scriptlet: libosmoisdn0-1.10.0.58.6cd7a.202501162026-1.1.x86_ 4/23 #7 4.690 Installing : libosmogsm20-1.10.0.58.6cd7a.202501162026-1.1.x86_ 5/23 #7 4.718 Running scriptlet: libosmogsm20-1.10.0.58.6cd7a.202501162026-1.1.x86_ 5/23 #7 4.744 Installing : libosmovty13-1.10.0.58.6cd7a.202501162026-1.1.x86_ 6/23 #7 4.772 Running scriptlet: libosmovty13-1.10.0.58.6cd7a.202501162026-1.1.x86_ 6/23 #7 4.816 Installing : libunwind-2:1.2-2.el7.x86_64 7/23 #7 4.845 Running scriptlet: libunwind-2:1.2-2.el7.x86_64 7/23 #7 4.895 Installing : libsodium23-1.0.18-2.1.x86_64 8/23 #7 4.936 Running scriptlet: libsodium23-1.0.18-2.1.x86_64 8/23 #7 4.977 Installing : libpgm-5_2-0-5.2.122-3.1.x86_64 9/23 #7 5.016 Running scriptlet: libpgm-5_2-0-5.2.122-3.1.x86_64 9/23 #7 5.064 Installing : libzmq5-4.3.5-1.1.x86_64 10/23 #7 5.098 Running scriptlet: libzmq5-4.3.5-1.1.x86_64 10/23 #7 5.131 Installing : openpgm-devel-5.2.122-3.1.x86_64 11/23 #7 5.194 Installing : libsodium-devel-1.0.18-2.1.x86_64 12/23 #7 5.260 Installing : libunwind-devel-2:1.2-2.el7.x86_64 13/23 #7 5.319 Installing : libosmoctrl0-1.10.0.58.6cd7a.202501162026-1.1.x86_ 14/23 #7 5.359 Running scriptlet: libosmoctrl0-1.10.0.58.6cd7a.202501162026-1.1.x86_ 14/23 #7 5.400 Installing : libosmogb14-1.10.0.58.6cd7a.202501162026-1.1.x86_6 15/23 #7 5.440 Running scriptlet: libosmogb14-1.10.0.58.6cd7a.202501162026-1.1.x86_6 15/23 #7 5.472 Installing : libmnl-devel-1.0.5-7.1.x86_64 16/23 #7 5.534 Installing : libosmocore-devel-1.10.0.58.6cd7a.202501162026-1.1 17/23 #7 5.587 Installing : libosmoisdn-devel-1.10.0.58.6cd7a.202501162026-1.1 18/23 #7 5.652 Installing : libosmogsm-devel-1.10.0.58.6cd7a.202501162026-1.1. 19/23 #7 5.700 Installing : libosmovty-devel-1.10.0.58.6cd7a.202501162026-1.1. 20/23 #7 5.751 Installing : libosmogb-devel-1.10.0.58.6cd7a.202501162026-1.1.x 21/23 #7 5.804 Installing : libosmoctrl-devel-1.10.0.58.6cd7a.202501162026-1.1 22/23 #7 5.918 Installing : zeromq-devel-4.3.5-1.1.x86_64 23/23 #7 5.988 Verifying : libmnl-1.0.5-7.1.x86_64 1/23 #7 5.988 Verifying : libmnl-devel-1.0.5-7.1.x86_64 2/23 #7 5.988 Verifying : libosmocore-devel-1.10.0.58.6cd7a.202501162026-1.1 3/23 #7 5.988 Verifying : libosmocore22-1.10.0.58.6cd7a.202501162026-1.1.x86 4/23 #7 5.988 Verifying : libosmoctrl-devel-1.10.0.58.6cd7a.202501162026-1.1 5/23 #7 5.988 Verifying : libosmoctrl0-1.10.0.58.6cd7a.202501162026-1.1.x86_ 6/23 #7 5.988 Verifying : libosmogb-devel-1.10.0.58.6cd7a.202501162026-1.1.x 7/23 #7 5.988 Verifying : libosmogb14-1.10.0.58.6cd7a.202501162026-1.1.x86_6 8/23 #7 5.988 Verifying : libosmogsm-devel-1.10.0.58.6cd7a.202501162026-1.1. 9/23 #7 5.989 Verifying : libosmogsm20-1.10.0.58.6cd7a.202501162026-1.1.x86_ 10/23 #7 5.989 Verifying : libosmoisdn-devel-1.10.0.58.6cd7a.202501162026-1.1 11/23 #7 5.989 Verifying : libosmoisdn0-1.10.0.58.6cd7a.202501162026-1.1.x86_ 12/23 #7 5.989 Verifying : libosmovty-devel-1.10.0.58.6cd7a.202501162026-1.1. 13/23 #7 5.989 Verifying : libosmovty13-1.10.0.58.6cd7a.202501162026-1.1.x86_ 14/23 #7 5.989 Verifying : libpgm-5_2-0-5.2.122-3.1.x86_64 15/23 #7 5.989 Verifying : libsodium-devel-1.0.18-2.1.x86_64 16/23 #7 5.989 Verifying : libsodium23-1.0.18-2.1.x86_64 17/23 #7 5.989 Verifying : libzmq5-4.3.5-1.1.x86_64 18/23 #7 5.989 Verifying : openpgm-devel-5.2.122-3.1.x86_64 19/23 #7 5.989 Verifying : osmocom-nightly-202501162026-1.1.x86_64 20/23 #7 5.989 Verifying : zeromq-devel-4.3.5-1.1.x86_64 21/23 #7 5.989 Verifying : libunwind-2:1.2-2.el7.x86_64 22/23 #7 5.989 Verifying : libunwind-devel-2:1.2-2.el7.x86_64 23/23 #7 6.745 #7 6.745 Installed: #7 6.745 libosmocore-devel-1.10.0.58.6cd7a.202501162026-1.1.x86_64 #7 6.745 libosmoctrl-devel-1.10.0.58.6cd7a.202501162026-1.1.x86_64 #7 6.745 libosmogb-devel-1.10.0.58.6cd7a.202501162026-1.1.x86_64 #7 6.745 libosmogsm-devel-1.10.0.58.6cd7a.202501162026-1.1.x86_64 #7 6.745 libosmovty-devel-1.10.0.58.6cd7a.202501162026-1.1.x86_64 #7 6.745 zeromq-devel-4.3.5-1.1.x86_64 #7 6.745 libmnl-1.0.5-7.1.x86_64 #7 6.745 libmnl-devel-1.0.5-7.1.x86_64 #7 6.745 libosmocore22-1.10.0.58.6cd7a.202501162026-1.1.x86_64 #7 6.745 libosmoctrl0-1.10.0.58.6cd7a.202501162026-1.1.x86_64 #7 6.745 libosmogb14-1.10.0.58.6cd7a.202501162026-1.1.x86_64 #7 6.745 libosmogsm20-1.10.0.58.6cd7a.202501162026-1.1.x86_64 #7 6.745 libosmoisdn-devel-1.10.0.58.6cd7a.202501162026-1.1.x86_64 #7 6.745 libosmoisdn0-1.10.0.58.6cd7a.202501162026-1.1.x86_64 #7 6.745 libosmovty13-1.10.0.58.6cd7a.202501162026-1.1.x86_64 #7 6.745 libpgm-5_2-0-5.2.122-3.1.x86_64 #7 6.745 libsodium-devel-1.0.18-2.1.x86_64 #7 6.745 libsodium23-1.0.18-2.1.x86_64 #7 6.745 libzmq5-4.3.5-1.1.x86_64 #7 6.745 openpgm-devel-5.2.122-3.1.x86_64 #7 6.745 osmocom-nightly-202501162026-1.1.x86_64 #7 6.745 libunwind-2:1.2-2.el7.x86_64 #7 6.745 libunwind-devel-2:1.2-2.el7.x86_64 #7 6.745 #7 6.746 Complete! #7 DONE 6.9s
#8 [3/8] WORKDIR /TMP #8 DONE 0.1s
#9 [4/8] RUN GIT clone https://gerrit.osmocom.org/osmo-pcap.git #9 0.349 Cloning into 'osmo-pcap'... #9 DONE 0.7s
#10 [5/8] ADD HTTPS://GERRIT.OSMOCOM.ORG/PLUGINS/GITILES/OSMO-PCAP/+/MASTER?FORMAT=TEXT /tmp/commit-osmo-pcap #10 DONE 0.1s
#11 [6/8] RUN CD osmo-pcap && git fetch && git checkout master && (git symbolic-ref -q HEAD && git reset --hard origin/master || exit 1); git rev-parse --abbrev-ref HEAD && git rev-parse HEAD && autoreconf -fi && ./configure && make "-j$(nproc)" install #11 0.441 Already on 'master' #11 0.442 refs/heads/master #11 0.444 HEAD is now at 4bf57c2 server: Use osmo_stream_srv_link on tcp listen socket #11 0.446 master #11 0.447 4bf57c2fe5cbf6622a19a2dd1764ebac178fc0c2 #11 3.059 libtoolize: putting auxiliary files in `.'. #11 3.059 libtoolize: copying file `./ltmain.sh' #11 3.384 libtoolize: Consider adding `AC_CONFIG_MACRO_DIR([m4])' to configure.ac and #11 3.384 libtoolize: rerunning libtoolize, to keep the correct libtool macros in-tree. #11 3.384 libtoolize: Consider adding `-I m4' to ACLOCAL_AMFLAGS in Makefile.am. #11 3.387 libtoolize: `AC_PROG_RANLIB' is rendered obsolete by `LT_INIT' #11 5.480 configure.ac:63: installing './config.guess' #11 5.481 configure.ac:63: installing './config.sub' #11 5.482 configure.ac:6: installing './install-sh' #11 5.483 configure.ac:6: installing './missing' #11 5.576 src/Makefile.am: installing './depcomp' #11 5.647 checking for a BSD-compatible install... /usr/bin/install -c #11 5.651 checking whether build environment is sane... yes #11 5.658 checking for a thread-safe mkdir -p... /usr/bin/mkdir -p #11 5.660 checking for gawk... gawk #11 5.660 checking whether make sets $(MAKE)... yes #11 5.670 checking whether make supports nested variables... yes #11 5.680 checking whether make supports nested variables... (cached) yes #11 5.680 checking whether make sets $(MAKE)... (cached) yes #11 5.685 checking for gcc... gcc #11 5.731 checking whether the C compiler works... yes #11 5.791 checking for C compiler default output file name... a.out #11 5.791 checking for suffix of executables... #11 5.813 checking whether we are cross compiling... no #11 5.862 checking for suffix of object files... o #11 5.883 checking whether we are using the GNU C compiler... yes #11 5.914 checking whether gcc accepts -g... yes #11 5.948 checking for gcc option to accept ISO C89... none needed #11 5.985 checking for style of include used by make... GNU #11 5.992 checking dependency style of gcc... gcc3 #11 6.072 checking for ranlib... ranlib #11 6.099 checking build system type... x86_64-unknown-linux-gnu #11 6.191 checking host system type... x86_64-unknown-linux-gnu #11 6.192 checking how to print strings... printf #11 6.197 checking for a sed that does not truncate output... /usr/bin/sed #11 6.208 checking for grep that handles long lines and -e... /usr/bin/grep #11 6.214 checking for egrep... /usr/bin/grep -E #11 6.217 checking for fgrep... /usr/bin/grep -F #11 6.222 checking for ld used by gcc... /usr/bin/ld #11 6.232 checking if the linker (/usr/bin/ld) is GNU ld... yes #11 6.237 checking for BSD- or MS-compatible name lister (nm)... /usr/bin/nm -B #11 6.243 checking the name lister (/usr/bin/nm -B) interface... BSD nm #11 6.290 checking whether ln -s works... yes #11 6.290 checking the maximum length of command line arguments... 1572864 #11 6.300 checking whether the shell understands some XSI constructs... yes #11 6.303 checking whether the shell understands "+="... yes #11 6.311 checking how to convert x86_64-unknown-linux-gnu file names to x86_64-unknown-linux-gnu format... func_convert_file_noop #11 6.311 checking how to convert x86_64-unknown-linux-gnu file names to toolchain format... func_convert_file_noop #11 6.312 checking for /usr/bin/ld option to reload object files... -r #11 6.313 checking for objdump... objdump #11 6.313 checking how to recognize dependent libraries... pass_all #11 6.316 checking for dlltool... no #11 6.316 checking how to associate runtime and link libraries... printf %s\n #11 6.317 checking for ar... ar #11 6.318 checking for archiver @FILE support... @ #11 6.368 checking for strip... strip #11 6.369 checking for ranlib... (cached) ranlib #11 6.370 checking command to parse /usr/bin/nm -B output from gcc object... ok #11 6.491 checking for sysroot... no #11 6.504 ./configure: line 6418: /usr/bin/file: No such file or directory #11 6.508 checking for mt... no #11 6.508 checking if : is a manifest tool... no #11 6.520 checking how to run the C preprocessor... gcc -E #11 6.617 checking for ANSI C header files... yes #11 6.698 checking for sys/types.h... yes #11 6.726 checking for sys/stat.h... yes #11 6.763 checking for stdlib.h... yes #11 6.800 checking for string.h... yes #11 6.833 checking for memory.h... yes #11 6.865 checking for strings.h... yes #11 6.896 checking for inttypes.h... yes #11 6.931 checking for stdint.h... yes #11 6.968 checking for unistd.h... yes #11 7.002 checking for dlfcn.h... yes #11 7.029 checking for objdir... .libs #11 7.121 checking if gcc supports -fno-rtti -fno-exceptions... no #11 7.135 checking for gcc option to produce PIC... -fPIC -DPIC #11 7.135 checking if gcc PIC flag -fPIC -DPIC works... yes #11 7.154 checking if gcc static flag -static works... no #11 7.195 checking if gcc supports -c -o file.o... yes #11 7.261 checking if gcc supports -c -o file.o... (cached) yes #11 7.261 checking whether the gcc linker (/usr/bin/ld) supports shared libraries... yes #11 7.280 checking whether -lc should be explicitly linked in... no #11 7.337 checking dynamic linker characteristics... GNU/Linux ld.so #11 7.411 checking how to hardcode library paths into programs... immediate #11 7.411 checking whether stripping libraries is possible... yes #11 7.413 checking if libtool supports shared libraries... yes #11 7.413 checking whether to build shared libraries... yes #11 7.413 checking whether to build static libraries... yes #11 7.414 checking for pkg-config... /usr/bin/pkg-config #11 7.414 checking for pkg-config... /usr/bin/pkg-config #11 7.415 checking pkg-config is at least version 0.20... yes #11 7.417 checking for ANSI C header files... (cached) yes #11 7.422 checking whether to enable VTY tests... no #11 7.422 checking for pcap-config... /usr/bin/pcap-config #11 7.428 checking for LIBOSMOCORE... yes #11 7.450 checking for LIBOSMOGB... yes #11 7.473 checking for LIBOSMOGSM... yes #11 7.495 checking for LIBOSMOVTY... yes #11 7.516 checking for LIBOSMONETIF... no #11 7.534 configure: error: Package requirements (libosmo-netif >= 1.5.0) were not met: #11 7.534 #11 7.534 No package 'libosmo-netif' found #11 7.534 #11 7.534 Consider adjusting the PKG_CONFIG_PATH environment variable if you #11 7.534 installed software in a non-standard prefix. #11 7.534 #11 7.534 Alternatively, you may set the environment variables LIBOSMONETIF_CFLAGS #11 7.534 and LIBOSMONETIF_LIBS to avoid the need to call pkg-config. #11 7.534 See the pkg-config man page for more details. #11 ERROR: process "/bin/sh -c cd osmo-pcap && \tgit fetch && git checkout $OSMO_PCAP_BRANCH && \t(git symbolic-ref -q HEAD && git reset --hard origin/$OSMO_PCAP_BRANCH || exit 1); \tgit rev-parse --abbrev-ref HEAD && git rev-parse HEAD && \tautoreconf -fi && \t./configure && \tmake "-j$(nproc)" install" did not complete successfully: exit code: 1 ------
[6/8] RUN CD osmo-pcap && git fetch && git checkout master && (git symbolic-ref -q HEAD && git reset --hard origin/master || exit 1); git rev-parse --abbrev-ref HEAD && git rev-parse HEAD && autoreconf -fi && ./configure && make "-j$(nproc)" install:
7.534 configure: error: Package requirements (libosmo-netif >= 1.5.0) were not met: 7.534 7.534 No package 'libosmo-netif' found 7.534 7.534 Consider adjusting the PKG_CONFIG_PATH environment variable if you 7.534 installed software in a non-standard prefix. 7.534 7.534 Alternatively, you may set the environment variables LIBOSMONETIF_CFLAGS 7.534 and LIBOSMONETIF_LIBS to avoid the need to call pkg-config. 7.534 See the pkg-config man page for more details. ------
[33m1 warning found (use docker --debug to expand): [0m - InvalidDefaultArgInFrom: Default value for ARG $USER/$DISTRO-build results in empty or invalid base image name (line 3) Dockerfile:34 -------------------- 33 | 34 | >>> RUN cd osmo-pcap && \ 35 | >>> git fetch && git checkout $OSMO_PCAP_BRANCH && \ 36 | >>> (git symbolic-ref -q HEAD && git reset --hard origin/$OSMO_PCAP_BRANCH || exit 1); \ 37 | >>> git rev-parse --abbrev-ref HEAD && git rev-parse HEAD && \ 38 | >>> autoreconf -fi && \ 39 | >>> ./configure && \ 40 | >>> make "-j$(nproc)" install 41 | -------------------- ERROR: failed to solve: process "/bin/sh -c cd osmo-pcap && \tgit fetch && git checkout $OSMO_PCAP_BRANCH && \t(git symbolic-ref -q HEAD && git reset --hard origin/$OSMO_PCAP_BRANCH || exit 1); \tgit rev-parse --abbrev-ref HEAD && git rev-parse HEAD && \tautoreconf -fi && \t./configure && \tmake "-j$(nproc)" install" did not complete successfully: exit code: 1 make: *** [../make/Makefile:95: docker-build] Error 1 make: Leaving directory 'https://jenkins.osmocom.org/jenkins/job/TTCN3-centos7-pcap-client-test/ws/osmo-pcap-master' + exit 1 Build step 'Execute shell' marked build as failure Recording test results ERROR: Step ‘Publish JUnit test result report’ failed: No test report files were found. Configuration error?
See https://jenkins.osmocom.org/jenkins/job/TTCN3-centos7-pcap-client-test/1135/display/redirect
Changes:
------------------------------------------ [...truncated 21.91 KiB...] #7 2.472 Running transaction #7 4.286 Preparing : 1/1 #7 4.297 Installing : osmocom-nightly-202501162026-1.1.x86_64 1/23 #7 4.326 Installing : libmnl-1.0.5-7.1.x86_64 2/23 #7 4.368 Installing : libosmocore22-1.10.0.58.6cd7a.202501162026-1.1.x86 3/23 #7 4.403 Running scriptlet: libosmocore22-1.10.0.58.6cd7a.202501162026-1.1.x86 3/23 #7 4.415 Installing : libosmoisdn0-1.10.0.58.6cd7a.202501162026-1.1.x86_ 4/23 #7 4.450 Running scriptlet: libosmoisdn0-1.10.0.58.6cd7a.202501162026-1.1.x86_ 4/23 #7 4.473 Installing : libosmogsm20-1.10.0.58.6cd7a.202501162026-1.1.x86_ 5/23 #7 4.503 Running scriptlet: libosmogsm20-1.10.0.58.6cd7a.202501162026-1.1.x86_ 5/23 #7 4.519 Installing : libosmovty13-1.10.0.58.6cd7a.202501162026-1.1.x86_ 6/23 #7 4.548 Running scriptlet: libosmovty13-1.10.0.58.6cd7a.202501162026-1.1.x86_ 6/23 #7 4.570 Installing : libunwind-2:1.2-2.el7.x86_64 7/23 #7 4.600 Running scriptlet: libunwind-2:1.2-2.el7.x86_64 7/23 #7 4.620 Installing : libsodium23-1.0.18-2.1.x86_64 8/23 #7 4.655 Running scriptlet: libsodium23-1.0.18-2.1.x86_64 8/23 #7 4.677 Installing : libpgm-5_2-0-5.2.122-3.1.x86_64 9/23 #7 4.717 Running scriptlet: libpgm-5_2-0-5.2.122-3.1.x86_64 9/23 #7 4.746 Installing : libzmq5-4.3.5-1.1.x86_64 10/23 #7 4.781 Running scriptlet: libzmq5-4.3.5-1.1.x86_64 10/23 #7 4.796 Installing : openpgm-devel-5.2.122-3.1.x86_64 11/23 #7 4.840 Installing : libsodium-devel-1.0.18-2.1.x86_64 12/23 #7 4.890 Installing : libunwind-devel-2:1.2-2.el7.x86_64 13/23 #7 4.942 Installing : libosmoctrl0-1.10.0.58.6cd7a.202501162026-1.1.x86_ 14/23 #7 4.982 Running scriptlet: libosmoctrl0-1.10.0.58.6cd7a.202501162026-1.1.x86_ 14/23 #7 5.002 Installing : libosmogb14-1.10.0.58.6cd7a.202501162026-1.1.x86_6 15/23 #7 5.059 Running scriptlet: libosmogb14-1.10.0.58.6cd7a.202501162026-1.1.x86_6 15/23 #7 5.074 Installing : libmnl-devel-1.0.5-7.1.x86_64 16/23 #7 5.134 Installing : libosmocore-devel-1.10.0.58.6cd7a.202501162026-1.1 17/23 #7 5.180 Installing : libosmoisdn-devel-1.10.0.58.6cd7a.202501162026-1.1 18/23 #7 5.229 Installing : libosmogsm-devel-1.10.0.58.6cd7a.202501162026-1.1. 19/23 #7 5.290 Installing : libosmovty-devel-1.10.0.58.6cd7a.202501162026-1.1. 20/23 #7 5.337 Installing : libosmogb-devel-1.10.0.58.6cd7a.202501162026-1.1.x 21/23 #7 5.402 Installing : libosmoctrl-devel-1.10.0.58.6cd7a.202501162026-1.1 22/23 #7 5.504 Installing : zeromq-devel-4.3.5-1.1.x86_64 23/23 #7 5.566 Verifying : libmnl-1.0.5-7.1.x86_64 1/23 #7 5.566 Verifying : libmnl-devel-1.0.5-7.1.x86_64 2/23 #7 5.566 Verifying : libosmocore-devel-1.10.0.58.6cd7a.202501162026-1.1 3/23 #7 5.566 Verifying : libosmocore22-1.10.0.58.6cd7a.202501162026-1.1.x86 4/23 #7 5.566 Verifying : libosmoctrl-devel-1.10.0.58.6cd7a.202501162026-1.1 5/23 #7 5.566 Verifying : libosmoctrl0-1.10.0.58.6cd7a.202501162026-1.1.x86_ 6/23 #7 5.567 Verifying : libosmogb-devel-1.10.0.58.6cd7a.202501162026-1.1.x 7/23 #7 5.567 Verifying : libosmogb14-1.10.0.58.6cd7a.202501162026-1.1.x86_6 8/23 #7 5.567 Verifying : libosmogsm-devel-1.10.0.58.6cd7a.202501162026-1.1. 9/23 #7 5.567 Verifying : libosmogsm20-1.10.0.58.6cd7a.202501162026-1.1.x86_ 10/23 #7 5.567 Verifying : libosmoisdn-devel-1.10.0.58.6cd7a.202501162026-1.1 11/23 #7 5.567 Verifying : libosmoisdn0-1.10.0.58.6cd7a.202501162026-1.1.x86_ 12/23 #7 5.567 Verifying : libosmovty-devel-1.10.0.58.6cd7a.202501162026-1.1. 13/23 #7 5.567 Verifying : libosmovty13-1.10.0.58.6cd7a.202501162026-1.1.x86_ 14/23 #7 5.567 Verifying : libpgm-5_2-0-5.2.122-3.1.x86_64 15/23 #7 5.567 Verifying : libsodium-devel-1.0.18-2.1.x86_64 16/23 #7 5.567 Verifying : libsodium23-1.0.18-2.1.x86_64 17/23 #7 5.567 Verifying : libzmq5-4.3.5-1.1.x86_64 18/23 #7 5.567 Verifying : openpgm-devel-5.2.122-3.1.x86_64 19/23 #7 5.567 Verifying : osmocom-nightly-202501162026-1.1.x86_64 20/23 #7 5.567 Verifying : zeromq-devel-4.3.5-1.1.x86_64 21/23 #7 5.567 Verifying : libunwind-2:1.2-2.el7.x86_64 22/23 #7 5.567 Verifying : libunwind-devel-2:1.2-2.el7.x86_64 23/23 #7 6.336 #7 6.336 Installed: #7 6.336 libosmocore-devel-1.10.0.58.6cd7a.202501162026-1.1.x86_64 #7 6.336 libosmoctrl-devel-1.10.0.58.6cd7a.202501162026-1.1.x86_64 #7 6.336 libosmogb-devel-1.10.0.58.6cd7a.202501162026-1.1.x86_64 #7 6.336 libosmogsm-devel-1.10.0.58.6cd7a.202501162026-1.1.x86_64 #7 6.336 libosmovty-devel-1.10.0.58.6cd7a.202501162026-1.1.x86_64 #7 6.336 zeromq-devel-4.3.5-1.1.x86_64 #7 6.336 libmnl-1.0.5-7.1.x86_64 #7 6.336 libmnl-devel-1.0.5-7.1.x86_64 #7 6.336 libosmocore22-1.10.0.58.6cd7a.202501162026-1.1.x86_64 #7 6.336 libosmoctrl0-1.10.0.58.6cd7a.202501162026-1.1.x86_64 #7 6.336 libosmogb14-1.10.0.58.6cd7a.202501162026-1.1.x86_64 #7 6.336 libosmogsm20-1.10.0.58.6cd7a.202501162026-1.1.x86_64 #7 6.336 libosmoisdn-devel-1.10.0.58.6cd7a.202501162026-1.1.x86_64 #7 6.336 libosmoisdn0-1.10.0.58.6cd7a.202501162026-1.1.x86_64 #7 6.336 libosmovty13-1.10.0.58.6cd7a.202501162026-1.1.x86_64 #7 6.336 libpgm-5_2-0-5.2.122-3.1.x86_64 #7 6.336 libsodium-devel-1.0.18-2.1.x86_64 #7 6.336 libsodium23-1.0.18-2.1.x86_64 #7 6.336 libzmq5-4.3.5-1.1.x86_64 #7 6.336 openpgm-devel-5.2.122-3.1.x86_64 #7 6.336 osmocom-nightly-202501162026-1.1.x86_64 #7 6.336 libunwind-2:1.2-2.el7.x86_64 #7 6.336 libunwind-devel-2:1.2-2.el7.x86_64 #7 6.336 #7 6.337 Complete! #7 DONE 6.5s
#8 [3/8] WORKDIR /TMP #8 DONE 0.2s
#9 [4/8] RUN GIT clone https://gerrit.osmocom.org/osmo-pcap.git #9 0.282 Cloning into 'osmo-pcap'... #9 DONE 0.5s
#10 [5/8] ADD HTTPS://GERRIT.OSMOCOM.ORG/PLUGINS/GITILES/OSMO-PCAP/+/MASTER?FORMAT=TEXT /tmp/commit-osmo-pcap #10 DONE 0.2s
#11 [6/8] RUN CD osmo-pcap && git fetch && git checkout master && (git symbolic-ref -q HEAD && git reset --hard origin/master || exit 1); git rev-parse --abbrev-ref HEAD && git rev-parse HEAD && autoreconf -fi && ./configure && make "-j$(nproc)" install #11 0.400 Already on 'master' #11 0.401 refs/heads/master #11 0.402 HEAD is now at 4bf57c2 server: Use osmo_stream_srv_link on tcp listen socket #11 0.403 master #11 0.403 4bf57c2fe5cbf6622a19a2dd1764ebac178fc0c2 #11 3.002 libtoolize: putting auxiliary files in `.'. #11 3.002 libtoolize: copying file `./ltmain.sh' #11 3.072 libtoolize: Consider adding `AC_CONFIG_MACRO_DIR([m4])' to configure.ac and #11 3.072 libtoolize: rerunning libtoolize, to keep the correct libtool macros in-tree. #11 3.072 libtoolize: Consider adding `-I m4' to ACLOCAL_AMFLAGS in Makefile.am. #11 3.072 libtoolize: `AC_PROG_RANLIB' is rendered obsolete by `LT_INIT' #11 5.001 configure.ac:63: installing './config.guess' #11 5.002 configure.ac:63: installing './config.sub' #11 5.003 configure.ac:6: installing './install-sh' #11 5.004 configure.ac:6: installing './missing' #11 5.115 src/Makefile.am: installing './depcomp' #11 5.187 checking for a BSD-compatible install... /usr/bin/install -c #11 5.191 checking whether build environment is sane... yes #11 5.195 checking for a thread-safe mkdir -p... /usr/bin/mkdir -p #11 5.196 checking for gawk... gawk #11 5.196 checking whether make sets $(MAKE)... yes #11 5.200 checking whether make supports nested variables... yes #11 5.202 checking whether make supports nested variables... (cached) yes #11 5.202 checking whether make sets $(MAKE)... (cached) yes #11 5.203 checking for gcc... gcc #11 5.211 checking whether the C compiler works... yes #11 5.230 checking for C compiler default output file name... a.out #11 5.231 checking for suffix of executables... #11 5.245 checking whether we are cross compiling... no #11 5.261 checking for suffix of object files... o #11 5.270 checking whether we are using the GNU C compiler... yes #11 5.277 checking whether gcc accepts -g... yes #11 5.285 checking for gcc option to accept ISO C89... none needed #11 5.296 checking for style of include used by make... GNU #11 5.297 checking dependency style of gcc... gcc3 #11 5.312 checking for ranlib... ranlib #11 5.317 checking build system type... x86_64-unknown-linux-gnu #11 5.337 checking host system type... x86_64-unknown-linux-gnu #11 5.337 checking how to print strings... printf #11 5.338 checking for a sed that does not truncate output... /usr/bin/sed #11 5.340 checking for grep that handles long lines and -e... /usr/bin/grep #11 5.340 checking for egrep... /usr/bin/grep -E #11 5.341 checking for fgrep... /usr/bin/grep -F #11 5.342 checking for ld used by gcc... /usr/bin/ld #11 5.343 checking if the linker (/usr/bin/ld) is GNU ld... yes #11 5.344 checking for BSD- or MS-compatible name lister (nm)... /usr/bin/nm -B #11 5.345 checking the name lister (/usr/bin/nm -B) interface... BSD nm #11 5.355 checking whether ln -s works... yes #11 5.355 checking the maximum length of command line arguments... 1572864 #11 5.357 checking whether the shell understands some XSI constructs... yes #11 5.357 checking whether the shell understands "+="... yes #11 5.358 checking how to convert x86_64-unknown-linux-gnu file names to x86_64-unknown-linux-gnu format... func_convert_file_noop #11 5.358 checking how to convert x86_64-unknown-linux-gnu file names to toolchain format... func_convert_file_noop #11 5.358 checking for /usr/bin/ld option to reload object files... -r #11 5.358 checking for objdump... objdump #11 5.359 checking how to recognize dependent libraries... pass_all #11 5.359 checking for dlltool... no #11 5.359 checking how to associate runtime and link libraries... printf %s\n #11 5.359 checking for ar... ar #11 5.359 checking for archiver @FILE support... @ #11 5.370 checking for strip... strip #11 5.370 checking for ranlib... (cached) ranlib #11 5.370 checking command to parse /usr/bin/nm -B output from gcc object... ok #11 5.399 checking for sysroot... no #11 5.405 ./configure: line 6418: /usr/bin/file: No such file or directory #11 5.406 checking for mt... no #11 5.406 checking if : is a manifest tool... no #11 5.408 checking how to run the C preprocessor... gcc -E #11 5.424 checking for ANSI C header files... yes #11 5.470 checking for sys/types.h... yes #11 5.483 checking for sys/stat.h... yes #11 5.496 checking for stdlib.h... yes #11 5.509 checking for string.h... yes #11 5.523 checking for memory.h... yes #11 5.536 checking for strings.h... yes #11 5.550 checking for inttypes.h... yes #11 5.564 checking for stdint.h... yes #11 5.578 checking for unistd.h... yes #11 5.592 checking for dlfcn.h... yes #11 5.604 checking for objdir... .libs #11 5.631 checking if gcc supports -fno-rtti -fno-exceptions... no #11 5.641 checking for gcc option to produce PIC... -fPIC -DPIC #11 5.641 checking if gcc PIC flag -fPIC -DPIC works... yes #11 5.650 checking if gcc static flag -static works... no #11 5.658 checking if gcc supports -c -o file.o... yes #11 5.670 checking if gcc supports -c -o file.o... (cached) yes #11 5.670 checking whether the gcc linker (/usr/bin/ld) supports shared libraries... yes #11 5.674 checking whether -lc should be explicitly linked in... no #11 5.696 checking dynamic linker characteristics... GNU/Linux ld.so #11 5.719 checking how to hardcode library paths into programs... immediate #11 5.719 checking whether stripping libraries is possible... yes #11 5.720 checking if libtool supports shared libraries... yes #11 5.721 checking whether to build shared libraries... yes #11 5.721 checking whether to build static libraries... yes #11 5.721 checking for pkg-config... /usr/bin/pkg-config #11 5.722 checking for pkg-config... /usr/bin/pkg-config #11 5.722 checking pkg-config is at least version 0.20... yes #11 5.722 checking for ANSI C header files... (cached) yes #11 5.724 checking whether to enable VTY tests... no #11 5.724 checking for pcap-config... /usr/bin/pcap-config #11 5.726 checking for LIBOSMOCORE... yes #11 5.729 checking for LIBOSMOGB... yes #11 5.733 checking for LIBOSMOGSM... yes #11 5.737 checking for LIBOSMOVTY... yes #11 5.740 checking for LIBOSMONETIF... no #11 5.743 configure: error: Package requirements (libosmo-netif >= 1.5.0) were not met: #11 5.743 #11 5.743 No package 'libosmo-netif' found #11 5.743 #11 5.743 Consider adjusting the PKG_CONFIG_PATH environment variable if you #11 5.743 installed software in a non-standard prefix. #11 5.743 #11 5.743 Alternatively, you may set the environment variables LIBOSMONETIF_CFLAGS #11 5.743 and LIBOSMONETIF_LIBS to avoid the need to call pkg-config. #11 5.743 See the pkg-config man page for more details. #11 ERROR: process "/bin/sh -c cd osmo-pcap && \tgit fetch && git checkout $OSMO_PCAP_BRANCH && \t(git symbolic-ref -q HEAD && git reset --hard origin/$OSMO_PCAP_BRANCH || exit 1); \tgit rev-parse --abbrev-ref HEAD && git rev-parse HEAD && \tautoreconf -fi && \t./configure && \tmake "-j$(nproc)" install" did not complete successfully: exit code: 1 ------
[6/8] RUN CD osmo-pcap && git fetch && git checkout master && (git symbolic-ref -q HEAD && git reset --hard origin/master || exit 1); git rev-parse --abbrev-ref HEAD && git rev-parse HEAD && autoreconf -fi && ./configure && make "-j$(nproc)" install:
5.743 configure: error: Package requirements (libosmo-netif >= 1.5.0) were not met: 5.743 5.743 No package 'libosmo-netif' found 5.743 5.743 Consider adjusting the PKG_CONFIG_PATH environment variable if you 5.743 installed software in a non-standard prefix. 5.743 5.743 Alternatively, you may set the environment variables LIBOSMONETIF_CFLAGS 5.743 and LIBOSMONETIF_LIBS to avoid the need to call pkg-config. 5.743 See the pkg-config man page for more details. ------
[33m1 warning found (use docker --debug to expand): [0m - InvalidDefaultArgInFrom: Default value for ARG $USER/$DISTRO-build results in empty or invalid base image name (line 3) Dockerfile:34 -------------------- 33 | 34 | >>> RUN cd osmo-pcap && \ 35 | >>> git fetch && git checkout $OSMO_PCAP_BRANCH && \ 36 | >>> (git symbolic-ref -q HEAD && git reset --hard origin/$OSMO_PCAP_BRANCH || exit 1); \ 37 | >>> git rev-parse --abbrev-ref HEAD && git rev-parse HEAD && \ 38 | >>> autoreconf -fi && \ 39 | >>> ./configure && \ 40 | >>> make "-j$(nproc)" install 41 | -------------------- ERROR: failed to solve: process "/bin/sh -c cd osmo-pcap && \tgit fetch && git checkout $OSMO_PCAP_BRANCH && \t(git symbolic-ref -q HEAD && git reset --hard origin/$OSMO_PCAP_BRANCH || exit 1); \tgit rev-parse --abbrev-ref HEAD && git rev-parse HEAD && \tautoreconf -fi && \t./configure && \tmake "-j$(nproc)" install" did not complete successfully: exit code: 1 make: *** [../make/Makefile:95: docker-build] Error 1 make: Leaving directory 'https://jenkins.osmocom.org/jenkins/job/TTCN3-centos7-pcap-client-test/ws/osmo-pcap-master' + exit 1 Build step 'Execute shell' marked build as failure Recording test results ERROR: Step ‘Publish JUnit test result report’ failed: No test report files were found. Configuration error?
See https://jenkins.osmocom.org/jenkins/job/TTCN3-centos7-pcap-client-test/1136/display/redirect
Changes:
------------------------------------------ [...truncated 11.32 KiB...] + echo FROM $USER/$DISTRO-build + grep -q $USER + pull_arg= + set +x Building image: osmo-pcap-master-centos7 (export NO_DOCKER_IMAGE_BUILD=1 to prevent this) + docker_osmo_ttcn3_branch + [ -n ] + echo master + make -C ../osmo-pcap-master BUILD_ARGS= UPSTREAM_DISTRO=centos:centos7 DISTRO=centos7 IMAGE=osmocom-build/osmo-pcap-master-centos7 OSMO_TTCN3_BRANCH=master make: Entering directory 'https://jenkins.osmocom.org/jenkins/job/TTCN3-centos7-pcap-client-test/ws/osmo-pcap-master' awk: fatal: cannot open file `.release' for reading: No such file or directory awk: fatal: cannot open file `.release' for reading: No such file or directory awk: fatal: cannot open file `.release' for reading: No such file or directory rm -rf .common cp -r https://jenkins.osmocom.org/jenkins/job/TTCN3-centos7-pcap-client-test/ws/common .common INFO: .release created release=0.0.0 docker build \ --build-arg USER=osmocom-build \ --build-arg UID=1000 \ --build-arg REGISTRY=registry.osmocom.org \ --build-arg OSMO_TTCN3_BRANCH=master \ --build-arg UPSTREAM_DISTRO=centos:centos7 \ --build-arg DISTRO=centos7 \ --build-arg OSMOCOM_REPO_MIRROR=https://downloads.osmocom.org \ --build-arg OSMOCOM_REPO_PATH=packages/osmocom: \ --build-arg OSMOCOM_REPO_VERSION=latest \ --build-arg OSMOCOM_REPO_TESTSUITE_MIRROR=https://downloads.osmocom.org \ --build-arg ASTERISK_BRANCH=sysmocom/20.7.0 \ --build-arg LIBOSMOCORE_BRANCH=master \ --build-arg OSMO_BB_BRANCH=master \ --build-arg OSMO_BSC_BRANCH=master \ --build-arg OSMO_BTS_BRANCH=master \ --build-arg OSMO_CBC_BRANCH=master \ --build-arg OSMO_DIA2GSUP_BRANCH=master \ --build-arg OSMO_EPDG_BRANCH=master \ --build-arg OSMO_GBPROXY_BRANCH=master \ --build-arg OSMO_GGSN_BRANCH=master \ --build-arg OSMO_GSM_TESTER_BRANCH=master \ --build-arg OSMO_HLR_BRANCH=master \ --build-arg OSMO_HNBGW_BRANCH=master \ --build-arg OSMO_HNODEB_BRANCH=master \ --build-arg OSMO_IUH_BRANCH=master \ --build-arg OSMO_MGW_BRANCH=master \ --build-arg OSMO_MSC_BRANCH=master \ --build-arg OSMO_NITB_BRANCH=master \ --build-arg OSMO_PCU_BRANCH=master \ --build-arg OSMO_REMSIM_BRANCH=master \ --build-arg OSMO_SGSN_BRANCH=master \ --build-arg OSMO_SIP_BRANCH=master \ --build-arg OSMO_STP_BRANCH=master \ --build-arg OSMO_UECUPS_BRANCH=master \ --build-arg OPEN5GS_BRANCH=main \ --build-arg PJPROJECT_BRANCH=sysmocom/2.14 \ -t osmocom-build/osmo-pcap-master-centos7:latest . #0 building with "default" instance using docker driver
#1 [internal] load build definition from Dockerfile #1 transferring dockerfile: 1.30kB done #1 WARN: InvalidDefaultArgInFrom: Default value for ARG $USER/$DISTRO-build results in empty or invalid base image name (line 3) #1 DONE 0.0s
#2 [internal] load metadata for docker.io/osmocom-build/centos7-build:latest #2 DONE 0.0s
#3 [internal] load .dockerignore #3 transferring context: 2B done #3 DONE 0.0s
#4 [internal] load build context #4 DONE 0.0s
#5 [1/8] FROM docker.io/osmocom-build/centos7-build:latest #5 DONE 0.0s
#6 [5/8] ADD HTTPS://GERRIT.OSMOCOM.ORG/PLUGINS/GITILES/OSMO-PCAP/+/MASTER?FORMAT=TEXT /tmp/commit-osmo-pcap #6 DONE 0.1s
#7 [2/8] RUN CASE "centos7" in debian*) apt-get update && apt-get install -y --no-install-recommends libosmocore-dev libzmq3-dev && apt-get clean ;; centos*) dnf install -y "pkgconfig(libosmocore)" "pkgconfig(libosmoctrl)" "pkgconfig(libosmogb)" "pkgconfig(libosmogsm)" "pkgconfig(libosmovty)" "pkgconfig(libzmq)" ;; esac #7 CACHED
#8 [3/8] WORKDIR /TMP #8 CACHED
#9 [4/8] RUN GIT clone https://gerrit.osmocom.org/osmo-pcap.git #9 CACHED
#10 [5/8] ADD HTTPS://GERRIT.OSMOCOM.ORG/PLUGINS/GITILES/OSMO-PCAP/+/MASTER?FORMAT=TEXT /tmp/commit-osmo-pcap #10 CACHED
#4 [internal] load build context #4 transferring context: 251B done #4 DONE 0.0s
#11 [6/8] RUN CD osmo-pcap && git fetch && git checkout master && (git symbolic-ref -q HEAD && git reset --hard origin/master || exit 1); git rev-parse --abbrev-ref HEAD && git rev-parse HEAD && autoreconf -fi && ./configure && make "-j$(nproc)" install #11 0.489 From https://gerrit.osmocom.org/osmo-pcap #11 0.489 + b69c374...5d4281d pespin/io -> origin/pespin/io (forced update) #11 0.489 + f079862...bae4b2d pespin/tls -> origin/pespin/tls (forced update) #11 0.520 Already on 'master' #11 0.525 refs/heads/master #11 0.531 HEAD is now at 4bf57c2 server: Use osmo_stream_srv_link on tcp listen socket #11 0.531 master #11 0.534 4bf57c2fe5cbf6622a19a2dd1764ebac178fc0c2 #11 3.203 libtoolize: putting auxiliary files in `.'. #11 3.203 libtoolize: copying file `./ltmain.sh' #11 3.607 libtoolize: Consider adding `AC_CONFIG_MACRO_DIR([m4])' to configure.ac and #11 3.607 libtoolize: rerunning libtoolize, to keep the correct libtool macros in-tree. #11 3.607 libtoolize: Consider adding `-I m4' to ACLOCAL_AMFLAGS in Makefile.am. #11 3.611 libtoolize: `AC_PROG_RANLIB' is rendered obsolete by `LT_INIT' #11 5.680 configure.ac:63: installing './config.guess' #11 5.682 configure.ac:63: installing './config.sub' #11 5.683 configure.ac:6: installing './install-sh' #11 5.685 configure.ac:6: installing './missing' #11 5.782 src/Makefile.am: installing './depcomp' #11 5.856 checking for a BSD-compatible install... /usr/bin/install -c #11 5.861 checking whether build environment is sane... yes #11 5.872 checking for a thread-safe mkdir -p... /usr/bin/mkdir -p #11 5.875 checking for gawk... gawk #11 5.875 checking whether make sets $(MAKE)... yes #11 5.893 checking whether make supports nested variables... yes #11 5.908 checking whether make supports nested variables... (cached) yes #11 5.908 checking whether make sets $(MAKE)... (cached) yes #11 5.913 checking for gcc... gcc #11 5.958 checking whether the C compiler works... yes #11 6.026 checking for C compiler default output file name... a.out #11 6.027 checking for suffix of executables... #11 6.060 checking whether we are cross compiling... no #11 6.084 checking for suffix of object files... o #11 6.112 checking whether we are using the GNU C compiler... yes #11 6.145 checking whether gcc accepts -g... yes #11 6.177 checking for gcc option to accept ISO C89... none needed #11 6.213 checking for style of include used by make... GNU #11 6.219 checking dependency style of gcc... gcc3 #11 6.301 checking for ranlib... ranlib #11 6.316 checking build system type... x86_64-unknown-linux-gnu #11 6.360 checking host system type... x86_64-unknown-linux-gnu #11 6.360 checking how to print strings... printf #11 6.364 checking for a sed that does not truncate output... /usr/bin/sed #11 6.375 checking for grep that handles long lines and -e... /usr/bin/grep #11 6.379 checking for egrep... /usr/bin/grep -E #11 6.382 checking for fgrep... /usr/bin/grep -F #11 6.386 checking for ld used by gcc... /usr/bin/ld #11 6.397 checking if the linker (/usr/bin/ld) is GNU ld... yes #11 6.401 checking for BSD- or MS-compatible name lister (nm)... /usr/bin/nm -B #11 6.408 checking the name lister (/usr/bin/nm -B) interface... BSD nm #11 6.456 checking whether ln -s works... yes #11 6.456 checking the maximum length of command line arguments... 1572864 #11 6.467 checking whether the shell understands some XSI constructs... yes #11 6.469 checking whether the shell understands "+="... yes #11 6.477 checking how to convert x86_64-unknown-linux-gnu file names to x86_64-unknown-linux-gnu format... func_convert_file_noop #11 6.478 checking how to convert x86_64-unknown-linux-gnu file names to toolchain format... func_convert_file_noop #11 6.478 checking for /usr/bin/ld option to reload object files... -r #11 6.479 checking for objdump... objdump #11 6.480 checking how to recognize dependent libraries... pass_all #11 6.482 checking for dlltool... no #11 6.483 checking how to associate runtime and link libraries... printf %s\n #11 6.483 checking for ar... ar #11 6.484 checking for archiver @FILE support... @ #11 6.538 checking for strip... strip #11 6.539 checking for ranlib... (cached) ranlib #11 6.540 checking command to parse /usr/bin/nm -B output from gcc object... ok #11 6.661 checking for sysroot... no #11 6.683 ./configure: line 6418: /usr/bin/file: No such file or directory #11 6.687 checking for mt... no #11 6.687 checking if : is a manifest tool... no #11 6.699 checking how to run the C preprocessor... gcc -E #11 6.794 checking for ANSI C header files... yes #11 6.910 checking for sys/types.h... yes #11 6.952 checking for sys/stat.h... yes #11 6.991 checking for stdlib.h... yes #11 7.022 checking for string.h... yes #11 7.059 checking for memory.h... yes #11 7.094 checking for strings.h... yes #11 7.121 checking for inttypes.h... yes #11 7.159 checking for stdint.h... yes #11 7.192 checking for unistd.h... yes #11 7.224 checking for dlfcn.h... yes #11 7.244 checking for objdir... .libs #11 7.293 checking if gcc supports -fno-rtti -fno-exceptions... no #11 7.324 checking for gcc option to produce PIC... -fPIC -DPIC #11 7.324 checking if gcc PIC flag -fPIC -DPIC works... yes #11 7.369 checking if gcc static flag -static works... no #11 7.410 checking if gcc supports -c -o file.o... yes #11 7.477 checking if gcc supports -c -o file.o... (cached) yes #11 7.477 checking whether the gcc linker (/usr/bin/ld) supports shared libraries... yes #11 7.496 checking whether -lc should be explicitly linked in... no #11 7.551 checking dynamic linker characteristics... GNU/Linux ld.so #11 7.620 checking how to hardcode library paths into programs... immediate #11 7.620 checking whether stripping libraries is possible... yes #11 7.622 checking if libtool supports shared libraries... yes #11 7.622 checking whether to build shared libraries... yes #11 7.622 checking whether to build static libraries... yes #11 7.623 checking for pkg-config... /usr/bin/pkg-config #11 7.624 checking for pkg-config... /usr/bin/pkg-config #11 7.625 checking pkg-config is at least version 0.20... yes #11 7.628 checking for ANSI C header files... (cached) yes #11 7.636 checking whether to enable VTY tests... no #11 7.637 checking for pcap-config... /usr/bin/pcap-config #11 7.645 checking for LIBOSMOCORE... yes #11 7.667 checking for LIBOSMOGB... yes #11 7.690 checking for LIBOSMOGSM... yes #11 7.712 checking for LIBOSMOVTY... yes #11 7.733 checking for LIBOSMONETIF... no #11 7.751 configure: error: Package requirements (libosmo-netif >= 1.5.0) were not met: #11 7.751 #11 7.751 No package 'libosmo-netif' found #11 7.751 #11 7.751 Consider adjusting the PKG_CONFIG_PATH environment variable if you #11 7.751 installed software in a non-standard prefix. #11 7.751 #11 7.751 Alternatively, you may set the environment variables LIBOSMONETIF_CFLAGS #11 7.751 and LIBOSMONETIF_LIBS to avoid the need to call pkg-config. #11 7.751 See the pkg-config man page for more details. #11 ERROR: process "/bin/sh -c cd osmo-pcap && \tgit fetch && git checkout $OSMO_PCAP_BRANCH && \t(git symbolic-ref -q HEAD && git reset --hard origin/$OSMO_PCAP_BRANCH || exit 1); \tgit rev-parse --abbrev-ref HEAD && git rev-parse HEAD && \tautoreconf -fi && \t./configure && \tmake "-j$(nproc)" install" did not complete successfully: exit code: 1 ------
[6/8] RUN CD osmo-pcap && git fetch && git checkout master && (git symbolic-ref -q HEAD && git reset --hard origin/master || exit 1); git rev-parse --abbrev-ref HEAD && git rev-parse HEAD && autoreconf -fi && ./configure && make "-j$(nproc)" install:
7.751 configure: error: Package requirements (libosmo-netif >= 1.5.0) were not met: 7.751 7.751 No package 'libosmo-netif' found 7.751 7.751 Consider adjusting the PKG_CONFIG_PATH environment variable if you 7.751 installed software in a non-standard prefix. 7.751 7.751 Alternatively, you may set the environment variables LIBOSMONETIF_CFLAGS 7.751 and LIBOSMONETIF_LIBS to avoid the need to call pkg-config. 7.751 See the pkg-config man page for more details. ------
[33m1 warning found (use docker --debug to expand): [0m - InvalidDefaultArgInFrom: Default value for ARG $USER/$DISTRO-build results in empty or invalid base image name (line 3) Dockerfile:34 -------------------- 33 | 34 | >>> RUN cd osmo-pcap && \ 35 | >>> git fetch && git checkout $OSMO_PCAP_BRANCH && \ 36 | >>> (git symbolic-ref -q HEAD && git reset --hard origin/$OSMO_PCAP_BRANCH || exit 1); \ 37 | >>> git rev-parse --abbrev-ref HEAD && git rev-parse HEAD && \ 38 | >>> autoreconf -fi && \ 39 | >>> ./configure && \ 40 | >>> make "-j$(nproc)" install 41 | -------------------- ERROR: failed to solve: process "/bin/sh -c cd osmo-pcap && \tgit fetch && git checkout $OSMO_PCAP_BRANCH && \t(git symbolic-ref -q HEAD && git reset --hard origin/$OSMO_PCAP_BRANCH || exit 1); \tgit rev-parse --abbrev-ref HEAD && git rev-parse HEAD && \tautoreconf -fi && \t./configure && \tmake "-j$(nproc)" install" did not complete successfully: exit code: 1 make: *** [../make/Makefile:95: docker-build] Error 1 make: Leaving directory 'https://jenkins.osmocom.org/jenkins/job/TTCN3-centos7-pcap-client-test/ws/osmo-pcap-master' + exit 1 Build step 'Execute shell' marked build as failure Recording test results ERROR: Step ‘Publish JUnit test result report’ failed: No test report files were found. Configuration error?
See https://jenkins.osmocom.org/jenkins/job/TTCN3-centos7-pcap-client-test/1137/display/redirect
Changes:
------------------------------------------ [...truncated 11.44 KiB...] + [ -n ] + echo master + make -C ../osmo-pcap-master BUILD_ARGS= UPSTREAM_DISTRO=centos:centos7 DISTRO=centos7 IMAGE=osmocom-build/osmo-pcap-master-centos7 OSMO_TTCN3_BRANCH=master make: Entering directory 'https://jenkins.osmocom.org/jenkins/job/TTCN3-centos7-pcap-client-test/ws/osmo-pcap-master' awk: fatal: cannot open file `.release' for reading: No such file or directory awk: fatal: cannot open file `.release' for reading: No such file or directory awk: fatal: cannot open file `.release' for reading: No such file or directory rm -rf .common cp -r https://jenkins.osmocom.org/jenkins/job/TTCN3-centos7-pcap-client-test/ws/common .common INFO: .release created release=0.0.0 docker build \ --build-arg USER=osmocom-build \ --build-arg UID=1000 \ --build-arg REGISTRY=registry.osmocom.org \ --build-arg OSMO_TTCN3_BRANCH=master \ --build-arg UPSTREAM_DISTRO=centos:centos7 \ --build-arg DISTRO=centos7 \ --build-arg OSMOCOM_REPO_MIRROR=https://downloads.osmocom.org \ --build-arg OSMOCOM_REPO_PATH=packages/osmocom: \ --build-arg OSMOCOM_REPO_VERSION=latest \ --build-arg OSMOCOM_REPO_TESTSUITE_MIRROR=https://downloads.osmocom.org \ --build-arg ASTERISK_BRANCH=sysmocom/20.7.0 \ --build-arg LIBOSMOCORE_BRANCH=master \ --build-arg OSMO_BB_BRANCH=master \ --build-arg OSMO_BSC_BRANCH=master \ --build-arg OSMO_BTS_BRANCH=master \ --build-arg OSMO_CBC_BRANCH=master \ --build-arg OSMO_DIA2GSUP_BRANCH=master \ --build-arg OSMO_EPDG_BRANCH=master \ --build-arg OSMO_GBPROXY_BRANCH=master \ --build-arg OSMO_GGSN_BRANCH=master \ --build-arg OSMO_GSM_TESTER_BRANCH=master \ --build-arg OSMO_HLR_BRANCH=master \ --build-arg OSMO_HNBGW_BRANCH=master \ --build-arg OSMO_HNODEB_BRANCH=master \ --build-arg OSMO_IUH_BRANCH=master \ --build-arg OSMO_MGW_BRANCH=master \ --build-arg OSMO_MSC_BRANCH=master \ --build-arg OSMO_NITB_BRANCH=master \ --build-arg OSMO_PCU_BRANCH=master \ --build-arg OSMO_REMSIM_BRANCH=master \ --build-arg OSMO_SGSN_BRANCH=master \ --build-arg OSMO_SIP_BRANCH=master \ --build-arg OSMO_STP_BRANCH=master \ --build-arg OSMO_UECUPS_BRANCH=master \ --build-arg OPEN5GS_BRANCH=main \ --build-arg PJPROJECT_BRANCH=sysmocom/2.14 \ -t osmocom-build/osmo-pcap-master-centos7:latest . #0 building with "default" instance using docker driver
#1 [internal] load build definition from Dockerfile #1 transferring dockerfile: 1.30kB done #1 WARN: InvalidDefaultArgInFrom: Default value for ARG $USER/$DISTRO-build results in empty or invalid base image name (line 3) #1 DONE 0.0s
#2 [internal] load metadata for docker.io/osmocom-build/centos7-build:latest #2 DONE 0.0s
#3 [internal] load .dockerignore #3 transferring context: 2B done #3 DONE 0.0s
#4 [internal] load build context #4 DONE 0.0s
#5 [1/8] FROM docker.io/osmocom-build/centos7-build:latest #5 DONE 0.0s
#6 [5/8] ADD HTTPS://GERRIT.OSMOCOM.ORG/PLUGINS/GITILES/OSMO-PCAP/+/MASTER?FORMAT=TEXT /tmp/commit-osmo-pcap #6 DONE 0.1s
#6 [5/8] ADD HTTPS://GERRIT.OSMOCOM.ORG/PLUGINS/GITILES/OSMO-PCAP/+/MASTER?FORMAT=TEXT /tmp/commit-osmo-pcap #6 DONE 0.1s
#7 [2/8] RUN CASE "centos7" in debian*) apt-get update && apt-get install -y --no-install-recommends libosmocore-dev libzmq3-dev && apt-get clean ;; centos*) dnf install -y "pkgconfig(libosmocore)" "pkgconfig(libosmoctrl)" "pkgconfig(libosmogb)" "pkgconfig(libosmogsm)" "pkgconfig(libosmovty)" "pkgconfig(libzmq)" ;; esac #7 CACHED
#8 [3/8] WORKDIR /TMP #8 CACHED
#9 [4/8] RUN GIT clone https://gerrit.osmocom.org/osmo-pcap.git #9 CACHED
#4 [internal] load build context #4 transferring context: 251B done #4 DONE 0.0s
#10 [5/8] ADD HTTPS://GERRIT.OSMOCOM.ORG/PLUGINS/GITILES/OSMO-PCAP/+/MASTER?FORMAT=TEXT /tmp/commit-osmo-pcap #10 DONE 0.2s
#11 [6/8] RUN CD osmo-pcap && git fetch && git checkout master && (git symbolic-ref -q HEAD && git reset --hard origin/master || exit 1); git rev-parse --abbrev-ref HEAD && git rev-parse HEAD && autoreconf -fi && ./configure && make "-j$(nproc)" install #11 0.515 From https://gerrit.osmocom.org/osmo-pcap #11 0.515 4bf57c2..f9eedab master -> origin/master #11 0.516 + b69c374...5d4281d pespin/io -> origin/pespin/io (forced update) #11 0.516 + f079862...bae4b2d pespin/tls -> origin/pespin/tls (forced update) #11 0.549 Already on 'master' #11 0.550 Your branch is behind 'origin/master' by 1 commit, and can be fast-forwarded. #11 0.550 (use "git pull" to update your local branch) #11 0.553 refs/heads/master #11 0.570 HEAD is now at f9eedab server: Correct error check calling osmo_pcap_conn_process_data() #11 0.574 master #11 0.577 f9eedab949e5fd7dcfba728c5d525a0f9d6c4f27 #11 3.328 libtoolize: putting auxiliary files in `.'. #11 3.328 libtoolize: copying file `./ltmain.sh' #11 3.665 libtoolize: Consider adding `AC_CONFIG_MACRO_DIR([m4])' to configure.ac and #11 3.665 libtoolize: rerunning libtoolize, to keep the correct libtool macros in-tree. #11 3.665 libtoolize: Consider adding `-I m4' to ACLOCAL_AMFLAGS in Makefile.am. #11 3.669 libtoolize: `AC_PROG_RANLIB' is rendered obsolete by `LT_INIT' #11 5.853 configure.ac:63: installing './config.guess' #11 5.857 configure.ac:63: installing './config.sub' #11 5.861 configure.ac:6: installing './install-sh' #11 5.865 configure.ac:6: installing './missing' #11 5.975 src/Makefile.am: installing './depcomp' #11 6.058 checking for a BSD-compatible install... /usr/bin/install -c #11 6.067 checking whether build environment is sane... yes #11 6.087 checking for a thread-safe mkdir -p... /usr/bin/mkdir -p #11 6.092 checking for gawk... gawk #11 6.093 checking whether make sets $(MAKE)... yes #11 6.115 checking whether make supports nested variables... yes #11 6.130 checking whether make supports nested variables... (cached) yes #11 6.131 checking whether make sets $(MAKE)... (cached) yes #11 6.136 checking for gcc... gcc #11 6.184 checking whether the C compiler works... yes #11 6.262 checking for C compiler default output file name... a.out #11 6.263 checking for suffix of executables... #11 6.283 checking whether we are cross compiling... no #11 6.329 checking for suffix of object files... o #11 6.361 checking whether we are using the GNU C compiler... yes #11 6.409 checking whether gcc accepts -g... yes #11 6.436 checking for gcc option to accept ISO C89... none needed #11 6.457 checking for style of include used by make... GNU #11 6.461 checking dependency style of gcc... gcc3 #11 6.501 checking for ranlib... ranlib #11 6.520 checking build system type... x86_64-unknown-linux-gnu #11 6.631 checking host system type... x86_64-unknown-linux-gnu #11 6.633 checking how to print strings... printf #11 6.638 checking for a sed that does not truncate output... /usr/bin/sed #11 6.650 checking for grep that handles long lines and -e... /usr/bin/grep #11 6.655 checking for egrep... /usr/bin/grep -E #11 6.659 checking for fgrep... /usr/bin/grep -F #11 6.663 checking for ld used by gcc... /usr/bin/ld #11 6.674 checking if the linker (/usr/bin/ld) is GNU ld... yes #11 6.679 checking for BSD- or MS-compatible name lister (nm)... /usr/bin/nm -B #11 6.686 checking the name lister (/usr/bin/nm -B) interface... BSD nm #11 6.719 checking whether ln -s works... yes #11 6.719 checking the maximum length of command line arguments... 1572864 #11 6.729 checking whether the shell understands some XSI constructs... yes #11 6.730 checking whether the shell understands "+="... yes #11 6.739 checking how to convert x86_64-unknown-linux-gnu file names to x86_64-unknown-linux-gnu format... func_convert_file_noop #11 6.739 checking how to convert x86_64-unknown-linux-gnu file names to toolchain format... func_convert_file_noop #11 6.739 checking for /usr/bin/ld option to reload object files... -r #11 6.740 checking for objdump... objdump #11 6.741 checking how to recognize dependent libraries... pass_all #11 6.743 checking for dlltool... no #11 6.744 checking how to associate runtime and link libraries... printf %s\n #11 6.745 checking for ar... ar #11 6.745 checking for archiver @FILE support... @ #11 6.799 checking for strip... strip #11 6.800 checking for ranlib... (cached) ranlib #11 6.801 checking command to parse /usr/bin/nm -B output from gcc object... ok #11 6.924 checking for sysroot... no #11 6.937 ./configure: line 6418: /usr/bin/file: No such file or directory #11 6.940 checking for mt... no #11 6.941 checking if : is a manifest tool... no #11 6.951 checking how to run the C preprocessor... gcc -E #11 7.045 checking for ANSI C header files... yes #11 7.175 checking for sys/types.h... yes #11 7.227 checking for sys/stat.h... yes #11 7.266 checking for stdlib.h... yes #11 7.305 checking for string.h... yes #11 7.343 checking for memory.h... yes #11 7.383 checking for strings.h... yes #11 7.421 checking for inttypes.h... yes #11 7.452 checking for stdint.h... yes #11 7.481 checking for unistd.h... yes #11 7.521 checking for dlfcn.h... yes #11 7.549 checking for objdir... .libs #11 7.623 checking if gcc supports -fno-rtti -fno-exceptions... no #11 7.644 checking for gcc option to produce PIC... -fPIC -DPIC #11 7.644 checking if gcc PIC flag -fPIC -DPIC works... yes #11 7.683 checking if gcc static flag -static works... no #11 7.719 checking if gcc supports -c -o file.o... yes #11 7.785 checking if gcc supports -c -o file.o... (cached) yes #11 7.785 checking whether the gcc linker (/usr/bin/ld) supports shared libraries... yes #11 7.804 checking whether -lc should be explicitly linked in... no #11 7.864 checking dynamic linker characteristics... GNU/Linux ld.so #11 7.944 checking how to hardcode library paths into programs... immediate #11 7.944 checking whether stripping libraries is possible... yes #11 7.947 checking if libtool supports shared libraries... yes #11 7.947 checking whether to build shared libraries... yes #11 7.947 checking whether to build static libraries... yes #11 7.948 checking for pkg-config... /usr/bin/pkg-config #11 7.949 checking for pkg-config... /usr/bin/pkg-config #11 7.950 checking pkg-config is at least version 0.20... yes #11 7.954 checking for ANSI C header files... (cached) yes #11 7.962 checking whether to enable VTY tests... no #11 7.963 checking for pcap-config... /usr/bin/pcap-config #11 7.971 checking for LIBOSMOCORE... yes #11 7.993 checking for LIBOSMOGB... yes #11 8.016 checking for LIBOSMOGSM... yes #11 8.037 checking for LIBOSMOVTY... yes #11 8.059 checking for LIBOSMONETIF... no #11 8.076 configure: error: Package requirements (libosmo-netif >= 1.5.0) were not met: #11 8.076 #11 8.076 No package 'libosmo-netif' found #11 8.076 #11 8.076 Consider adjusting the PKG_CONFIG_PATH environment variable if you #11 8.076 installed software in a non-standard prefix. #11 8.076 #11 8.076 Alternatively, you may set the environment variables LIBOSMONETIF_CFLAGS #11 8.076 and LIBOSMONETIF_LIBS to avoid the need to call pkg-config. #11 8.076 See the pkg-config man page for more details. #11 ERROR: process "/bin/sh -c cd osmo-pcap && \tgit fetch && git checkout $OSMO_PCAP_BRANCH && \t(git symbolic-ref -q HEAD && git reset --hard origin/$OSMO_PCAP_BRANCH || exit 1); \tgit rev-parse --abbrev-ref HEAD && git rev-parse HEAD && \tautoreconf -fi && \t./configure && \tmake "-j$(nproc)" install" did not complete successfully: exit code: 1 ------
[6/8] RUN CD osmo-pcap && git fetch && git checkout master && (git symbolic-ref -q HEAD && git reset --hard origin/master || exit 1); git rev-parse --abbrev-ref HEAD && git rev-parse HEAD && autoreconf -fi && ./configure && make "-j$(nproc)" install:
8.076 configure: error: Package requirements (libosmo-netif >= 1.5.0) were not met: 8.076 8.076 No package 'libosmo-netif' found 8.076 8.076 Consider adjusting the PKG_CONFIG_PATH environment variable if you 8.076 installed software in a non-standard prefix. 8.076 8.076 Alternatively, you may set the environment variables LIBOSMONETIF_CFLAGS 8.076 and LIBOSMONETIF_LIBS to avoid the need to call pkg-config. 8.076 See the pkg-config man page for more details. ------
[33m1 warning found (use docker --debug to expand): [0m - InvalidDefaultArgInFrom: Default value for ARG $USER/$DISTRO-build results in empty or invalid base image name (line 3) Dockerfile:34 -------------------- 33 | 34 | >>> RUN cd osmo-pcap && \ 35 | >>> git fetch && git checkout $OSMO_PCAP_BRANCH && \ 36 | >>> (git symbolic-ref -q HEAD && git reset --hard origin/$OSMO_PCAP_BRANCH || exit 1); \ 37 | >>> git rev-parse --abbrev-ref HEAD && git rev-parse HEAD && \ 38 | >>> autoreconf -fi && \ 39 | >>> ./configure && \ 40 | >>> make "-j$(nproc)" install 41 | -------------------- ERROR: failed to solve: process "/bin/sh -c cd osmo-pcap && \tgit fetch && git checkout $OSMO_PCAP_BRANCH && \t(git symbolic-ref -q HEAD && git reset --hard origin/$OSMO_PCAP_BRANCH || exit 1); \tgit rev-parse --abbrev-ref HEAD && git rev-parse HEAD && \tautoreconf -fi && \t./configure && \tmake "-j$(nproc)" install" did not complete successfully: exit code: 1 make: *** [../make/Makefile:95: docker-build] Error 1 make: Leaving directory 'https://jenkins.osmocom.org/jenkins/job/TTCN3-centos7-pcap-client-test/ws/osmo-pcap-master' + exit 1 Build step 'Execute shell' marked build as failure Recording test results ERROR: Step ‘Publish JUnit test result report’ failed: No test report files were found. Configuration error?
See https://jenkins.osmocom.org/jenkins/job/TTCN3-centos7-pcap-client-test/1138/display/redirect
Changes:
------------------------------------------ [...truncated 22.58 KiB...] #7 8.009 Running transaction #7 12.95 Preparing : 1/1 #7 12.98 Installing : osmocom-nightly-202501191809-1.1.x86_64 1/23 #7 13.12 Installing : libmnl-1.0.5-7.1.x86_64 2/23 #7 13.36 Installing : libosmocore22-1.10.0.60.cf0a5.202501191809-1.1.x86 3/23 #7 13.47 Running scriptlet: libosmocore22-1.10.0.60.cf0a5.202501191809-1.1.x86 3/23 #7 13.63 Installing : libosmoisdn0-1.10.0.60.cf0a5.202501191809-1.1.x86_ 4/23 #7 13.77 Running scriptlet: libosmoisdn0-1.10.0.60.cf0a5.202501191809-1.1.x86_ 4/23 #7 13.93 Installing : libosmogsm20-1.10.0.60.cf0a5.202501191809-1.1.x86_ 5/23 #7 14.06 Running scriptlet: libosmogsm20-1.10.0.60.cf0a5.202501191809-1.1.x86_ 5/23 #7 14.21 Installing : libosmovty13-1.10.0.60.cf0a5.202501191809-1.1.x86_ 6/23 #7 14.34 Running scriptlet: libosmovty13-1.10.0.60.cf0a5.202501191809-1.1.x86_ 6/23 #7 14.48 Installing : libunwind-2:1.2-2.el7.x86_64 7/23 #7 14.75 Running scriptlet: libunwind-2:1.2-2.el7.x86_64 7/23 #7 14.98 Installing : libsodium23-1.0.18-2.1.x86_64 8/23 #7 15.08 Running scriptlet: libsodium23-1.0.18-2.1.x86_64 8/23 #7 15.22 Installing : libpgm-5_2-0-5.2.122-3.1.x86_64 9/23 #7 15.36 Running scriptlet: libpgm-5_2-0-5.2.122-3.1.x86_64 9/23 #7 15.52 Installing : libzmq5-4.3.5-1.1.x86_64 10/23 #7 15.70 Running scriptlet: libzmq5-4.3.5-1.1.x86_64 10/23 #7 15.80 Installing : openpgm-devel-5.2.122-3.1.x86_64 11/23 #7 16.01 Installing : libsodium-devel-1.0.18-2.1.x86_64 12/23 #7 16.32 Installing : libunwind-devel-2:1.2-2.el7.x86_64 13/23 #7 16.53 Installing : libosmoctrl0-1.10.0.60.cf0a5.202501191809-1.1.x86_ 14/23 #7 16.69 Running scriptlet: libosmoctrl0-1.10.0.60.cf0a5.202501191809-1.1.x86_ 14/23 #7 16.85 Installing : libosmogb14-1.10.0.60.cf0a5.202501191809-1.1.x86_6 15/23 #7 16.98 Running scriptlet: libosmogb14-1.10.0.60.cf0a5.202501191809-1.1.x86_6 15/23 #7 17.11 Installing : libmnl-devel-1.0.5-7.1.x86_64 16/23 #7 17.58 Installing : libosmocore-devel-1.10.0.60.cf0a5.202501191809-1.1 17/23 #7 17.80 Installing : libosmoisdn-devel-1.10.0.60.cf0a5.202501191809-1.1 18/23 #7 18.08 Installing : libosmogsm-devel-1.10.0.60.cf0a5.202501191809-1.1. 19/23 #7 18.29 Installing : libosmovty-devel-1.10.0.60.cf0a5.202501191809-1.1. 20/23 #7 18.55 Installing : libosmogb-devel-1.10.0.60.cf0a5.202501191809-1.1.x 21/23 #7 18.79 Installing : libosmoctrl-devel-1.10.0.60.cf0a5.202501191809-1.1 22/23 #7 19.24 Installing : zeromq-devel-4.3.5-1.1.x86_64 23/23 #7 19.55 Verifying : libmnl-1.0.5-7.1.x86_64 1/23 #7 19.55 Verifying : libmnl-devel-1.0.5-7.1.x86_64 2/23 #7 19.55 Verifying : libosmocore-devel-1.10.0.60.cf0a5.202501191809-1.1 3/23 #7 19.55 Verifying : libosmocore22-1.10.0.60.cf0a5.202501191809-1.1.x86 4/23 #7 19.55 Verifying : libosmoctrl-devel-1.10.0.60.cf0a5.202501191809-1.1 5/23 #7 19.55 Verifying : libosmoctrl0-1.10.0.60.cf0a5.202501191809-1.1.x86_ 6/23 #7 19.55 Verifying : libosmogb-devel-1.10.0.60.cf0a5.202501191809-1.1.x 7/23 #7 19.55 Verifying : libosmogb14-1.10.0.60.cf0a5.202501191809-1.1.x86_6 8/23 #7 19.55 Verifying : libosmogsm-devel-1.10.0.60.cf0a5.202501191809-1.1. 9/23 #7 19.55 Verifying : libosmogsm20-1.10.0.60.cf0a5.202501191809-1.1.x86_ 10/23 #7 19.55 Verifying : libosmoisdn-devel-1.10.0.60.cf0a5.202501191809-1.1 11/23 #7 19.55 Verifying : libosmoisdn0-1.10.0.60.cf0a5.202501191809-1.1.x86_ 12/23 #7 19.55 Verifying : libosmovty-devel-1.10.0.60.cf0a5.202501191809-1.1. 13/23 #7 19.55 Verifying : libosmovty13-1.10.0.60.cf0a5.202501191809-1.1.x86_ 14/23 #7 19.55 Verifying : libpgm-5_2-0-5.2.122-3.1.x86_64 15/23 #7 19.55 Verifying : libsodium-devel-1.0.18-2.1.x86_64 16/23 #7 19.55 Verifying : libsodium23-1.0.18-2.1.x86_64 17/23 #7 19.55 Verifying : libzmq5-4.3.5-1.1.x86_64 18/23 #7 19.55 Verifying : openpgm-devel-5.2.122-3.1.x86_64 19/23 #7 19.55 Verifying : osmocom-nightly-202501191809-1.1.x86_64 20/23 #7 19.55 Verifying : zeromq-devel-4.3.5-1.1.x86_64 21/23 #7 19.55 Verifying : libunwind-2:1.2-2.el7.x86_64 22/23 #7 19.55 Verifying : libunwind-devel-2:1.2-2.el7.x86_64 23/23 #7 22.01 #7 22.01 Installed: #7 22.01 libosmocore-devel-1.10.0.60.cf0a5.202501191809-1.1.x86_64 #7 22.01 libosmoctrl-devel-1.10.0.60.cf0a5.202501191809-1.1.x86_64 #7 22.01 libosmogb-devel-1.10.0.60.cf0a5.202501191809-1.1.x86_64 #7 22.01 libosmogsm-devel-1.10.0.60.cf0a5.202501191809-1.1.x86_64 #7 22.01 libosmovty-devel-1.10.0.60.cf0a5.202501191809-1.1.x86_64 #7 22.01 zeromq-devel-4.3.5-1.1.x86_64 #7 22.01 libmnl-1.0.5-7.1.x86_64 #7 22.01 libmnl-devel-1.0.5-7.1.x86_64 #7 22.01 libosmocore22-1.10.0.60.cf0a5.202501191809-1.1.x86_64 #7 22.01 libosmoctrl0-1.10.0.60.cf0a5.202501191809-1.1.x86_64 #7 22.01 libosmogb14-1.10.0.60.cf0a5.202501191809-1.1.x86_64 #7 22.01 libosmogsm20-1.10.0.60.cf0a5.202501191809-1.1.x86_64 #7 22.01 libosmoisdn-devel-1.10.0.60.cf0a5.202501191809-1.1.x86_64 #7 22.01 libosmoisdn0-1.10.0.60.cf0a5.202501191809-1.1.x86_64 #7 22.01 libosmovty13-1.10.0.60.cf0a5.202501191809-1.1.x86_64 #7 22.01 libpgm-5_2-0-5.2.122-3.1.x86_64 #7 22.01 libsodium-devel-1.0.18-2.1.x86_64 #7 22.01 libsodium23-1.0.18-2.1.x86_64 #7 22.01 libzmq5-4.3.5-1.1.x86_64 #7 22.01 openpgm-devel-5.2.122-3.1.x86_64 #7 22.01 osmocom-nightly-202501191809-1.1.x86_64 #7 22.01 libunwind-2:1.2-2.el7.x86_64 #7 22.01 libunwind-devel-2:1.2-2.el7.x86_64 #7 22.01 #7 22.01 Complete! #7 DONE 26.6s
#8 [3/8] WORKDIR /TMP #8 DONE 0.6s
#9 [4/8] RUN GIT clone https://gerrit.osmocom.org/osmo-pcap.git #9 0.727 Cloning into 'osmo-pcap'... #9 DONE 1.2s
#10 [5/8] ADD HTTPS://GERRIT.OSMOCOM.ORG/PLUGINS/GITILES/OSMO-PCAP/+/MASTER?FORMAT=TEXT /tmp/commit-osmo-pcap #10 DONE 0.4s
#11 [6/8] RUN CD osmo-pcap && git fetch && git checkout master && (git symbolic-ref -q HEAD && git reset --hard origin/master || exit 1); git rev-parse --abbrev-ref HEAD && git rev-parse HEAD && autoreconf -fi && ./configure && make "-j$(nproc)" install #11 0.925 Already on 'master' #11 0.927 refs/heads/master #11 0.930 HEAD is now at f9eedab server: Correct error check calling osmo_pcap_conn_process_data() #11 0.932 master #11 0.933 f9eedab949e5fd7dcfba728c5d525a0f9d6c4f27 #11 6.374 libtoolize: putting auxiliary files in `.'. #11 6.374 libtoolize: copying file `./ltmain.sh' #11 6.537 libtoolize: Consider adding `AC_CONFIG_MACRO_DIR([m4])' to configure.ac and #11 6.537 libtoolize: rerunning libtoolize, to keep the correct libtool macros in-tree. #11 6.537 libtoolize: Consider adding `-I m4' to ACLOCAL_AMFLAGS in Makefile.am. #11 6.538 libtoolize: `AC_PROG_RANLIB' is rendered obsolete by `LT_INIT' #11 9.539 configure.ac:63: installing './config.guess' #11 9.540 configure.ac:63: installing './config.sub' #11 9.542 configure.ac:6: installing './install-sh' #11 9.543 configure.ac:6: installing './missing' #11 9.676 src/Makefile.am: installing './depcomp' #11 9.765 checking for a BSD-compatible install... /usr/bin/install -c #11 9.769 checking whether build environment is sane... yes #11 9.773 checking for a thread-safe mkdir -p... /usr/bin/mkdir -p #11 9.774 checking for gawk... gawk #11 9.774 checking whether make sets $(MAKE)... yes #11 9.779 checking whether make supports nested variables... yes #11 9.783 checking whether make supports nested variables... (cached) yes #11 9.783 checking whether make sets $(MAKE)... (cached) yes #11 9.784 checking for gcc... gcc #11 9.793 checking whether the C compiler works... yes #11 9.847 checking for C compiler default output file name... a.out #11 9.848 checking for suffix of executables... #11 9.917 checking whether we are cross compiling... no #11 9.936 checking for suffix of object files... o #11 9.946 checking whether we are using the GNU C compiler... yes #11 9.957 checking whether gcc accepts -g... yes #11 9.966 checking for gcc option to accept ISO C89... none needed #11 9.979 checking for style of include used by make... GNU #11 9.981 checking dependency style of gcc... gcc3 #11 9.999 checking for ranlib... ranlib #11 10.00 checking build system type... x86_64-unknown-linux-gnu #11 10.03 checking host system type... x86_64-unknown-linux-gnu #11 10.03 checking how to print strings... printf #11 10.03 checking for a sed that does not truncate output... /usr/bin/sed #11 10.03 checking for grep that handles long lines and -e... /usr/bin/grep #11 10.03 checking for egrep... /usr/bin/grep -E #11 10.03 checking for fgrep... /usr/bin/grep -F #11 10.03 checking for ld used by gcc... /usr/bin/ld #11 10.03 checking if the linker (/usr/bin/ld) is GNU ld... yes #11 10.04 checking for BSD- or MS-compatible name lister (nm)... /usr/bin/nm -B #11 10.04 checking the name lister (/usr/bin/nm -B) interface... BSD nm #11 10.05 checking whether ln -s works... yes #11 10.05 checking the maximum length of command line arguments... 1572864 #11 10.05 checking whether the shell understands some XSI constructs... yes #11 10.05 checking whether the shell understands "+="... yes #11 10.05 checking how to convert x86_64-unknown-linux-gnu file names to x86_64-unknown-linux-gnu format... func_convert_file_noop #11 10.05 checking how to convert x86_64-unknown-linux-gnu file names to toolchain format... func_convert_file_noop #11 10.05 checking for /usr/bin/ld option to reload object files... -r #11 10.05 checking for objdump... objdump #11 10.05 checking how to recognize dependent libraries... pass_all #11 10.05 checking for dlltool... no #11 10.05 checking how to associate runtime and link libraries... printf %s\n #11 10.06 checking for ar... ar #11 10.06 checking for archiver @FILE support... @ #11 10.07 checking for strip... strip #11 10.07 checking for ranlib... (cached) ranlib #11 10.07 checking command to parse /usr/bin/nm -B output from gcc object... ok #11 10.10 checking for sysroot... no #11 10.11 ./configure: line 6418: /usr/bin/file: No such file or directory #11 10.11 checking for mt... no #11 10.11 checking if : is a manifest tool... no #11 10.12 checking how to run the C preprocessor... gcc -E #11 10.14 checking for ANSI C header files... yes #11 10.20 checking for sys/types.h... yes #11 10.22 checking for sys/stat.h... yes #11 10.23 checking for stdlib.h... yes #11 10.25 checking for string.h... yes #11 10.26 checking for memory.h... yes #11 10.28 checking for strings.h... yes #11 10.30 checking for inttypes.h... yes #11 10.32 checking for stdint.h... yes #11 10.34 checking for unistd.h... yes #11 10.35 checking for dlfcn.h... yes #11 10.37 checking for objdir... .libs #11 10.45 checking if gcc supports -fno-rtti -fno-exceptions... no #11 10.48 checking for gcc option to produce PIC... -fPIC -DPIC #11 10.48 checking if gcc PIC flag -fPIC -DPIC works... yes #11 10.50 checking if gcc static flag -static works... no #11 10.52 checking if gcc supports -c -o file.o... yes #11 10.54 checking if gcc supports -c -o file.o... (cached) yes #11 10.54 checking whether the gcc linker (/usr/bin/ld) supports shared libraries... yes #11 10.54 checking whether -lc should be explicitly linked in... no #11 10.57 checking dynamic linker characteristics... GNU/Linux ld.so #11 10.60 checking how to hardcode library paths into programs... immediate #11 10.60 checking whether stripping libraries is possible... yes #11 10.61 checking if libtool supports shared libraries... yes #11 10.61 checking whether to build shared libraries... yes #11 10.61 checking whether to build static libraries... yes #11 10.61 checking for pkg-config... /usr/bin/pkg-config #11 10.61 checking for pkg-config... /usr/bin/pkg-config #11 10.61 checking pkg-config is at least version 0.20... yes #11 10.61 checking for ANSI C header files... (cached) yes #11 10.61 checking whether to enable VTY tests... no #11 10.61 checking for pcap-config... /usr/bin/pcap-config #11 10.61 checking for LIBOSMOCORE... yes #11 10.62 checking for LIBOSMOGB... yes #11 10.62 checking for LIBOSMOGSM... yes #11 10.63 checking for LIBOSMOVTY... yes #11 10.63 checking for LIBOSMONETIF... no #11 10.64 configure: error: Package requirements (libosmo-netif >= 1.5.0) were not met: #11 10.64 #11 10.64 No package 'libosmo-netif' found #11 10.64 #11 10.64 Consider adjusting the PKG_CONFIG_PATH environment variable if you #11 10.64 installed software in a non-standard prefix. #11 10.64 #11 10.64 Alternatively, you may set the environment variables LIBOSMONETIF_CFLAGS #11 10.64 and LIBOSMONETIF_LIBS to avoid the need to call pkg-config. #11 10.64 See the pkg-config man page for more details. #11 ERROR: process "/bin/sh -c cd osmo-pcap && \tgit fetch && git checkout $OSMO_PCAP_BRANCH && \t(git symbolic-ref -q HEAD && git reset --hard origin/$OSMO_PCAP_BRANCH || exit 1); \tgit rev-parse --abbrev-ref HEAD && git rev-parse HEAD && \tautoreconf -fi && \t./configure && \tmake "-j$(nproc)" install" did not complete successfully: exit code: 1 ------
[6/8] RUN CD osmo-pcap && git fetch && git checkout master && (git symbolic-ref -q HEAD && git reset --hard origin/master || exit 1); git rev-parse --abbrev-ref HEAD && git rev-parse HEAD && autoreconf -fi && ./configure && make "-j$(nproc)" install:
10.64 configure: error: Package requirements (libosmo-netif >= 1.5.0) were not met: 10.64 10.64 No package 'libosmo-netif' found 10.64 10.64 Consider adjusting the PKG_CONFIG_PATH environment variable if you 10.64 installed software in a non-standard prefix. 10.64 10.64 Alternatively, you may set the environment variables LIBOSMONETIF_CFLAGS 10.64 and LIBOSMONETIF_LIBS to avoid the need to call pkg-config. 10.64 See the pkg-config man page for more details. ------
[33m1 warning found (use docker --debug to expand): [0m - InvalidDefaultArgInFrom: Default value for ARG $USER/$DISTRO-build results in empty or invalid base image name (line 3) Dockerfile:34 -------------------- 33 | 34 | >>> RUN cd osmo-pcap && \ 35 | >>> git fetch && git checkout $OSMO_PCAP_BRANCH && \ 36 | >>> (git symbolic-ref -q HEAD && git reset --hard origin/$OSMO_PCAP_BRANCH || exit 1); \ 37 | >>> git rev-parse --abbrev-ref HEAD && git rev-parse HEAD && \ 38 | >>> autoreconf -fi && \ 39 | >>> ./configure && \ 40 | >>> make "-j$(nproc)" install 41 | -------------------- ERROR: failed to solve: process "/bin/sh -c cd osmo-pcap && \tgit fetch && git checkout $OSMO_PCAP_BRANCH && \t(git symbolic-ref -q HEAD && git reset --hard origin/$OSMO_PCAP_BRANCH || exit 1); \tgit rev-parse --abbrev-ref HEAD && git rev-parse HEAD && \tautoreconf -fi && \t./configure && \tmake "-j$(nproc)" install" did not complete successfully: exit code: 1 make: *** [../make/Makefile:95: docker-build] Error 1 make: Leaving directory 'https://jenkins.osmocom.org/jenkins/job/TTCN3-centos7-pcap-client-test/ws/osmo-pcap-master' + exit 1 Build step 'Execute shell' marked build as failure Recording test results ERROR: Step ‘Publish JUnit test result report’ failed: No test report files were found. Configuration error?
See https://jenkins.osmocom.org/jenkins/job/TTCN3-centos7-pcap-client-test/1139/display/redirect
Changes:
------------------------------------------ [...truncated 21.73 KiB...] #7 2.818 Running transaction #7 4.650 Preparing : 1/1 #7 4.660 Installing : osmocom-nightly-202501192026-1.1.x86_64 1/23 #7 4.694 Installing : libmnl-1.0.5-7.1.x86_64 2/23 #7 4.752 Installing : libosmocore22-1.10.0.60.cf0a5.202501192026-1.1.x86 3/23 #7 4.789 Running scriptlet: libosmocore22-1.10.0.60.cf0a5.202501192026-1.1.x86 3/23 #7 4.829 Installing : libosmoisdn0-1.10.0.60.cf0a5.202501192026-1.1.x86_ 4/23 #7 4.872 Running scriptlet: libosmoisdn0-1.10.0.60.cf0a5.202501192026-1.1.x86_ 4/23 #7 4.926 Installing : libosmogsm20-1.10.0.60.cf0a5.202501192026-1.1.x86_ 5/23 #7 4.955 Running scriptlet: libosmogsm20-1.10.0.60.cf0a5.202501192026-1.1.x86_ 5/23 #7 4.989 Installing : libosmovty13-1.10.0.60.cf0a5.202501192026-1.1.x86_ 6/23 #7 5.020 Running scriptlet: libosmovty13-1.10.0.60.cf0a5.202501192026-1.1.x86_ 6/23 #7 5.064 Installing : libunwind-2:1.2-2.el7.x86_64 7/23 #7 5.094 Running scriptlet: libunwind-2:1.2-2.el7.x86_64 7/23 #7 5.133 Installing : libsodium23-1.0.18-2.1.x86_64 8/23 #7 5.178 Running scriptlet: libsodium23-1.0.18-2.1.x86_64 8/23 #7 5.230 Installing : libpgm-5_2-0-5.2.122-3.1.x86_64 9/23 #7 5.266 Running scriptlet: libpgm-5_2-0-5.2.122-3.1.x86_64 9/23 #7 5.312 Installing : libzmq5-4.3.5-1.1.x86_64 10/23 #7 5.348 Running scriptlet: libzmq5-4.3.5-1.1.x86_64 10/23 #7 5.380 Installing : openpgm-devel-5.2.122-3.1.x86_64 11/23 #7 5.443 Installing : libsodium-devel-1.0.18-2.1.x86_64 12/23 #7 5.513 Installing : libunwind-devel-2:1.2-2.el7.x86_64 13/23 #7 5.577 Installing : libosmoctrl0-1.10.0.60.cf0a5.202501192026-1.1.x86_ 14/23 #7 5.620 Running scriptlet: libosmoctrl0-1.10.0.60.cf0a5.202501192026-1.1.x86_ 14/23 #7 5.660 Installing : libosmogb14-1.10.0.60.cf0a5.202501192026-1.1.x86_6 15/23 #7 5.703 Running scriptlet: libosmogb14-1.10.0.60.cf0a5.202501192026-1.1.x86_6 15/23 #7 5.746 Installing : libmnl-devel-1.0.5-7.1.x86_64 16/23 #7 5.797 Installing : libosmocore-devel-1.10.0.60.cf0a5.202501192026-1.1 17/23 #7 5.851 Installing : libosmoisdn-devel-1.10.0.60.cf0a5.202501192026-1.1 18/23 #7 5.916 Installing : libosmogsm-devel-1.10.0.60.cf0a5.202501192026-1.1. 19/23 #7 5.967 Installing : libosmovty-devel-1.10.0.60.cf0a5.202501192026-1.1. 20/23 #7 6.020 Installing : libosmogb-devel-1.10.0.60.cf0a5.202501192026-1.1.x 21/23 #7 6.070 Installing : libosmoctrl-devel-1.10.0.60.cf0a5.202501192026-1.1 22/23 #7 6.185 Installing : zeromq-devel-4.3.5-1.1.x86_64 23/23 #7 6.257 Verifying : libmnl-1.0.5-7.1.x86_64 1/23 #7 6.257 Verifying : libmnl-devel-1.0.5-7.1.x86_64 2/23 #7 6.257 Verifying : libosmocore-devel-1.10.0.60.cf0a5.202501192026-1.1 3/23 #7 6.257 Verifying : libosmocore22-1.10.0.60.cf0a5.202501192026-1.1.x86 4/23 #7 6.257 Verifying : libosmoctrl-devel-1.10.0.60.cf0a5.202501192026-1.1 5/23 #7 6.257 Verifying : libosmoctrl0-1.10.0.60.cf0a5.202501192026-1.1.x86_ 6/23 #7 6.257 Verifying : libosmogb-devel-1.10.0.60.cf0a5.202501192026-1.1.x 7/23 #7 6.257 Verifying : libosmogb14-1.10.0.60.cf0a5.202501192026-1.1.x86_6 8/23 #7 6.257 Verifying : libosmogsm-devel-1.10.0.60.cf0a5.202501192026-1.1. 9/23 #7 6.257 Verifying : libosmogsm20-1.10.0.60.cf0a5.202501192026-1.1.x86_ 10/23 #7 6.257 Verifying : libosmoisdn-devel-1.10.0.60.cf0a5.202501192026-1.1 11/23 #7 6.257 Verifying : libosmoisdn0-1.10.0.60.cf0a5.202501192026-1.1.x86_ 12/23 #7 6.257 Verifying : libosmovty-devel-1.10.0.60.cf0a5.202501192026-1.1. 13/23 #7 6.257 Verifying : libosmovty13-1.10.0.60.cf0a5.202501192026-1.1.x86_ 14/23 #7 6.257 Verifying : libpgm-5_2-0-5.2.122-3.1.x86_64 15/23 #7 6.257 Verifying : libsodium-devel-1.0.18-2.1.x86_64 16/23 #7 6.257 Verifying : libsodium23-1.0.18-2.1.x86_64 17/23 #7 6.257 Verifying : libzmq5-4.3.5-1.1.x86_64 18/23 #7 6.257 Verifying : openpgm-devel-5.2.122-3.1.x86_64 19/23 #7 6.257 Verifying : osmocom-nightly-202501192026-1.1.x86_64 20/23 #7 6.257 Verifying : zeromq-devel-4.3.5-1.1.x86_64 21/23 #7 6.258 Verifying : libunwind-2:1.2-2.el7.x86_64 22/23 #7 6.258 Verifying : libunwind-devel-2:1.2-2.el7.x86_64 23/23 #7 7.050 #7 7.050 Installed: #7 7.050 libosmocore-devel-1.10.0.60.cf0a5.202501192026-1.1.x86_64 #7 7.050 libosmoctrl-devel-1.10.0.60.cf0a5.202501192026-1.1.x86_64 #7 7.050 libosmogb-devel-1.10.0.60.cf0a5.202501192026-1.1.x86_64 #7 7.050 libosmogsm-devel-1.10.0.60.cf0a5.202501192026-1.1.x86_64 #7 7.050 libosmovty-devel-1.10.0.60.cf0a5.202501192026-1.1.x86_64 #7 7.050 zeromq-devel-4.3.5-1.1.x86_64 #7 7.050 libmnl-1.0.5-7.1.x86_64 #7 7.050 libmnl-devel-1.0.5-7.1.x86_64 #7 7.050 libosmocore22-1.10.0.60.cf0a5.202501192026-1.1.x86_64 #7 7.050 libosmoctrl0-1.10.0.60.cf0a5.202501192026-1.1.x86_64 #7 7.050 libosmogb14-1.10.0.60.cf0a5.202501192026-1.1.x86_64 #7 7.050 libosmogsm20-1.10.0.60.cf0a5.202501192026-1.1.x86_64 #7 7.050 libosmoisdn-devel-1.10.0.60.cf0a5.202501192026-1.1.x86_64 #7 7.050 libosmoisdn0-1.10.0.60.cf0a5.202501192026-1.1.x86_64 #7 7.050 libosmovty13-1.10.0.60.cf0a5.202501192026-1.1.x86_64 #7 7.050 libpgm-5_2-0-5.2.122-3.1.x86_64 #7 7.050 libsodium-devel-1.0.18-2.1.x86_64 #7 7.050 libsodium23-1.0.18-2.1.x86_64 #7 7.050 libzmq5-4.3.5-1.1.x86_64 #7 7.050 openpgm-devel-5.2.122-3.1.x86_64 #7 7.050 osmocom-nightly-202501192026-1.1.x86_64 #7 7.050 libunwind-2:1.2-2.el7.x86_64 #7 7.050 libunwind-devel-2:1.2-2.el7.x86_64 #7 7.050 #7 7.050 Complete! #7 DONE 7.2s
#8 [3/8] WORKDIR /TMP #8 DONE 0.1s
#9 [4/8] RUN GIT clone https://gerrit.osmocom.org/osmo-pcap.git #9 0.348 Cloning into 'osmo-pcap'... #9 DONE 0.6s
#10 [5/8] ADD HTTPS://GERRIT.OSMOCOM.ORG/PLUGINS/GITILES/OSMO-PCAP/+/MASTER?FORMAT=TEXT /tmp/commit-osmo-pcap #10 DONE 0.1s
#11 [6/8] RUN CD osmo-pcap && git fetch && git checkout master && (git symbolic-ref -q HEAD && git reset --hard origin/master || exit 1); git rev-parse --abbrev-ref HEAD && git rev-parse HEAD && autoreconf -fi && ./configure && make "-j$(nproc)" install #11 0.453 Already on 'master' #11 0.454 refs/heads/master #11 0.463 HEAD is now at f9eedab server: Correct error check calling osmo_pcap_conn_process_data() #11 0.465 master #11 0.467 f9eedab949e5fd7dcfba728c5d525a0f9d6c4f27 #11 3.212 libtoolize: putting auxiliary files in `.'. #11 3.212 libtoolize: copying file `./ltmain.sh' #11 3.543 libtoolize: Consider adding `AC_CONFIG_MACRO_DIR([m4])' to configure.ac and #11 3.543 libtoolize: rerunning libtoolize, to keep the correct libtool macros in-tree. #11 3.543 libtoolize: Consider adding `-I m4' to ACLOCAL_AMFLAGS in Makefile.am. #11 3.546 libtoolize: `AC_PROG_RANLIB' is rendered obsolete by `LT_INIT' #11 5.696 configure.ac:63: installing './config.guess' #11 5.697 configure.ac:63: installing './config.sub' #11 5.698 configure.ac:6: installing './install-sh' #11 5.699 configure.ac:6: installing './missing' #11 5.797 src/Makefile.am: installing './depcomp' #11 5.872 checking for a BSD-compatible install... /usr/bin/install -c #11 5.879 checking whether build environment is sane... yes #11 5.896 checking for a thread-safe mkdir -p... /usr/bin/mkdir -p #11 5.901 checking for gawk... gawk #11 5.902 checking whether make sets $(MAKE)... yes #11 5.924 checking whether make supports nested variables... yes #11 5.940 checking whether make supports nested variables... (cached) yes #11 5.940 checking whether make sets $(MAKE)... (cached) yes #11 5.946 checking for gcc... gcc #11 6.002 checking whether the C compiler works... yes #11 6.080 checking for C compiler default output file name... a.out #11 6.081 checking for suffix of executables... #11 6.116 checking whether we are cross compiling... no #11 6.149 checking for suffix of object files... o #11 6.175 checking whether we are using the GNU C compiler... yes #11 6.207 checking whether gcc accepts -g... yes #11 6.238 checking for gcc option to accept ISO C89... none needed #11 6.270 checking for style of include used by make... GNU #11 6.275 checking dependency style of gcc... gcc3 #11 6.354 checking for ranlib... ranlib #11 6.380 checking build system type... x86_64-unknown-linux-gnu #11 6.492 checking host system type... x86_64-unknown-linux-gnu #11 6.492 checking how to print strings... printf #11 6.498 checking for a sed that does not truncate output... /usr/bin/sed #11 6.509 checking for grep that handles long lines and -e... /usr/bin/grep #11 6.514 checking for egrep... /usr/bin/grep -E #11 6.518 checking for fgrep... /usr/bin/grep -F #11 6.523 checking for ld used by gcc... /usr/bin/ld #11 6.533 checking if the linker (/usr/bin/ld) is GNU ld... yes #11 6.538 checking for BSD- or MS-compatible name lister (nm)... /usr/bin/nm -B #11 6.545 checking the name lister (/usr/bin/nm -B) interface... BSD nm #11 6.592 checking whether ln -s works... yes #11 6.593 checking the maximum length of command line arguments... 1572864 #11 6.603 checking whether the shell understands some XSI constructs... yes #11 6.605 checking whether the shell understands "+="... yes #11 6.613 checking how to convert x86_64-unknown-linux-gnu file names to x86_64-unknown-linux-gnu format... func_convert_file_noop #11 6.614 checking how to convert x86_64-unknown-linux-gnu file names to toolchain format... func_convert_file_noop #11 6.614 checking for /usr/bin/ld option to reload object files... -r #11 6.615 checking for objdump... objdump #11 6.616 checking how to recognize dependent libraries... pass_all #11 6.618 checking for dlltool... no #11 6.619 checking how to associate runtime and link libraries... printf %s\n #11 6.620 checking for ar... ar #11 6.620 checking for archiver @FILE support... @ #11 6.670 checking for strip... strip #11 6.671 checking for ranlib... (cached) ranlib #11 6.672 checking command to parse /usr/bin/nm -B output from gcc object... ok #11 6.807 checking for sysroot... no #11 6.825 ./configure: line 6418: /usr/bin/file: No such file or directory #11 6.829 checking for mt... no #11 6.830 checking if : is a manifest tool... no #11 6.842 checking how to run the C preprocessor... gcc -E #11 6.936 checking for ANSI C header files... yes #11 7.038 checking for sys/types.h... yes #11 7.066 checking for sys/stat.h... yes #11 7.092 checking for stdlib.h... yes #11 7.110 checking for string.h... yes #11 7.135 checking for memory.h... yes #11 7.167 checking for strings.h... yes #11 7.202 checking for inttypes.h... yes #11 7.237 checking for stdint.h... yes #11 7.261 checking for unistd.h... yes #11 7.288 checking for dlfcn.h... yes #11 7.309 checking for objdir... .libs #11 7.395 checking if gcc supports -fno-rtti -fno-exceptions... no #11 7.416 checking for gcc option to produce PIC... -fPIC -DPIC #11 7.416 checking if gcc PIC flag -fPIC -DPIC works... yes #11 7.451 checking if gcc static flag -static works... no #11 7.491 checking if gcc supports -c -o file.o... yes #11 7.558 checking if gcc supports -c -o file.o... (cached) yes #11 7.558 checking whether the gcc linker (/usr/bin/ld) supports shared libraries... yes #11 7.576 checking whether -lc should be explicitly linked in... no #11 7.638 checking dynamic linker characteristics... GNU/Linux ld.so #11 7.717 checking how to hardcode library paths into programs... immediate #11 7.717 checking whether stripping libraries is possible... yes #11 7.720 checking if libtool supports shared libraries... yes #11 7.720 checking whether to build shared libraries... yes #11 7.720 checking whether to build static libraries... yes #11 7.721 checking for pkg-config... /usr/bin/pkg-config #11 7.723 checking for pkg-config... /usr/bin/pkg-config #11 7.723 checking pkg-config is at least version 0.20... yes #11 7.726 checking for ANSI C header files... (cached) yes #11 7.734 checking whether to enable VTY tests... no #11 7.735 checking for pcap-config... /usr/bin/pcap-config #11 7.743 checking for LIBOSMOCORE... yes #11 7.764 checking for LIBOSMOGB... yes #11 7.787 checking for LIBOSMOGSM... yes #11 7.808 checking for LIBOSMOVTY... yes #11 7.830 checking for LIBOSMONETIF... no #11 7.847 configure: error: Package requirements (libosmo-netif >= 1.5.0) were not met: #11 7.847 #11 7.847 No package 'libosmo-netif' found #11 7.847 #11 7.847 Consider adjusting the PKG_CONFIG_PATH environment variable if you #11 7.847 installed software in a non-standard prefix. #11 7.847 #11 7.847 Alternatively, you may set the environment variables LIBOSMONETIF_CFLAGS #11 7.847 and LIBOSMONETIF_LIBS to avoid the need to call pkg-config. #11 7.847 See the pkg-config man page for more details. #11 ERROR: process "/bin/sh -c cd osmo-pcap && \tgit fetch && git checkout $OSMO_PCAP_BRANCH && \t(git symbolic-ref -q HEAD && git reset --hard origin/$OSMO_PCAP_BRANCH || exit 1); \tgit rev-parse --abbrev-ref HEAD && git rev-parse HEAD && \tautoreconf -fi && \t./configure && \tmake "-j$(nproc)" install" did not complete successfully: exit code: 1 ------
[6/8] RUN CD osmo-pcap && git fetch && git checkout master && (git symbolic-ref -q HEAD && git reset --hard origin/master || exit 1); git rev-parse --abbrev-ref HEAD && git rev-parse HEAD && autoreconf -fi && ./configure && make "-j$(nproc)" install:
7.847 configure: error: Package requirements (libosmo-netif >= 1.5.0) were not met: 7.847 7.847 No package 'libosmo-netif' found 7.847 7.847 Consider adjusting the PKG_CONFIG_PATH environment variable if you 7.847 installed software in a non-standard prefix. 7.847 7.847 Alternatively, you may set the environment variables LIBOSMONETIF_CFLAGS 7.847 and LIBOSMONETIF_LIBS to avoid the need to call pkg-config. 7.847 See the pkg-config man page for more details. ------
[33m1 warning found (use docker --debug to expand): [0m - InvalidDefaultArgInFrom: Default value for ARG $USER/$DISTRO-build results in empty or invalid base image name (line 3) Dockerfile:34 -------------------- 33 | 34 | >>> RUN cd osmo-pcap && \ 35 | >>> git fetch && git checkout $OSMO_PCAP_BRANCH && \ 36 | >>> (git symbolic-ref -q HEAD && git reset --hard origin/$OSMO_PCAP_BRANCH || exit 1); \ 37 | >>> git rev-parse --abbrev-ref HEAD && git rev-parse HEAD && \ 38 | >>> autoreconf -fi && \ 39 | >>> ./configure && \ 40 | >>> make "-j$(nproc)" install 41 | -------------------- ERROR: failed to solve: process "/bin/sh -c cd osmo-pcap && \tgit fetch && git checkout $OSMO_PCAP_BRANCH && \t(git symbolic-ref -q HEAD && git reset --hard origin/$OSMO_PCAP_BRANCH || exit 1); \tgit rev-parse --abbrev-ref HEAD && git rev-parse HEAD && \tautoreconf -fi && \t./configure && \tmake "-j$(nproc)" install" did not complete successfully: exit code: 1 make: *** [../make/Makefile:95: docker-build] Error 1 make: Leaving directory 'https://jenkins.osmocom.org/jenkins/job/TTCN3-centos7-pcap-client-test/ws/osmo-pcap-master' + exit 1 Build step 'Execute shell' marked build as failure Recording test results ERROR: Step ‘Publish JUnit test result report’ failed: No test report files were found. Configuration error?
See https://jenkins.osmocom.org/jenkins/job/TTCN3-centos7-pcap-client-test/1140/display/redirect
Changes:
------------------------------------------ [...truncated 21.61 KiB...] #7 4.907 Running transaction #7 6.668 Preparing : 1/1 #7 6.687 Installing : osmocom-nightly-202501202026-1.1.x86_64 1/23 #7 6.720 Installing : libmnl-1.0.5-7.1.x86_64 2/23 #7 6.775 Installing : libosmocore22-1.10.0.61.4dbbd.202501202026-1.1.x86 3/23 #7 6.811 Running scriptlet: libosmocore22-1.10.0.61.4dbbd.202501202026-1.1.x86 3/23 #7 6.852 Installing : libosmoisdn0-1.10.0.61.4dbbd.202501202026-1.1.x86_ 4/23 #7 6.888 Running scriptlet: libosmoisdn0-1.10.0.61.4dbbd.202501202026-1.1.x86_ 4/23 #7 6.930 Installing : libosmogsm20-1.10.0.61.4dbbd.202501202026-1.1.x86_ 5/23 #7 6.959 Running scriptlet: libosmogsm20-1.10.0.61.4dbbd.202501202026-1.1.x86_ 5/23 #7 6.992 Installing : libosmovty13-1.10.0.61.4dbbd.202501202026-1.1.x86_ 6/23 #7 7.024 Running scriptlet: libosmovty13-1.10.0.61.4dbbd.202501202026-1.1.x86_ 6/23 #7 7.067 Installing : libunwind-2:1.2-2.el7.x86_64 7/23 #7 7.104 Running scriptlet: libunwind-2:1.2-2.el7.x86_64 7/23 #7 7.154 Installing : libsodium23-1.0.18-2.1.x86_64 8/23 #7 7.192 Running scriptlet: libsodium23-1.0.18-2.1.x86_64 8/23 #7 7.243 Installing : libpgm-5_2-0-5.2.122-3.1.x86_64 9/23 #7 7.277 Running scriptlet: libpgm-5_2-0-5.2.122-3.1.x86_64 9/23 #7 7.324 Installing : libzmq5-4.3.5-1.1.x86_64 10/23 #7 7.359 Running scriptlet: libzmq5-4.3.5-1.1.x86_64 10/23 #7 7.391 Installing : openpgm-devel-5.2.122-3.1.x86_64 11/23 #7 7.450 Installing : libsodium-devel-1.0.18-2.1.x86_64 12/23 #7 7.524 Installing : libunwind-devel-2:1.2-2.el7.x86_64 13/23 #7 7.583 Installing : libosmoctrl0-1.10.0.61.4dbbd.202501202026-1.1.x86_ 14/23 #7 7.624 Running scriptlet: libosmoctrl0-1.10.0.61.4dbbd.202501202026-1.1.x86_ 14/23 #7 7.672 Installing : libosmogb14-1.10.0.61.4dbbd.202501202026-1.1.x86_6 15/23 #7 7.712 Running scriptlet: libosmogb14-1.10.0.61.4dbbd.202501202026-1.1.x86_6 15/23 #7 7.746 Installing : libmnl-devel-1.0.5-7.1.x86_64 16/23 #7 7.809 Installing : libosmocore-devel-1.10.0.61.4dbbd.202501202026-1.1 17/23 #7 7.859 Installing : libosmoisdn-devel-1.10.0.61.4dbbd.202501202026-1.1 18/23 #7 7.909 Installing : libosmogsm-devel-1.10.0.61.4dbbd.202501202026-1.1. 19/23 #7 7.950 Installing : libosmovty-devel-1.10.0.61.4dbbd.202501202026-1.1. 20/23 #7 7.988 Installing : libosmogb-devel-1.10.0.61.4dbbd.202501202026-1.1.x 21/23 #7 8.032 Installing : libosmoctrl-devel-1.10.0.61.4dbbd.202501202026-1.1 22/23 #7 8.131 Installing : zeromq-devel-4.3.5-1.1.x86_64 23/23 #7 8.196 Verifying : libmnl-1.0.5-7.1.x86_64 1/23 #7 8.196 Verifying : libmnl-devel-1.0.5-7.1.x86_64 2/23 #7 8.197 Verifying : libosmocore-devel-1.10.0.61.4dbbd.202501202026-1.1 3/23 #7 8.197 Verifying : libosmocore22-1.10.0.61.4dbbd.202501202026-1.1.x86 4/23 #7 8.197 Verifying : libosmoctrl-devel-1.10.0.61.4dbbd.202501202026-1.1 5/23 #7 8.197 Verifying : libosmoctrl0-1.10.0.61.4dbbd.202501202026-1.1.x86_ 6/23 #7 8.197 Verifying : libosmogb-devel-1.10.0.61.4dbbd.202501202026-1.1.x 7/23 #7 8.197 Verifying : libosmogb14-1.10.0.61.4dbbd.202501202026-1.1.x86_6 8/23 #7 8.197 Verifying : libosmogsm-devel-1.10.0.61.4dbbd.202501202026-1.1. 9/23 #7 8.197 Verifying : libosmogsm20-1.10.0.61.4dbbd.202501202026-1.1.x86_ 10/23 #7 8.197 Verifying : libosmoisdn-devel-1.10.0.61.4dbbd.202501202026-1.1 11/23 #7 8.197 Verifying : libosmoisdn0-1.10.0.61.4dbbd.202501202026-1.1.x86_ 12/23 #7 8.197 Verifying : libosmovty-devel-1.10.0.61.4dbbd.202501202026-1.1. 13/23 #7 8.197 Verifying : libosmovty13-1.10.0.61.4dbbd.202501202026-1.1.x86_ 14/23 #7 8.197 Verifying : libpgm-5_2-0-5.2.122-3.1.x86_64 15/23 #7 8.197 Verifying : libsodium-devel-1.0.18-2.1.x86_64 16/23 #7 8.197 Verifying : libsodium23-1.0.18-2.1.x86_64 17/23 #7 8.197 Verifying : libzmq5-4.3.5-1.1.x86_64 18/23 #7 8.197 Verifying : openpgm-devel-5.2.122-3.1.x86_64 19/23 #7 8.197 Verifying : osmocom-nightly-202501202026-1.1.x86_64 20/23 #7 8.197 Verifying : zeromq-devel-4.3.5-1.1.x86_64 21/23 #7 8.197 Verifying : libunwind-2:1.2-2.el7.x86_64 22/23 #7 8.198 Verifying : libunwind-devel-2:1.2-2.el7.x86_64 23/23 #7 8.937 #7 8.937 Installed: #7 8.937 libosmocore-devel-1.10.0.61.4dbbd.202501202026-1.1.x86_64 #7 8.937 libosmoctrl-devel-1.10.0.61.4dbbd.202501202026-1.1.x86_64 #7 8.937 libosmogb-devel-1.10.0.61.4dbbd.202501202026-1.1.x86_64 #7 8.937 libosmogsm-devel-1.10.0.61.4dbbd.202501202026-1.1.x86_64 #7 8.937 libosmovty-devel-1.10.0.61.4dbbd.202501202026-1.1.x86_64 #7 8.937 zeromq-devel-4.3.5-1.1.x86_64 #7 8.937 libmnl-1.0.5-7.1.x86_64 #7 8.937 libmnl-devel-1.0.5-7.1.x86_64 #7 8.937 libosmocore22-1.10.0.61.4dbbd.202501202026-1.1.x86_64 #7 8.937 libosmoctrl0-1.10.0.61.4dbbd.202501202026-1.1.x86_64 #7 8.937 libosmogb14-1.10.0.61.4dbbd.202501202026-1.1.x86_64 #7 8.937 libosmogsm20-1.10.0.61.4dbbd.202501202026-1.1.x86_64 #7 8.937 libosmoisdn-devel-1.10.0.61.4dbbd.202501202026-1.1.x86_64 #7 8.937 libosmoisdn0-1.10.0.61.4dbbd.202501202026-1.1.x86_64 #7 8.937 libosmovty13-1.10.0.61.4dbbd.202501202026-1.1.x86_64 #7 8.937 libpgm-5_2-0-5.2.122-3.1.x86_64 #7 8.937 libsodium-devel-1.0.18-2.1.x86_64 #7 8.937 libsodium23-1.0.18-2.1.x86_64 #7 8.937 libzmq5-4.3.5-1.1.x86_64 #7 8.937 openpgm-devel-5.2.122-3.1.x86_64 #7 8.937 osmocom-nightly-202501202026-1.1.x86_64 #7 8.937 libunwind-2:1.2-2.el7.x86_64 #7 8.937 libunwind-devel-2:1.2-2.el7.x86_64 #7 8.937 #7 8.937 Complete! #7 DONE 9.1s
#8 [3/8] WORKDIR /TMP #8 DONE 0.1s
#9 [4/8] RUN GIT clone https://gerrit.osmocom.org/osmo-pcap.git #9 0.322 Cloning into 'osmo-pcap'... #9 DONE 0.6s
#10 [5/8] ADD HTTPS://GERRIT.OSMOCOM.ORG/PLUGINS/GITILES/OSMO-PCAP/+/MASTER?FORMAT=TEXT /tmp/commit-osmo-pcap #10 DONE 0.2s
#11 [6/8] RUN CD osmo-pcap && git fetch && git checkout master && (git symbolic-ref -q HEAD && git reset --hard origin/master || exit 1); git rev-parse --abbrev-ref HEAD && git rev-parse HEAD && autoreconf -fi && ./configure && make "-j$(nproc)" install #11 0.426 Already on 'master' #11 0.427 refs/heads/master #11 0.429 HEAD is now at f9eedab server: Correct error check calling osmo_pcap_conn_process_data() #11 0.430 master #11 0.431 f9eedab949e5fd7dcfba728c5d525a0f9d6c4f27 #11 3.175 libtoolize: putting auxiliary files in `.'. #11 3.175 libtoolize: copying file `./ltmain.sh' #11 3.512 libtoolize: Consider adding `AC_CONFIG_MACRO_DIR([m4])' to configure.ac and #11 3.512 libtoolize: rerunning libtoolize, to keep the correct libtool macros in-tree. #11 3.512 libtoolize: Consider adding `-I m4' to ACLOCAL_AMFLAGS in Makefile.am. #11 3.515 libtoolize: `AC_PROG_RANLIB' is rendered obsolete by `LT_INIT' #11 5.726 configure.ac:63: installing './config.guess' #11 5.727 configure.ac:63: installing './config.sub' #11 5.728 configure.ac:6: installing './install-sh' #11 5.729 configure.ac:6: installing './missing' #11 5.826 src/Makefile.am: installing './depcomp' #11 5.923 checking for a BSD-compatible install... /usr/bin/install -c #11 5.942 checking whether build environment is sane... yes #11 5.965 checking for a thread-safe mkdir -p... /usr/bin/mkdir -p #11 5.970 checking for gawk... gawk #11 5.971 checking whether make sets $(MAKE)... yes #11 5.996 checking whether make supports nested variables... yes #11 6.013 checking whether make supports nested variables... (cached) yes #11 6.013 checking whether make sets $(MAKE)... (cached) yes #11 6.019 checking for gcc... gcc #11 6.069 checking whether the C compiler works... yes #11 6.165 checking for C compiler default output file name... a.out #11 6.166 checking for suffix of executables... #11 6.190 checking whether we are cross compiling... no #11 6.221 checking for suffix of object files... o #11 6.248 checking whether we are using the GNU C compiler... yes #11 6.284 checking whether gcc accepts -g... yes #11 6.322 checking for gcc option to accept ISO C89... none needed #11 6.361 checking for style of include used by make... GNU #11 6.368 checking dependency style of gcc... gcc3 #11 6.447 checking for ranlib... ranlib #11 6.473 checking build system type... x86_64-unknown-linux-gnu #11 6.578 checking host system type... x86_64-unknown-linux-gnu #11 6.578 checking how to print strings... printf #11 6.583 checking for a sed that does not truncate output... /usr/bin/sed #11 6.596 checking for grep that handles long lines and -e... /usr/bin/grep #11 6.601 checking for egrep... /usr/bin/grep -E #11 6.604 checking for fgrep... /usr/bin/grep -F #11 6.609 checking for ld used by gcc... /usr/bin/ld #11 6.619 checking if the linker (/usr/bin/ld) is GNU ld... yes #11 6.624 checking for BSD- or MS-compatible name lister (nm)... /usr/bin/nm -B #11 6.631 checking the name lister (/usr/bin/nm -B) interface... BSD nm #11 6.679 checking whether ln -s works... yes #11 6.679 checking the maximum length of command line arguments... 1572864 #11 6.690 checking whether the shell understands some XSI constructs... yes #11 6.692 checking whether the shell understands "+="... yes #11 6.700 checking how to convert x86_64-unknown-linux-gnu file names to x86_64-unknown-linux-gnu format... func_convert_file_noop #11 6.700 checking how to convert x86_64-unknown-linux-gnu file names to toolchain format... func_convert_file_noop #11 6.701 checking for /usr/bin/ld option to reload object files... -r #11 6.702 checking for objdump... objdump #11 6.702 checking how to recognize dependent libraries... pass_all #11 6.705 checking for dlltool... no #11 6.705 checking how to associate runtime and link libraries... printf %s\n #11 6.706 checking for ar... ar #11 6.707 checking for archiver @FILE support... @ #11 6.759 checking for strip... strip #11 6.761 checking for ranlib... (cached) ranlib #11 6.761 checking command to parse /usr/bin/nm -B output from gcc object... ok #11 6.879 checking for sysroot... no #11 6.890 ./configure: line 6418: /usr/bin/file: No such file or directory #11 6.891 checking for mt... no #11 6.892 checking if : is a manifest tool... no #11 6.897 checking how to run the C preprocessor... gcc -E #11 6.990 checking for ANSI C header files... yes #11 7.089 checking for sys/types.h... yes #11 7.120 checking for sys/stat.h... yes #11 7.162 checking for stdlib.h... yes #11 7.186 checking for string.h... yes #11 7.215 checking for memory.h... yes #11 7.251 checking for strings.h... yes #11 7.304 checking for inttypes.h... yes #11 7.347 checking for stdint.h... yes #11 7.385 checking for unistd.h... yes #11 7.420 checking for dlfcn.h... yes #11 7.444 checking for objdir... .libs #11 7.526 checking if gcc supports -fno-rtti -fno-exceptions... no #11 7.571 checking for gcc option to produce PIC... -fPIC -DPIC #11 7.571 checking if gcc PIC flag -fPIC -DPIC works... yes #11 7.613 checking if gcc static flag -static works... no #11 7.644 checking if gcc supports -c -o file.o... yes #11 7.711 checking if gcc supports -c -o file.o... (cached) yes #11 7.711 checking whether the gcc linker (/usr/bin/ld) supports shared libraries... yes #11 7.730 checking whether -lc should be explicitly linked in... no #11 7.790 checking dynamic linker characteristics... GNU/Linux ld.so #11 7.856 checking how to hardcode library paths into programs... immediate #11 7.856 checking whether stripping libraries is possible... yes #11 7.858 checking if libtool supports shared libraries... yes #11 7.859 checking whether to build shared libraries... yes #11 7.859 checking whether to build static libraries... yes #11 7.859 checking for pkg-config... /usr/bin/pkg-config #11 7.860 checking for pkg-config... /usr/bin/pkg-config #11 7.861 checking pkg-config is at least version 0.20... yes #11 7.862 checking for ANSI C header files... (cached) yes #11 7.867 checking whether to enable VTY tests... no #11 7.868 checking for pcap-config... /usr/bin/pcap-config #11 7.874 checking for LIBOSMOCORE... yes #11 7.895 checking for LIBOSMOGB... yes #11 7.917 checking for LIBOSMOGSM... yes #11 7.939 checking for LIBOSMOVTY... yes #11 7.960 checking for LIBOSMONETIF... no #11 7.978 configure: error: Package requirements (libosmo-netif >= 1.5.0) were not met: #11 7.978 #11 7.978 No package 'libosmo-netif' found #11 7.978 #11 7.978 Consider adjusting the PKG_CONFIG_PATH environment variable if you #11 7.978 installed software in a non-standard prefix. #11 7.978 #11 7.978 Alternatively, you may set the environment variables LIBOSMONETIF_CFLAGS #11 7.978 and LIBOSMONETIF_LIBS to avoid the need to call pkg-config. #11 7.978 See the pkg-config man page for more details. #11 ERROR: process "/bin/sh -c cd osmo-pcap && \tgit fetch && git checkout $OSMO_PCAP_BRANCH && \t(git symbolic-ref -q HEAD && git reset --hard origin/$OSMO_PCAP_BRANCH || exit 1); \tgit rev-parse --abbrev-ref HEAD && git rev-parse HEAD && \tautoreconf -fi && \t./configure && \tmake "-j$(nproc)" install" did not complete successfully: exit code: 1 ------
[6/8] RUN CD osmo-pcap && git fetch && git checkout master && (git symbolic-ref -q HEAD && git reset --hard origin/master || exit 1); git rev-parse --abbrev-ref HEAD && git rev-parse HEAD && autoreconf -fi && ./configure && make "-j$(nproc)" install:
7.978 configure: error: Package requirements (libosmo-netif >= 1.5.0) were not met: 7.978 7.978 No package 'libosmo-netif' found 7.978 7.978 Consider adjusting the PKG_CONFIG_PATH environment variable if you 7.978 installed software in a non-standard prefix. 7.978 7.978 Alternatively, you may set the environment variables LIBOSMONETIF_CFLAGS 7.978 and LIBOSMONETIF_LIBS to avoid the need to call pkg-config. 7.978 See the pkg-config man page for more details. ------
[33m1 warning found (use docker --debug to expand): [0m - InvalidDefaultArgInFrom: Default value for ARG $USER/$DISTRO-build results in empty or invalid base image name (line 3) Dockerfile:34 -------------------- 33 | 34 | >>> RUN cd osmo-pcap && \ 35 | >>> git fetch && git checkout $OSMO_PCAP_BRANCH && \ 36 | >>> (git symbolic-ref -q HEAD && git reset --hard origin/$OSMO_PCAP_BRANCH || exit 1); \ 37 | >>> git rev-parse --abbrev-ref HEAD && git rev-parse HEAD && \ 38 | >>> autoreconf -fi && \ 39 | >>> ./configure && \ 40 | >>> make "-j$(nproc)" install 41 | -------------------- ERROR: failed to solve: process "/bin/sh -c cd osmo-pcap && \tgit fetch && git checkout $OSMO_PCAP_BRANCH && \t(git symbolic-ref -q HEAD && git reset --hard origin/$OSMO_PCAP_BRANCH || exit 1); \tgit rev-parse --abbrev-ref HEAD && git rev-parse HEAD && \tautoreconf -fi && \t./configure && \tmake "-j$(nproc)" install" did not complete successfully: exit code: 1 make: *** [../make/Makefile:95: docker-build] Error 1 make: Leaving directory 'https://jenkins.osmocom.org/jenkins/job/TTCN3-centos7-pcap-client-test/ws/osmo-pcap-master' + exit 1 Build step 'Execute shell' marked build as failure Recording test results ERROR: Step ‘Publish JUnit test result report’ failed: No test report files were found. Configuration error?
jenkins-notifications@lists.osmocom.org