See https://jenkins.osmocom.org/jenkins/job/TTCN3-centos-bts-test-2022q2/156/display/redirect
Changes:
------------------------------------------ [...truncated 3.44 MB...] <error type='DTE'></error> </testcase> <testcase classname='BTS_Tests' name='TC_rll_unit_data_req_ACCH' time='5.028446'> <error type='DTE'></error> </testcase> <testcase classname='BTS_Tests' name='TC_rll_unit_data_ind_DCCH' time='5.032315'> <error type='DTE'></error> </testcase> <testcase classname='BTS_Tests' name='TC_rll_unit_data_ind_ACCH' time='5.040036'> <error type='DTE'></error> </testcase> <testcase classname='BTS_Tests' name='TC_chan_act_a51' time='4.995173'> <error type='DTE'></error> </testcase> <testcase classname='BTS_Tests' name='TC_chan_act_a52' time='4.996412'> <error type='DTE'></error> </testcase> <testcase classname='BTS_Tests' name='TC_chan_act_a53' time='4.989229'> <error type='DTE'></error> </testcase> <testcase classname='BTS_Tests' name='TC_chan_act_a54' time='4.992262'> <error type='DTE'></error> </testcase> <testcase classname='BTS_Tests' name='TC_encr_cmd_a51' time='4.991547'> <error type='DTE'></error> </testcase> <testcase classname='BTS_Tests' name='TC_encr_cmd_a52' time='4.999912'> <error type='DTE'></error> </testcase> <testcase classname='BTS_Tests' name='TC_encr_cmd_a53' time='4.995505'> <error type='DTE'></error> </testcase> <testcase classname='BTS_Tests' name='TC_encr_cmd_a54' time='4.991720'> <error type='DTE'></error> </testcase> <testcase classname='BTS_Tests' name='TC_err_rep_wrong_mdisc' time='9.961784'> <error type='DTE'></error> </testcase> <testcase classname='BTS_Tests' name='TC_err_rep_wrong_msg_type' time='9.859061'> <error type='DTE'></error> </testcase> <testcase classname='BTS_Tests' name='TC_err_rep_wrong_sequence' time='9.830758'> <error type='DTE'></error> </testcase> <testcase classname='BTS_Tests' name='TC_lapdm_selftest' time='0.005318'/> <testcase classname='BTS_Tests' name='TC_tch_sign_l2_fill_frame' time='5.785526'> <error type='DTE'></error> </testcase> <testcase classname='BTS_Tests' name='TC_tch_sign_l2_fill_frame_dtxd' time='4.990272'> <error type='DTE'></error> </testcase> <testcase classname='BTS_Tests' name='TC_chopped_ipa_ping' time='28.419684'/> <testcase classname='BTS_Tests' name='TC_chopped_ipa_payload' time='42.604753'/> <testcase classname='BTS_Tests' name='TC_ms_pwr_ctrl_constant' time='4.602753'> <error type='DTE'></error> </testcase> <testcase classname='BTS_Tests' name='TC_ms_pwr_ctrl_pf_ewma' time='5.011513'> <error type='DTE'></error> </testcase> <testcase classname='BTS_Tests' name='TC_speech_no_rtp_tchf' time='4.945176'> <error type='DTE'></error> </testcase> <testcase classname='BTS_Tests' name='TC_speech_no_rtp_tchh' time='4.956835'> <error type='DTE'></error> </testcase> <testcase classname='BTS_Tests' name='TC_speech_rtp_tchf' time='4.982738'> <error type='DTE'></error> </testcase> <testcase classname='BTS_Tests' name='TC_speech_rtp_tchh' time='4.965649'> <error type='DTE'></error> </testcase> <testcase classname='BTS_Tests' name='TC_speech_osmux_tchf' time='4.961631'> <error type='DTE'></error> </testcase> <testcase classname='BTS_Tests' name='TC_speech_osmux_tchh' time='4.966796'> <error type='DTE'></error> </testcase> <testcase classname='BTS_Tests' name='TC_early_immediate_assignment' time='4.950849'> <error type='DTE'></error> </testcase> <testcase classname='BTS_Tests' name='TC_acch_overpower_rxqual_thresh' time='4.953895'> <error type='DTE'></error> </testcase> <testcase classname='BTS_Tests' name='TC_acch_overpower_rxqual_thresh_dtx' time='4.956526'> <error type='DTE'></error> </testcase> <testcase classname='BTS_Tests' name='TC_acch_overpower_always_on_facch' time='4.947884'> <error type='DTE'></error> </testcase> <testcase classname='BTS_Tests' name='TC_acch_overpower_always_on_sacch' time='4.957556'> <error type='DTE'></error> </testcase> <testcase classname='BTS_Tests' name='TC_acch_overpower_limit' time='4.957234'> <error type='DTE'></error> </testcase> <testcase classname='BTS_Tests' name='TC_dyn_osmo_pdch_tchh_race_act' time='6.564046'/> <testcase classname='BTS_Tests' name='TC_dyn_osmo_pdch_sdcch8_race_act' time='6.745066'/> <testcase classname='BTS_Tests_SMSCB' name='TC_cbch_load_idle_no_cbch' time='14.901233'/> <testcase classname='BTS_Tests_SMSCB' name='TC_sms_cb_cmd_sdcch4_1block' time='4.776915'> <error type='DTE'>Dynamic test case error: Stand-alone receive statement failed in file L1CTL_PortType.ttcn, line 298.</error> </testcase> <testcase classname='BTS_Tests_SMSCB' name='TC_sms_cb_cmd_sdcch4_2block' time='4.951674'> <error type='DTE'>Dynamic test case error: Stand-alone receive statement failed in file L1CTL_PortType.ttcn, line 298.</error> </testcase> <testcase classname='BTS_Tests_SMSCB' name='TC_sms_cb_cmd_sdcch4_3block' time='4.947961'> <error type='DTE'>Dynamic test case error: Stand-alone receive statement failed in file L1CTL_PortType.ttcn, line 298.</error> </testcase> <testcase classname='BTS_Tests_SMSCB' name='TC_sms_cb_cmd_sdcch4_4block' time='4.941136'> <error type='DTE'>Dynamic test case error: Stand-alone receive statement failed in file L1CTL_PortType.ttcn, line 298.</error> </testcase> <testcase classname='BTS_Tests_SMSCB' name='TC_sms_cb_cmd_sdcch4_multi' time='4.954380'> <error type='DTE'>Dynamic test case error: Stand-alone receive statement failed in file L1CTL_PortType.ttcn, line 298.</error> </testcase> <testcase classname='BTS_Tests_SMSCB' name='TC_sms_cb_cmd_sdcch4_schedule' time='4.945347'> <error type='DTE'>Dynamic test case error: Stand-alone receive statement failed in file L1CTL_PortType.ttcn, line 298.</error> </testcase> <testcase classname='BTS_Tests_SMSCB' name='TC_sms_cb_cmd_sdcch4_default_only' time='4.940312'> <error type='DTE'>Dynamic test case error: Stand-alone receive statement failed in file L1CTL_PortType.ttcn, line 298.</error> </testcase> <testcase classname='BTS_Tests_SMSCB' name='TC_sms_cb_cmd_sdcch4_default_and_normal' time='4.940789'> <error type='DTE'>Dynamic test case error: Stand-alone receive statement failed in file L1CTL_PortType.ttcn, line 298.</error> </testcase> <testcase classname='BTS_Tests_SMSCB' name='TC_sms_cb_cmd_sdcch4_default_then_null' time='4.945987'> <error type='DTE'>Dynamic test case error: Stand-alone receive statement failed in file L1CTL_PortType.ttcn, line 298.</error> </testcase> <testcase classname='BTS_Tests_SMSCB' name='TC_cbc_sdcch4_load_idle' time='14.937892'/> <testcase classname='BTS_Tests_SMSCB' name='TC_cbc_sdcch4_load_overload' time='16.772371'/> <testcase classname='BTS_Tests_SMSCB' name='TC_sms_cb_cmd_sdcch8_1block' time='4.651487'> <error type='DTE'>Dynamic test case error: Stand-alone receive statement failed in file L1CTL_PortType.ttcn, line 298.</error> </testcase> <testcase classname='BTS_Tests_SMSCB' name='TC_sms_cb_cmd_sdcch8_2block' time='4.950692'> <error type='DTE'>Dynamic test case error: Stand-alone receive statement failed in file L1CTL_PortType.ttcn, line 298.</error> </testcase> <testcase classname='BTS_Tests_SMSCB' name='TC_sms_cb_cmd_sdcch8_3block' time='4.949336'> <error type='DTE'>Dynamic test case error: Stand-alone receive statement failed in file L1CTL_PortType.ttcn, line 298.</error> </testcase> <testcase classname='BTS_Tests_SMSCB' name='TC_sms_cb_cmd_sdcch8_4block' time='4.934883'> <error type='DTE'>Dynamic test case error: Stand-alone receive statement failed in file L1CTL_PortType.ttcn, line 298.</error> </testcase> <testcase classname='BTS_Tests_SMSCB' name='TC_sms_cb_cmd_sdcch8_multi' time='4.947058'> <error type='DTE'>Dynamic test case error: Stand-alone receive statement failed in file L1CTL_PortType.ttcn, line 298.</error> </testcase> <testcase classname='BTS_Tests_SMSCB' name='TC_sms_cb_cmd_sdcch8_schedule' time='4.936421'> <error type='DTE'>Dynamic test case error: Stand-alone receive statement failed in file L1CTL_PortType.ttcn, line 298.</error> </testcase> <testcase classname='BTS_Tests_SMSCB' name='TC_sms_cb_cmd_sdcch8_default_only' time='4.945159'> <error type='DTE'>Dynamic test case error: Stand-alone receive statement failed in file L1CTL_PortType.ttcn, line 298.</error> </testcase> <testcase classname='BTS_Tests_SMSCB' name='TC_sms_cb_cmd_sdcch8_default_and_normal' time='4.952056'> <error type='DTE'>Dynamic test case error: Stand-alone receive statement failed in file L1CTL_PortType.ttcn, line 298.</error> </testcase> <testcase classname='BTS_Tests_SMSCB' name='TC_cbc_sdcch8_load_idle' time='14.944124'/> <testcase classname='BTS_Tests_SMSCB' name='TC_cbc_sdcch8_load_overload' time='16.775976'/> <testcase classname='BTS_Tests_SMSCB' name='TC_etws_p1ro' time='4.656149'> <error type='DTE'>Dynamic test case error: Stand-alone receive statement failed in file L1CTL_PortType.ttcn, line 298.</error> </testcase> <testcase classname='BTS_Tests_SMSCB' name='TC_etws_p1ro_end' time='4.954270'> <error type='DTE'>Dynamic test case error: Stand-alone receive statement failed in file L1CTL_PortType.ttcn, line 298.</error> </testcase> <testcase classname='BTS_Tests_SMSCB' name='TC_etws_pcu' time='4.962828'> <error type='DTE'>Dynamic test case error: Stand-alone receive statement failed in file L1CTL_PortType.ttcn, line 298.</error> </testcase> <testcase classname='BTS_Tests_LAPDm' name='TC_sabm_ua_dcch_sapi0' time='4.983345'> <error type='DTE'></error> </testcase> <testcase classname='BTS_Tests_LAPDm' name='TC_sabm_ua_dcch_sapi0_nopayload' time='4.985354'> <error type='DTE'></error> </testcase> <testcase classname='BTS_Tests_LAPDm' name='TC_sabm_ua_dcch_sapi3' time='4.989754'> <error type='DTE'></error> </testcase> <testcase classname='BTS_Tests_LAPDm' name='TC_sabm_ua_dcch_sapi4' time='4.999313'> <error type='DTE'></error> </testcase> <testcase classname='BTS_Tests_LAPDm' name='TC_sabm_contention' time='4.996576'> <error type='DTE'></error> </testcase> <testcase classname='BTS_Tests_LAPDm' name='TC_sabm_retransmit' time='4.992172'> <error type='DTE'></error> </testcase> <testcase classname='BTS_Tests_LAPDm' name='TC_sabm_retransmit_bts' time='4.987635'> <error type='DTE'></error> </testcase> <testcase classname='BTS_Tests_LAPDm' name='TC_sabm_invalid_resp' time='4.993062'> <error type='DTE'></error> </testcase> <testcase classname='BTS_Tests_LAPDm' name='TC_sabm_dm' time='4.981950'> <error type='DTE'></error> </testcase> <testcase classname='BTS_Tests_LAPDm' name='TC_establish_ign_first_sabm' time='4.981215'> <error type='DTE'></error> </testcase> <testcase classname='BTS_Tests_LAPDm' name='TC_iframe_seq_and_ack' time='4.995561'> <error type='DTE'></error> </testcase> <testcase classname='BTS_Tests_LAPDm' name='TC_iframe_timer_recovery' time='5.004345'> <error type='DTE'></error> </testcase> <testcase classname='BTS_Tests_LAPDm' name='TC_ns_seq_error' time='4.992558'> <error type='DTE'></error> </testcase> <testcase classname='BTS_Tests_LAPDm' name='TC_nr_seq_error' time='4.990684'> <error type='DTE'></error> </testcase> <testcase classname='BTS_Tests_LAPDm' name='TC_rec_invalid_frame' time='4.977404'> <error type='DTE'></error> </testcase> <testcase classname='BTS_Tests_LAPDm' name='TC_segm_concat_dcch' time='4.996326'> <error type='DTE'></error> </testcase> <testcase classname='BTS_Tests_LAPDm' name='TC_segm_concat_sacch' time='5.001385'> <error type='DTE'></error> </testcase> <testcase classname='BTS_Tests_LAPDm' name='TC_t200_n200' time='4.995931'> <error type='DTE'></error> </testcase> <testcase classname='BTS_Tests_LAPDm' name='TC_rr_response_frame_loss' time='4.988446'> <error type='DTE'></error> </testcase> <testcase classname='BTS_Tests_LAPDm' name='TC_incorrect_cr' time='4.989580'> <error type='DTE'></error> </testcase> <testcase classname='BTS_Tests_LAPDm' name='TC_sabm_incorrect_c' time='4.988182'> <error type='DTE'></error> </testcase> <testcase classname='BTS_Tests_LAPDm' name='TC_normal_reestablishment' time='4.997896'> <error type='DTE'></error> </testcase> <testcase classname='BTS_Tests_LAPDm' name='TC_normal_reestablishment_state_unacked' time='4.984883'> <error type='DTE'></error> </testcase> <testcase classname='BTS_Tests_VAMOS' name='TC_vamos_chan_act_vff' time='6.269631'/> <testcase classname='BTS_Tests_VAMOS' name='TC_vamos_chan_act_vhh' time='6.295644'/> <testcase classname='BTS_Tests_VAMOS' name='TC_vamos_chan_act_hvhh' time='6.261137'/> <testcase classname='BTS_Tests_VAMOS' name='TC_vamos_chan_act_dyn_ipa_vff' time='6.252312'/> <testcase classname='BTS_Tests_VAMOS' name='TC_vamos_chan_act_dyn_osmo_vff' time='6.231648'/> <testcase classname='BTS_Tests_VAMOS' name='TC_vamos_chan_act_dyn_osmo_vhh' time='6.309632'/> <testcase classname='BTS_Tests_VAMOS' name='TC_vamos_chan_act_dyn_osmo_hvhh' time='6.265524'/> <testcase classname='BTS_Tests_VAMOS' name='TC_vamos_chan_mode_modify_vff' time='5.023973'/> <testcase classname='BTS_Tests_VAMOS' name='TC_vamos_chan_mode_modify_vhh' time='5.096832'/> <testcase classname='BTS_Tests_VAMOS' name='TC_vamos_chan_mode_modify_hvhh' time='5.093104'/> <testcase classname='BTS_Tests_VAMOS' name='TC_vamos_chan_mode_modify_dyn_ipa_vff' time='5.065769'/> <testcase classname='BTS_Tests_VAMOS' name='TC_vamos_chan_mode_modify_dyn_osmo_vff' time='5.089034'/> <testcase classname='BTS_Tests_VAMOS' name='TC_vamos_chan_mode_modify_dyn_osmo_vhh' time='5.089571'/> <testcase classname='BTS_Tests_VAMOS' name='TC_vamos_chan_mode_modify_dyn_osmo_hvhh' time='5.079304'/> </testsuite> Build step 'Execute shell' marked build as failure Recording test results [Checks API] No suitable checks publisher found.
See https://jenkins.osmocom.org/jenkins/job/TTCN3-centos-bts-test-2022q2/160/display/redirect
Changes:
------------------------------------------ [...truncated 4.01 MB...] MTC@e4c06fca6070: Starting external command `../ttcn3-tcpdump-start.sh BTS_Tests.TC_pcu_socket_nsvc_ipv4'. ------ BTS_Tests.TC_pcu_socket_nsvc_ipv4 ------ Mon Nov 28 13:04:56 UTC 2022 NOTE: unable to use dumpcap due to missing capabilities or suid bit Waiting for packet dumper to start... 0 MTC@e4c06fca6070: External command `../ttcn3-tcpdump-start.sh BTS_Tests.TC_pcu_socket_nsvc_ipv4' was executed successfully (exit status: 0). MTC@e4c06fca6070: Test case TC_pcu_socket_nsvc_ipv4 started. TC_pcu_socket_nsvc_ipv4-RSL-IPA(576)@e4c06fca6070: Established a new IPA connection (conn_id=2) TC_pcu_socket_nsvc_ipv4-RSL(577)@e4c06fca6070: A new IPA/RSL connection has been established (conn_id=2), waiting for IDENTITY RESPONSE... TC_pcu_socket_nsvc_ipv4-RSL-IPA(576)@e4c06fca6070: CCM Tx:{ msg_type := IPAC_MSGT_ID_GET (4), u := { get := { { len := 1, tag := IPAC_IDTAG_UNITNAME (1) }, { len := 1, tag := IPAC_IDTAG_UNITID (8) } } } } TC_pcu_socket_nsvc_ipv4-RSL-IPA(576)@e4c06fca6070: CCM Rx:{ msg_type := IPAC_MSGT_ID_RESP (5), u := { resp := { { len := 28, tag := IPAC_IDTAG_UNITNAME (1), data := '6F736D6F2D6274732D30322D34322D61632D31322D30392D313400'O }, { len := 10, tag := IPAC_IDTAG_UNITID (8), data := '313233342F302F3000'O } } } } TC_pcu_socket_nsvc_ipv4-RSL-IPA(576)@e4c06fca6070: IPA ID RESP: { { len := 28, tag := IPAC_IDTAG_UNITNAME (1), data := '6F736D6F2D6274732D30322D34322D61632D31322D30392D313400'O }, { len := 10, tag := IPAC_IDTAG_UNITID (8), data := '313233342F302F3000'O } } TC_pcu_socket_nsvc_ipv4-RSL-IPA(576)@e4c06fca6070: CCM Tx:{ msg_type := IPAC_MSGT_ID_ACK (6), u := omit } TC_pcu_socket_nsvc_ipv4-RSL(577)@e4c06fca6070: Got IDENTITY RESPONSE (conn_id=2): { { len := 28, tag := IPAC_IDTAG_UNITNAME (1), data := '6F736D6F2D6274732D30322D34322D61632D31322D30392D313400'O }, { len := 10, tag := IPAC_IDTAG_UNITID (8), data := '313233342F302F3000'O } } TC_pcu_socket_nsvc_ipv4-RSL-IPA(576)@e4c06fca6070: CCM Rx:{ msg_type := IPAC_MSGT_ID_ACK (6), u := omit } TC_pcu_socket_nsvc_ipv4-RSL(577)@e4c06fca6070: Warning: The first argument (instr) of function regexp(), which is "1234/0/0" & char(0, 0, 0, 0), contains a character with zero character code at index 8. The rest of the string will be ignored during matching. TC_pcu_socket_nsvc_ipv4-RSL(577)@e4c06fca6070: Mapped TRX#0 to TCP/IP conn_id=2 MTC@e4c06fca6070: 1/4 transceiver(s) connected TC_pcu_socket_nsvc_ipv4-RSL-IPA(576)@e4c06fca6070: Established a new IPA connection (conn_id=3) TC_pcu_socket_nsvc_ipv4-RSL-IPA(576)@e4c06fca6070: CCM Tx:{ msg_type := IPAC_MSGT_ID_GET (4), u := { get := { { len := 1, tag := IPAC_IDTAG_UNITNAME (1) }, { len := 1, tag := IPAC_IDTAG_UNITID (8) } } } } TC_pcu_socket_nsvc_ipv4-RSL(577)@e4c06fca6070: A new IPA/RSL connection has been established (conn_id=3), waiting for IDENTITY RESPONSE... MTC@e4c06fca6070: 1/4 RF Resource Indication(s) received TC_pcu_socket_nsvc_ipv4-RSL-IPA(576)@e4c06fca6070: CCM Rx:{ msg_type := IPAC_MSGT_ID_RESP (5), u := { resp := { { len := 28, tag := IPAC_IDTAG_UNITNAME (1), data := '6F736D6F2D6274732D30322D34322D61632D31322D30392D313400'O }, { len := 10, tag := IPAC_IDTAG_UNITID (8), data := '313233342F302F3100'O } } } } TC_pcu_socket_nsvc_ipv4-RSL-IPA(576)@e4c06fca6070: IPA ID RESP: { { len := 28, tag := IPAC_IDTAG_UNITNAME (1), data := '6F736D6F2D6274732D30322D34322D61632D31322D30392D313400'O }, { len := 10, tag := IPAC_IDTAG_UNITID (8), data := '313233342F302F3100'O } } TC_pcu_socket_nsvc_ipv4-RSL-IPA(576)@e4c06fca6070: CCM Tx:{ msg_type := IPAC_MSGT_ID_ACK (6), u := omit } TC_pcu_socket_nsvc_ipv4-RSL(577)@e4c06fca6070: Got IDENTITY RESPONSE (conn_id=3): { { len := 28, tag := IPAC_IDTAG_UNITNAME (1), data := '6F736D6F2D6274732D30322D34322D61632D31322D30392D313400'O }, { len := 10, tag := IPAC_IDTAG_UNITID (8), data := '313233342F302F3100'O } } TC_pcu_socket_nsvc_ipv4-RSL(577)@e4c06fca6070: Warning: The first argument (instr) of function regexp(), which is "1234/0/1" & char(0, 0, 0, 0), contains a character with zero character code at index 8. The rest of the string will be ignored during matching. TC_pcu_socket_nsvc_ipv4-RSL(577)@e4c06fca6070: Mapped TRX#1 to TCP/IP conn_id=3 TC_pcu_socket_nsvc_ipv4-RSL-IPA(576)@e4c06fca6070: CCM Rx:{ msg_type := IPAC_MSGT_ID_ACK (6), u := omit } MTC@e4c06fca6070: 2/4 transceiver(s) connected MTC@e4c06fca6070: 2/4 RF Resource Indication(s) received TC_pcu_socket_nsvc_ipv4-RSL-IPA(576)@e4c06fca6070: Established a new IPA connection (conn_id=4) TC_pcu_socket_nsvc_ipv4-RSL(577)@e4c06fca6070: A new IPA/RSL connection has been established (conn_id=4), waiting for IDENTITY RESPONSE... TC_pcu_socket_nsvc_ipv4-RSL-IPA(576)@e4c06fca6070: CCM Tx:{ msg_type := IPAC_MSGT_ID_GET (4), u := { get := { { len := 1, tag := IPAC_IDTAG_UNITNAME (1) }, { len := 1, tag := IPAC_IDTAG_UNITID (8) } } } } TC_pcu_socket_nsvc_ipv4-RSL-IPA(576)@e4c06fca6070: Established a new IPA connection (conn_id=5) TC_pcu_socket_nsvc_ipv4-RSL(577)@e4c06fca6070: A new IPA/RSL connection has been established (conn_id=5), waiting for IDENTITY RESPONSE... TC_pcu_socket_nsvc_ipv4-RSL-IPA(576)@e4c06fca6070: CCM Tx:{ msg_type := IPAC_MSGT_ID_GET (4), u := { get := { { len := 1, tag := IPAC_IDTAG_UNITNAME (1) }, { len := 1, tag := IPAC_IDTAG_UNITID (8) } } } } TC_pcu_socket_nsvc_ipv4-RSL-IPA(576)@e4c06fca6070: CCM Rx:{ msg_type := IPAC_MSGT_ID_RESP (5), u := { resp := { { len := 28, tag := IPAC_IDTAG_UNITNAME (1), data := '6F736D6F2D6274732D30322D34322D61632D31322D30392D313400'O }, { len := 10, tag := IPAC_IDTAG_UNITID (8), data := '313233342F302F3200'O } } } } TC_pcu_socket_nsvc_ipv4-RSL-IPA(576)@e4c06fca6070: IPA ID RESP: { { len := 28, tag := IPAC_IDTAG_UNITNAME (1), data := '6F736D6F2D6274732D30322D34322D61632D31322D30392D313400'O }, { len := 10, tag := IPAC_IDTAG_UNITID (8), data := '313233342F302F3200'O } } TC_pcu_socket_nsvc_ipv4-RSL(577)@e4c06fca6070: Got IDENTITY RESPONSE (conn_id=4): { { len := 28, tag := IPAC_IDTAG_UNITNAME (1), data := '6F736D6F2D6274732D30322D34322D61632D31322D30392D313400'O }, { len := 10, tag := IPAC_IDTAG_UNITID (8), data := '313233342F302F3200'O } } TC_pcu_socket_nsvc_ipv4-RSL(577)@e4c06fca6070: Warning: The first argument (instr) of function regexp(), which is "1234/0/2" & char(0, 0, 0, 0), contains a character with zero character code at index 8. The rest of the string will be ignored during matching. TC_pcu_socket_nsvc_ipv4-RSL(577)@e4c06fca6070: Mapped TRX#2 to TCP/IP conn_id=4 MTC@e4c06fca6070: 3/4 transceiver(s) connected TC_pcu_socket_nsvc_ipv4-RSL-IPA(576)@e4c06fca6070: CCM Tx:{ msg_type := IPAC_MSGT_ID_ACK (6), u := omit } TC_pcu_socket_nsvc_ipv4-RSL-IPA(576)@e4c06fca6070: CCM Rx:{ msg_type := IPAC_MSGT_ID_ACK (6), u := omit } TC_pcu_socket_nsvc_ipv4-RSL-IPA(576)@e4c06fca6070: CCM Rx:{ msg_type := IPAC_MSGT_ID_RESP (5), u := { resp := { { len := 28, tag := IPAC_IDTAG_UNITNAME (1), data := '6F736D6F2D6274732D30322D34322D61632D31322D30392D313400'O }, { len := 10, tag := IPAC_IDTAG_UNITID (8), data := '313233342F302F3300'O } } } } TC_pcu_socket_nsvc_ipv4-RSL-IPA(576)@e4c06fca6070: IPA ID RESP: { { len := 28, tag := IPAC_IDTAG_UNITNAME (1), data := '6F736D6F2D6274732D30322D34322D61632D31322D30392D313400'O }, { len := 10, tag := IPAC_IDTAG_UNITID (8), data := '313233342F302F3300'O } } MTC@e4c06fca6070: 3/4 RF Resource Indication(s) received TC_pcu_socket_nsvc_ipv4-RSL(577)@e4c06fca6070: Got IDENTITY RESPONSE (conn_id=5): { { len := 28, tag := IPAC_IDTAG_UNITNAME (1), data := '6F736D6F2D6274732D30322D34322D61632D31322D30392D313400'O }, { len := 10, tag := IPAC_IDTAG_UNITID (8), data := '313233342F302F3300'O } } TC_pcu_socket_nsvc_ipv4-RSL(577)@e4c06fca6070: Warning: The first argument (instr) of function regexp(), which is "1234/0/3" & char(0, 0, 0, 0), contains a character with zero character code at index 8. The rest of the string will be ignored during matching. TC_pcu_socket_nsvc_ipv4-RSL(577)@e4c06fca6070: Mapped TRX#3 to TCP/IP conn_id=5 MTC@e4c06fca6070: 4/4 transceiver(s) connected TC_pcu_socket_nsvc_ipv4-RSL-IPA(576)@e4c06fca6070: CCM Tx:{ msg_type := IPAC_MSGT_ID_ACK (6), u := omit } TC_pcu_socket_nsvc_ipv4-RSL-IPA(576)@e4c06fca6070: CCM Rx:{ msg_type := IPAC_MSGT_ID_ACK (6), u := omit } MTC@e4c06fca6070: 4/4 RF Resource Indication(s) received MTC@e4c06fca6070: Setting RSL_SYSTEM_INFO_3 (3): { header := { l2_plen := { l2_plen := 18, zero_one := '01'B }, skip_indicator := 0, rr_protocol_discriminator := 6, message_type := SYSTEM_INFORMATION_TYPE_3 (27) }, payload := { si3 := { cell_id := 23, lai := { mcc_mnc := '262F42'H, lac := 42 }, ctrl_chan_desc := { msc_r99 := true, att := true, bs_ag_blks_res := 1, ccch_conf := CCHAN_DESC_1CCCH_COMBINED (1), si22ind := false, cbq3 := CBQ3_IU_MODE_NOT_SUPPORTED (0), spare := '00'B, bs_pa_mfrms := 0, t3212 := 1 }, cell_options := { dn_ind := false, pwrc := false, dtx := MS_MAY_USE_UL_DTX (0), radio_link_tout_div4 := 7 }, cell_sel_par := { cell_resel_hyst_2dB := 2, ms_txpwr_max_cch := 7, acs := '0'B, neci := true, rxlev_access_min := 0 }, rach_control := { max_retrans := RACH_MAX_RETRANS_7 (3), tx_integer := '1001'B, cell_barr_access := false, re_not_allowed := true, acc := '0000010000000000'B }, rest_octets := { sel_params := { presence := '0'B, params := omit }, pwr_offset := { presence := '0'B, offset := omit }, si_2ter_ind := '0'B, early_cm_ind := '0'B, sched_where := { presence := '0'B, where := omit }, gprs_ind := { presence := '1'B, ind := { ra_colour := 0, si13_pos := '0'B } }, umts_early_cm_ind := '0'B, si2_quater_ind := { presence := '0'B, ind := omit }, iu_mode_ind := omit, si21_ind := { presence := '0'B, pos := omit } } } } } MTC@e4c06fca6070: Setting RSL_SYSTEM_INFO_3 (3): '49061B001762F224002AC90001074740E504002C2B2B2B'O MTC@e4c06fca6070: Setting RSL_SYSTEM_INFO_2 (2): { header := { l2_plen := { l2_plen := 22, zero_one := '01'B }, skip_indicator := 0, rr_protocol_discriminator := 6, message_type := SYSTEM_INFORMATION_TYPE_2 (26) }, payload := { si2 := { bcch_freq_list := '00000000000000000000000000000000'O, ncc_permitted := '11111111'B, rach_control := { max_retrans := RACH_MAX_RETRANS_7 (3), tx_integer := '1001'B, cell_barr_access := false, re_not_allowed := true, acc := '0000010000000000'B } } } } MTC@e4c06fca6070: Setting RSL_SYSTEM_INFO_2 (2): '59061A00000000000000000000000000000000FFE50400'O MTC@e4c06fca6070: Setting RSL_SYSTEM_INFO_4 (4): { header := { l2_plen := { l2_plen := 12, zero_one := '01'B }, skip_indicator := 0, rr_protocol_discriminator := 6, message_type := SYSTEM_INFORMATION_TYPE_4 (28) }, payload := { si4 := { lai := { mcc_mnc := '262F42'H, lac := 42 }, cell_sel_par := { cell_resel_hyst_2dB := 2, ms_txpwr_max_cch := 7, acs := '0'B, neci := true, rxlev_access_min := 0 }, rach_control := { max_retrans := RACH_MAX_RETRANS_7 (3), tx_integer := '1001'B, cell_barr_access := false, re_not_allowed := true, acc := '0000010000000000'B }, cbch_chan_desc := omit, cbch_mobile_alloc := omit, rest_octets := { sel_params := { presence := '0'B, params := omit }, pwr_offset := { presence := '0'B, offset := omit }, gprs_ind := { presence := '1'B, ind := { ra_colour := 0, si13_pos := '0'B } }, s_presence := '0'B, s := omit } } } } MTC@e4c06fca6070: Setting RSL_SYSTEM_INFO_4 (4): '31061C62F224002A4740E50400012B2B2B2B2B2B2B2B2B'O MTC@e4c06fca6070: Warning: dec_TrxcMessage(): Data remained at the end of the stream after successful decoding: '00'O MTC@e4c06fca6070: Warning: dec_TrxcMessage(): Data remained at the end of the stream after successful decoding: '00'O MTC@e4c06fca6070: Warning: dec_TrxcMessage(): Data remained at the end of the stream after successful decoding: '00'O MTC@e4c06fca6070: setverdict(pass): none -> pass TC_pcu_socket_nsvc_ipv4-RSL(577)@e4c06fca6070: Final verdict of PTC: none TC_pcu_socket_nsvc_ipv4-RSL-IPA(576)@e4c06fca6070: Final verdict of PTC: none IPA-CTRL-CLI-IPA(578)@e4c06fca6070: Final verdict of PTC: none MTC@e4c06fca6070: Setting final verdict of the test case. MTC@e4c06fca6070: Local verdict of MTC: pass MTC@e4c06fca6070: Local verdict of PTC TC_pcu_socket_nsvc_ipv4-RSL-IPA(576): none (pass -> pass) MTC@e4c06fca6070: Local verdict of PTC TC_pcu_socket_nsvc_ipv4-RSL(577): none (pass -> pass) MTC@e4c06fca6070: Local verdict of PTC IPA-CTRL-CLI-IPA(578): none (pass -> pass) MTC@e4c06fca6070: Test case TC_pcu_socket_nsvc_ipv4 finished. Verdict: pass MTC@e4c06fca6070: Starting external command `../ttcn3-tcpdump-stop.sh BTS_Tests.TC_pcu_socket_nsvc_ipv4 pass'. Mon Nov 28 13:05:03 UTC 2022 [1;32m====== BTS_Tests.TC_pcu_socket_nsvc_ipv4 pass ======[0m
Saving talloc report from 172.18.9.20:4241 to BTS_Tests.TC_pcu_socket_nsvc_ipv4.talloc Waiting for packet dumper to finish... 0 (prev_count=-1, count=3250273) Waiting for packet dumper to finish... 1 (prev_count=3250273, count=3255973) MTC@e4c06fca6070: External command `../ttcn3-tcpdump-stop.sh BTS_Tests.TC_pcu_socket_nsvc_ipv4 pass' was executed successfully (exit status: 0). MTC@e4c06fca6070: Starting external command `../ttcn3-tcpdump-start.sh BTS_Tests.TC_pcu_socket_nsvc_ipv6'. ------ BTS_Tests.TC_pcu_socket_nsvc_ipv6 ------ Mon Nov 28 13:05:08 UTC 2022 NOTE: unable to use dumpcap due to missing capabilities or suid bit Waiting for packet dumper to start... 0 MTC@e4c06fca6070: External command `../ttcn3-tcpdump-start.sh BTS_Tests.TC_pcu_socket_nsvc_ipv6' was executed successfully (exit status: 0). MTC@e4c06fca6070: Test case TC_pcu_socket_nsvc_ipv6 started. TC_pcu_socket_nsvc_ipv6-RSL-IPA(579)@e4c06fca6070: Established a new IPA connection (conn_id=2) TC_pcu_socket_nsvc_ipv6-RSL-IPA(579)@e4c06fca6070: CCM Tx:{ msg_type := IPAC_MSGT_ID_GET (4), u := { get := { { len := 1, tag := IPAC_IDTAG_UNITNAME (1) }, { len := 1, tag := IPAC_IDTAG_UNITID (8) } } } } TC_pcu_socket_nsvc_ipv6-RSL(580)@e4c06fca6070: A new IPA/RSL connection has been established (conn_id=2), waiting for IDENTITY RESPONSE... TC_pcu_socket_nsvc_ipv6-RSL-IPA(579)@e4c06fca6070: CCM Rx:{ msg_type := IPAC_MSGT_ID_RESP (5), u := { resp := { { len := 28, tag := IPAC_IDTAG_UNITNAME (1), data := '6F736D6F2D6274732D30322D34322D61632D31322D30392D313400'O }, { len := 10, tag := IPAC_IDTAG_UNITID (8), data := '313233342F302F3000'O } } } } TC_pcu_socket_nsvc_ipv6-RSL-IPA(579)@e4c06fca6070: IPA ID RESP: { { len := 28, tag := IPAC_IDTAG_UNITNAME (1), data := '6F736D6F2D6274732D30322D34322D61632D31322D30392D313400'O }, { len := 10, tag := IPAC_IDTAG_UNITID (8), data := '313233342F302F3000'O } } TC_pcu_socket_nsvc_ipv6-RSL-IPA(579)@e4c06fca6070: CCM Tx:{ msg_type := IPAC_MSGT_ID_ACK (6), u := omit } TC_pcu_socket_nsvc_ipv6-RSL(580)@e4c06fca6070: Got IDENTITY RESPONSE (conn_id=2): { { len := 28, tag := IPAC_IDTAG_UNITNAME (1), data := '6F736D6F2D6274732D30322D34322D61632D31322D30392D313400'O }, { len := 10, tag := IPAC_IDTAG_UNITID (8), data := '313233342F302F3000'O } } TC_pcu_socket_nsvc_ipv6-RSL-IPA(579)@e4c06fca6070: CCM Rx:{ msg_type := IPAC_MSGT_ID_ACK (6), u := omit } TC_pcu_socket_nsvc_ipv6-RSL(580)@e4c06fca6070: Warning: The first argument (instr) of function regexp(), which is "1234/0/0" & char(0, 0, 0, 0), contains a character with zero character code at index 8. The rest of the string will be ignored during matching. TC_pcu_socket_nsvc_ipv6-RSL(580)@e4c06fca6070: Mapped TRX#0 to TCP/IP conn_id=2 MTC@e4c06fca6070: 1/4 transceiver(s) connected TC_pcu_socket_nsvc_ipv6-RSL-IPA(579)@e4c06fca6070: Established a new IPA connection (conn_id=3) TC_pcu_socket_nsvc_ipv6-RSL-IPA(579)@e4c06fca6070: CCM Tx:{ msg_type := IPAC_MSGT_ID_GET (4), u := { get := { { len := 1, tag := IPAC_IDTAG_UNITNAME (1) }, { len := 1, tag := IPAC_IDTAG_UNITID (8) } } } } TC_pcu_socket_nsvc_ipv6-RSL(580)@e4c06fca6070: A new IPA/RSL connection has been established (conn_id=3), waiting for IDENTITY RESPONSE... MTC@e4c06fca6070: 1/4 RF Resource Indication(s) received TC_pcu_socket_nsvc_ipv6-RSL-IPA(579)@e4c06fca6070: CCM Rx:{ msg_type := IPAC_MSGT_ID_RESP (5), u := { resp := { { len := 28, tag := IPAC_IDTAG_UNITNAME (1), data := '6F736D6F2D6274732D30322D34322D61632D31322D30392D313400'O }, { len := 10, tag := IPAC_IDTAG_UNITID (8), data := '313233342F302F3100'O } } } } TC_pcu_socket_nsvc_ipv6-RSL-IPA(579)@e4c06fca6070: IPA ID RESP: { { len := 28, tag := IPAC_IDTAG_UNITNAME (1), data := '6F736D6F2D6274732D30322D34322D61632D31322D30392D313400'O }, { len := 10, tag := IPAC_IDTAG_UNITID (8), data := '313233342F302F3100'O } } TC_pcu_socket_nsvc_ipv6-RSL-IPA(579)@e4c06fca6070: CCM Tx:{ msg_type := IPAC_MSGT_ID_ACK (6), u := omit } TC_pcu_socket_nsvc_ipv6-RSL(580)@e4c06fca6070: Got IDENTITY RESPONSE (conn_id=3): { { len := 28, tag := IPAC_IDTAG_UNITNAME (1), data := '6F736D6F2D6274732D30322D34322D61632D31322D30392D313400'O }, { len := 10, tag := IPAC_IDTAG_UNITID (8), data := '313233342F302F3100'O } } TC_pcu_socket_nsvc_ipv6-RSL(580)@e4c06fca6070: Warning: The first argument (instr) of function regexp(), which is "1234/0/1" & char(0, 0, 0, 0), contains a character with zero character code at index 8. The rest of the string will be ignored during matching. TC_pcu_socket_nsvc_ipv6-RSL(580)@e4c06fca6070: Mapped TRX#1 to TCP/IP conn_id=3 TC_pcu_socket_nsvc_ipv6-RSL-IPA(579)@e4c06fca6070: CCM Rx:{ msg_type := IPAC_MSGT_ID_ACK (6), u := omit } MTC@e4c06fca6070: 2/4 transceiver(s) connected TC_pcu_socket_nsvc_ipv6-RSL-IPA(579)@e4c06fca6070: Established a new IPA connection (conn_id=4) TC_pcu_socket_nsvc_ipv6-RSL-IPA(579)@e4c06fca6070: CCM Tx:{ msg_type := IPAC_MSGT_ID_GET (4), u := { get := { { len := 1, tag := IPAC_IDTAG_UNITNAME (1) }, { len := 1, tag := IPAC_IDTAG_UNITID (8) } } } } TC_pcu_socket_nsvc_ipv6-RSL(580)@e4c06fca6070: A new IPA/RSL connection has been established (conn_id=4), waiting for IDENTITY RESPONSE... MTC@e4c06fca6070: 2/4 RF Resource Indication(s) received TC_pcu_socket_nsvc_ipv6-RSL-IPA(579)@e4c06fca6070: Established a new IPA connection (conn_id=5) TC_pcu_socket_nsvc_ipv6-RSL-IPA(579)@e4c06fca6070: CCM Tx:{ msg_type := IPAC_MSGT_ID_GET (4), u := { get := { { len := 1, tag := IPAC_IDTAG_UNITNAME (1) }, { len := 1, tag := IPAC_IDTAG_UNITID (8) } } } } TC_pcu_socket_nsvc_ipv6-RSL-IPA(579)@e4c06fca6070: CCM Rx:{ msg_type := IPAC_MSGT_ID_RESP (5), u := { resp := { { len := 28, tag := IPAC_IDTAG_UNITNAME (1), data := '6F736D6F2D6274732D30322D34322D61632D31322D30392D313400'O }, { len := 10, tag := IPAC_IDTAG_UNITID (8), data := '313233342F302F3200'O } } } } TC_pcu_socket_nsvc_ipv6-RSL-IPA(579)@e4c06fca6070: IPA ID RESP: { { len := 28, tag := IPAC_IDTAG_UNITNAME (1), data := '6F736D6F2D6274732D30322D34322D61632D31322D30392D313400'O }, { len := 10, tag := IPAC_IDTAG_UNITID (8), data := '313233342F302F3200'O } } TC_pcu_socket_nsvc_ipv6-RSL-IPA(579)@e4c06fca6070: CCM Tx:{ msg_type := IPAC_MSGT_ID_ACK (6), u := omit } TC_pcu_socket_nsvc_ipv6-RSL-IPA(579)@e4c06fca6070: CCM Rx:{ msg_type := IPAC_MSGT_ID_ACK (6), u := omit } TC_pcu_socket_nsvc_ipv6-RSL(580)@e4c06fca6070: A new IPA/RSL connection has been established (conn_id=5), waiting for IDENTITY RESPONSE... TC_pcu_socket_nsvc_ipv6-RSL(580)@e4c06fca6070: Got IDENTITY RESPONSE (conn_id=4): { { len := 28, tag := IPAC_IDTAG_UNITNAME (1), data := '6F736D6F2D6274732D30322D34322D61632D31322D30392D313400'O }, { len := 10, tag := IPAC_IDTAG_UNITID (8), data := '313233342F302F3200'O } } TC_pcu_socket_nsvc_ipv6-RSL(580)@e4c06fca6070: Warning: The first argument (instr) of function regexp(), which is "1234/0/2" & char(0, 0, 0, 0), contains a character with zero character code at index 8. The rest of the string will be ignored during matching. TC_pcu_socket_nsvc_ipv6-RSL(580)@e4c06fca6070: Mapped TRX#2 to TCP/IP conn_id=4 MTC@e4c06fca6070: 3/4 transceiver(s) connected TC_pcu_socket_nsvc_ipv6-RSL-IPA(579)@e4c06fca6070: CCM Rx:{ msg_type := IPAC_MSGT_ID_RESP (5), u := { resp := { { len := 28, tag := IPAC_IDTAG_UNITNAME (1), data := '6F736D6F2D6274732D30322D34322D61632D31322D30392D313400'O }, { len := 10, tag := IPAC_IDTAG_UNITID (8), data := '313233342F302F3300'O } } } } MTC@e4c06fca6070: 3/4 RF Resource Indication(s) received TC_pcu_socket_nsvc_ipv6-RSL-IPA(579)@e4c06fca6070: IPA ID RESP: { { len := 28, tag := IPAC_IDTAG_UNITNAME (1), data := '6F736D6F2D6274732D30322D34322D61632D31322D30392D313400'O }, { len := 10, tag := IPAC_IDTAG_UNITID (8), data := '313233342F302F3300'O } } TC_pcu_socket_nsvc_ipv6-RSL(580)@e4c06fca6070: Got IDENTITY RESPONSE (conn_id=5): { { len := 28, tag := IPAC_IDTAG_UNITNAME (1), data := '6F736D6F2D6274732D30322D34322D61632D31322D30392D313400'O }, { len := 10, tag := IPAC_IDTAG_UNITID (8), data := '313233342F302F3300'O } } TC_pcu_socket_nsvc_ipv6-RSL(580)@e4c06fca6070: Warning: The first argument (instr) of function regexp(), which is "1234/0/3" & char(0, 0, 0, 0), contains a character with zero character code at index 8. The rest of the string will be ignored during matching. TC_pcu_socket_nsvc_ipv6-RSL(580)@e4c06fca6070: Mapped TRX#3 to TCP/IP conn_id=5 TC_pcu_socket_nsvc_ipv6-RSL-IPA(579)@e4c06fca6070: CCM Tx:{ msg_type := IPAC_MSGT_ID_ACK (6), u := omit } MTC@e4c06fca6070: 4/4 transceiver(s) connected TC_pcu_socket_nsvc_ipv6-RSL-IPA(579)@e4c06fca6070: CCM Rx:{ msg_type := IPAC_MSGT_ID_ACK (6), u := omit } MTC@e4c06fca6070: 4/4 RF Resource Indication(s) received MTC@e4c06fca6070: Setting RSL_SYSTEM_INFO_3 (3): { header := { l2_plen := { l2_plen := 18, zero_one := '01'B }, skip_indicator := 0, rr_protocol_discriminator := 6, message_type := SYSTEM_INFORMATION_TYPE_3 (27) }, payload := { si3 := { cell_id := 23, lai := { mcc_mnc := '262F42'H, lac := 42 }, ctrl_chan_desc := { msc_r99 := true, att := true, bs_ag_blks_res := 1, ccch_conf := CCHAN_DESC_1CCCH_COMBINED (1), si22ind := false, cbq3 := CBQ3_IU_MODE_NOT_SUPPORTED (0), spare := '00'B, bs_pa_mfrms := 0, t3212 := 1 }, cell_options := { dn_ind := false, pwrc := false, dtx := MS_MAY_USE_UL_DTX (0), radio_link_tout_div4 := 7 }, cell_sel_par := { cell_resel_hyst_2dB := 2, ms_txpwr_max_cch := 7, acs := '0'B, neci := true, rxlev_access_min := 0 }, rach_control := { max_retrans := RACH_MAX_RETRANS_7 (3), tx_integer := '1001'B, cell_barr_access := false, re_not_allowed := true, acc := '0000010000000000'B }, rest_octets := { sel_params := { presence := '0'B, params := omit }, pwr_offset := { presence := '0'B, offset := omit }, si_2ter_ind := '0'B, early_cm_ind := '0'B, sched_where := { presence := '0'B, where := omit }, gprs_ind := { presence := '1'B, ind := { ra_colour := 0, si13_pos := '0'B } }, umts_early_cm_ind := '0'B, si2_quater_ind := { presence := '0'B, ind := omit }, iu_mode_ind := omit, si21_ind := { presence := '0'B, pos := omit } } } } } MTC@e4c06fca6070: Setting RSL_SYSTEM_INFO_3 (3): '49061B001762F224002AC90001074740E504002C2B2B2B'O MTC@e4c06fca6070: Setting RSL_SYSTEM_INFO_2 (2): { header := { l2_plen := { l2_plen := 22, zero_one := '01'B }, skip_indicator := 0, rr_protocol_discriminator := 6, message_type := SYSTEM_INFORMATION_TYPE_2 (26) }, payload := { si2 := { bcch_freq_list := '00000000000000000000000000000000'O, ncc_permitted := '11111111'B, rach_control := { max_retrans := RACH_MAX_RETRANS_7 (3), tx_integer := '1001'B, cell_barr_access := false, re_not_allowed := true, acc := '0000010000000000'B } } } } MTC@e4c06fca6070: Setting RSL_SYSTEM_INFO_2 (2): '59061A00000000000000000000000000000000FFE50400'O MTC@e4c06fca6070: Setting RSL_SYSTEM_INFO_4 (4): { header := { l2_plen := { l2_plen := 12, zero_one := '01'B }, skip_indicator := 0, rr_protocol_discriminator := 6, message_type := SYSTEM_INFORMATION_TYPE_4 (28) }, payload := { si4 := { lai := { mcc_mnc := '262F42'H, lac := 42 }, cell_sel_par := { cell_resel_hyst_2dB := 2, ms_txpwr_max_cch := 7, acs := '0'B, neci := true, rxlev_access_min := 0 }, rach_control := { max_retrans := RACH_MAX_RETRANS_7 (3), tx_integer := '1001'B, cell_barr_access := false, re_not_allowed := true, acc := '0000010000000000'B }, cbch_chan_desc := omit, cbch_mobile_alloc := omit, rest_octets := { sel_params := { presence := '0'B, params := omit }, pwr_offset := { presence := '0'B, offset := omit }, gprs_ind := { presence := '1'B, ind := { ra_colour := 0, si13_pos := '0'B } }, s_presence := '0'B, s := omit } } } } MTC@e4c06fca6070: Setting RSL_SYSTEM_INFO_4 (4): '31061C62F224002A4740E50400012B2B2B2B2B2B2B2B2B'O MTC@e4c06fca6070: Warning: dec_TrxcMessage(): Data remained at the end of the stream after successful decoding: '00'O MTC@e4c06fca6070: Warning: dec_TrxcMessage(): Data remained at the end of the stream after successful decoding: '00'O MTC@e4c06fca6070: Warning: dec_TrxcMessage(): Data remained at the end of the stream after successful decoding: '00'O MTC@e4c06fca6070: setverdict(pass): none -> pass TC_pcu_socket_nsvc_ipv6-RSL(580)@e4c06fca6070: Final verdict of PTC: none IPA-CTRL-CLI-IPA(581)@e4c06fca6070: Final verdict of PTC: none TC_pcu_socket_nsvc_ipv6-RSL-IPA(579)@e4c06fca6070: Final verdict of PTC: none MTC@e4c06fca6070: Setting final verdict of the test case. MTC@e4c06fca6070: Local verdict of MTC: pass MTC@e4c06fca6070: Local verdict of PTC TC_pcu_socket_nsvc_ipv6-RSL-IPA(579): none (pass -> pass) MTC@e4c06fca6070: Local verdict of PTC TC_pcu_socket_nsvc_ipv6-RSL(580): none (pass -> pass) MTC@e4c06fca6070: Local verdict of PTC IPA-CTRL-CLI-IPA(581): none (pass -> pass) MTC@e4c06fca6070: Test case TC_pcu_socket_nsvc_ipv6 finished. Verdict: pass MTC@e4c06fca6070: Starting external command `../ttcn3-tcpdump-stop.sh BTS_Tests.TC_pcu_socket_nsvc_ipv6 pass'. Mon Nov 28 13:05:14 UTC 2022 [1;32m====== BTS_Tests.TC_pcu_socket_nsvc_ipv6 pass ======[0m
Saving talloc report from 172.18.9.20:4241 to BTS_Tests.TC_pcu_socket_nsvc_ipv6.talloc
ERROR: failed to get talloc report via vty
Waiting for packet dumper to finish... 0 (prev_count=-1, count=2757195)
gzip: /data/BTS_Tests.TC_pcu_socket_nsvc_ipv6.pcap.gz: No space left on device Fatal error during logging: Writing to log file failed. (No space left on device) Exiting. Error: Unexpected end of MTC connection from e4c06fca6070 [172.18.9.10]. MC@e4c06fca6070: The control connection to MTC is lost. Destroying all PTC connections. MC@e4c06fca6070: MTC terminated. ttcn3_start: error: the MTC terminated unexpectedly exit MC@e4c06fca6070: Shutting down session. MC@e4c06fca6070: Shutdown complete. Fatal error during logging: Writing to log file failed. (No space left on device) Exiting.
Comparing expected results '/osmo-ttcn3-hacks/bts/expected-results.xml' against results in 'junit-xml-21.log' --------------------
Summary: [1;34mskip[0;m: 222
+ exit_code=0 + /osmo-ttcn3-hacks/log_merge.sh BTS_Tests --rm Generated BTS_Tests.TC_chan_act_react.merged FATAL: command execution failed java.io.EOFException at java.base/java.io.ObjectInputStream$PeekInputStream.readFully(ObjectInputStream.java:2905) at java.base/java.io.ObjectInputStream$BlockDataInputStream.readShort(ObjectInputStream.java:3400) at java.base/java.io.ObjectInputStream.readStreamHeader(ObjectInputStream.java:936) at java.base/java.io.ObjectInputStream.<init>(ObjectInputStream.java:379) at hudson.remoting.ObjectInputStreamEx.<init>(ObjectInputStreamEx.java:49) at hudson.remoting.Command.readFrom(Command.java:142) at hudson.remoting.Command.readFrom(Command.java:128) at hudson.remoting.AbstractSynchronousByteArrayCommandTransport.read(AbstractSynchronousByteArrayCommandTransport.java:35) at hudson.remoting.SynchronousCommandTransport$ReaderThread.run(SynchronousCommandTransport.java:61) Caused: java.io.IOException: Unexpected termination of the channel at hudson.remoting.SynchronousCommandTransport$ReaderThread.run(SynchronousCommandTransport.java:75) Caused: java.io.IOException: Backing channel 'gtp0-deb9build' is disconnected. at hudson.remoting.RemoteInvocationHandler.channelOrFail(RemoteInvocationHandler.java:215) at hudson.remoting.RemoteInvocationHandler.invoke(RemoteInvocationHandler.java:285) at com.sun.proxy.$Proxy77.isAlive(Unknown Source) at hudson.Launcher$RemoteLauncher$ProcImpl.isAlive(Launcher.java:1215) at hudson.Launcher$RemoteLauncher$ProcImpl.join(Launcher.java:1207) at hudson.tasks.CommandInterpreter.join(CommandInterpreter.java:195) at hudson.tasks.CommandInterpreter.perform(CommandInterpreter.java:145) at hudson.tasks.CommandInterpreter.perform(CommandInterpreter.java:92) at hudson.tasks.BuildStepMonitor$1.perform(BuildStepMonitor.java:20) at hudson.model.AbstractBuild$AbstractBuildExecution.perform(AbstractBuild.java:814) at hudson.model.Build$BuildExecution.build(Build.java:199) at hudson.model.Build$BuildExecution.doRun(Build.java:164) at hudson.model.AbstractBuild$AbstractBuildExecution.run(AbstractBuild.java:522) at hudson.model.Run.execute(Run.java:1896) at hudson.model.FreeStyleBuild.run(FreeStyleBuild.java:44) at hudson.model.ResourceController.execute(ResourceController.java:101) at hudson.model.Executor.run(Executor.java:442) FATAL: Unable to delete script file /tmp/jenkins181056133916217001.sh java.io.EOFException at java.base/java.io.ObjectInputStream$PeekInputStream.readFully(ObjectInputStream.java:2905) at java.base/java.io.ObjectInputStream$BlockDataInputStream.readShort(ObjectInputStream.java:3400) at java.base/java.io.ObjectInputStream.readStreamHeader(ObjectInputStream.java:936) at java.base/java.io.ObjectInputStream.<init>(ObjectInputStream.java:379) at hudson.remoting.ObjectInputStreamEx.<init>(ObjectInputStreamEx.java:49) at hudson.remoting.Command.readFrom(Command.java:142) at hudson.remoting.Command.readFrom(Command.java:128) at hudson.remoting.AbstractSynchronousByteArrayCommandTransport.read(AbstractSynchronousByteArrayCommandTransport.java:35) at hudson.remoting.SynchronousCommandTransport$ReaderThread.run(SynchronousCommandTransport.java:61) Caused: java.io.IOException: Unexpected termination of the channel at hudson.remoting.SynchronousCommandTransport$ReaderThread.run(SynchronousCommandTransport.java:75) Caused: hudson.remoting.ChannelClosedException: Channel "hudson.remoting.Channel@145206d7:gtp0-deb9build": Remote call on gtp0-deb9build failed. The channel is closing down or has closed down at hudson.remoting.Channel.call(Channel.java:993) at hudson.FilePath.act(FilePath.java:1194) at hudson.FilePath.act(FilePath.java:1183) at hudson.FilePath.delete(FilePath.java:1730) at hudson.tasks.CommandInterpreter.perform(CommandInterpreter.java:163) at hudson.tasks.CommandInterpreter.perform(CommandInterpreter.java:92) at hudson.tasks.BuildStepMonitor$1.perform(BuildStepMonitor.java:20) at hudson.model.AbstractBuild$AbstractBuildExecution.perform(AbstractBuild.java:814) at hudson.model.Build$BuildExecution.build(Build.java:199) at hudson.model.Build$BuildExecution.doRun(Build.java:164) at hudson.model.AbstractBuild$AbstractBuildExecution.run(AbstractBuild.java:522) at hudson.model.Run.execute(Run.java:1896) at hudson.model.FreeStyleBuild.run(FreeStyleBuild.java:44) at hudson.model.ResourceController.execute(ResourceController.java:101) at hudson.model.Executor.run(Executor.java:442) Build step 'Execute shell' marked build as failure ERROR: Step ‘Publish JUnit test result report’ failed: no workspace for TTCN3-centos-bts-test-2022q2 #160
See https://jenkins.osmocom.org/jenkins/job/TTCN3-centos-bts-test-2022q2/161/display/redirect
Changes:
------------------------------------------ [...truncated 3.97 MB...] TC_rll_est_ind(634)@1d681ca672cf: setverdict(pass): none -> pass TC_rll_est_ind(634)@1d681ca672cf: setverdict(pass): pass -> pass, component reason not changed TC_rll_est_ind(634)@1d681ca672cf: setverdict(pass): pass -> pass, component reason not changed TC_rll_est_ind(634)@1d681ca672cf: Final verdict of PTC: pass MTC@1d681ca672cf: "TC_rll_est_ind": XXX Starting { sapi := 3, link_id := { c := SACCH (1), na := false, prio := SAPI0_PRIO_NORMAL (0), sapi := 3 }, l3 := '01020304'O, exp := false } on { u := { sdcch8 := { tag := '01'B, sub_chan := 4 } }, tn := 6 } TC_rll_est_ind(635)@1d681ca672cf: setverdict(pass): none -> pass TC_rll_est_ind(635)@1d681ca672cf: setverdict(pass): pass -> pass, component reason not changed TC_rll_est_ind(635)@1d681ca672cf: setverdict(pass): pass -> pass, component reason not changed TC_rll_est_ind(635)@1d681ca672cf: Final verdict of PTC: pass MTC@1d681ca672cf: "TC_rll_est_ind": XXX Starting { sapi := 3, link_id := { c := FACCH_SDCCH (0), na := false, prio := SAPI0_PRIO_NORMAL (0), sapi := 3 }, l3 := ''O, exp := true } on { u := { sdcch8 := { tag := '01'B, sub_chan := 4 } }, tn := 6 } TC_rll_est_ind(636)@1d681ca672cf: setverdict(pass): none -> pass TC_rll_est_ind(636)@1d681ca672cf: setverdict(pass): pass -> pass, component reason not changed TC_rll_est_ind(636)@1d681ca672cf: setverdict(pass): pass -> pass, component reason not changed TC_rll_est_ind(636)@1d681ca672cf: Final verdict of PTC: pass MTC@1d681ca672cf: "TC_rll_est_ind": XXX Starting { sapi := 3, link_id := { c := SACCH (1), na := false, prio := SAPI0_PRIO_NORMAL (0), sapi := 3 }, l3 := ''O, exp := true } on { u := { sdcch8 := { tag := '01'B, sub_chan := 4 } }, tn := 6 } TC_rll_est_ind(637)@1d681ca672cf: setverdict(pass): none -> pass TC_rll_est_ind(637)@1d681ca672cf: setverdict(pass): pass -> pass, component reason not changed TC_rll_est_ind(637)@1d681ca672cf: setverdict(pass): pass -> pass, component reason not changed TC_rll_est_ind(637)@1d681ca672cf: Final verdict of PTC: pass MTC@1d681ca672cf: Stopping testcase execution from "BTS_Tests.ttcn":7100 TC_rll_est_ind-RSL(612)@1d681ca672cf: Final verdict of PTC: none IPA-CTRL-CLI-IPA(613)@1d681ca672cf: Final verdict of PTC: none TC_rll_est_ind-RSL-IPA(611)@1d681ca672cf: Final verdict of PTC: none MTC@1d681ca672cf: Setting final verdict of the test case. MTC@1d681ca672cf: Local verdict of MTC: none MTC@1d681ca672cf: Local verdict of PTC TC_rll_est_ind-RSL-IPA(611): none (none -> none) MTC@1d681ca672cf: Local verdict of PTC TC_rll_est_ind-RSL(612): none (none -> none) MTC@1d681ca672cf: Local verdict of PTC IPA-CTRL-CLI-IPA(613): none (none -> none) MTC@1d681ca672cf: Local verdict of PTC TC_rll_est_ind(614): pass (none -> pass) MTC@1d681ca672cf: Local verdict of PTC TC_rll_est_ind(615): pass (pass -> pass) MTC@1d681ca672cf: Local verdict of PTC TC_rll_est_ind(616): pass (pass -> pass) MTC@1d681ca672cf: Local verdict of PTC TC_rll_est_ind(617): pass (pass -> pass) MTC@1d681ca672cf: Local verdict of PTC TC_rll_est_ind(618): pass (pass -> pass) MTC@1d681ca672cf: Local verdict of PTC TC_rll_est_ind(619): pass (pass -> pass) MTC@1d681ca672cf: Local verdict of PTC TC_rll_est_ind(620): pass (pass -> pass) MTC@1d681ca672cf: Local verdict of PTC TC_rll_est_ind(621): pass (pass -> pass) MTC@1d681ca672cf: Local verdict of PTC TC_rll_est_ind(622): pass (pass -> pass) MTC@1d681ca672cf: Local verdict of PTC TC_rll_est_ind(623): pass (pass -> pass) MTC@1d681ca672cf: Local verdict of PTC TC_rll_est_ind(624): pass (pass -> pass) MTC@1d681ca672cf: Local verdict of PTC TC_rll_est_ind(625): pass (pass -> pass) MTC@1d681ca672cf: Local verdict of PTC TC_rll_est_ind(626): pass (pass -> pass) MTC@1d681ca672cf: Local verdict of PTC TC_rll_est_ind(627): pass (pass -> pass) MTC@1d681ca672cf: Local verdict of PTC TC_rll_est_ind(628): pass (pass -> pass) MTC@1d681ca672cf: Local verdict of PTC TC_rll_est_ind(629): pass (pass -> pass) MTC@1d681ca672cf: Local verdict of PTC TC_rll_est_ind(630): pass (pass -> pass) MTC@1d681ca672cf: Local verdict of PTC TC_rll_est_ind(631): pass (pass -> pass) MTC@1d681ca672cf: Local verdict of PTC TC_rll_est_ind(632): pass (pass -> pass) MTC@1d681ca672cf: Local verdict of PTC TC_rll_est_ind(633): pass (pass -> pass) MTC@1d681ca672cf: Local verdict of PTC TC_rll_est_ind(634): pass (pass -> pass) MTC@1d681ca672cf: Local verdict of PTC TC_rll_est_ind(635): pass (pass -> pass) MTC@1d681ca672cf: Local verdict of PTC TC_rll_est_ind(636): pass (pass -> pass) MTC@1d681ca672cf: Local verdict of PTC TC_rll_est_ind(637): pass (pass -> pass) MTC@1d681ca672cf: Test case TC_rll_est_ind finished. Verdict: pass MTC@1d681ca672cf: Starting external command `../ttcn3-tcpdump-stop.sh BTS_Tests.TC_rll_est_ind pass'. Mon Nov 28 21:57:44 UTC 2022 [1;32m====== BTS_Tests.TC_rll_est_ind pass ======[0m
Saving talloc report from 172.18.9.20:4241 to BTS_Tests.TC_rll_est_ind.talloc Waiting for packet dumper to finish... 0 (prev_count=-1, count=33993078) Waiting for packet dumper to finish... 1 (prev_count=33993078, count=34426648) gzip: /data/BTS_Tests.TC_rll_est_ind.pcap: file size changed while zipping MTC@1d681ca672cf: External command `../ttcn3-tcpdump-stop.sh BTS_Tests.TC_rll_est_ind pass' was executed successfully (exit status: 0). MTC@1d681ca672cf: Starting external command `../ttcn3-tcpdump-start.sh BTS_Tests.TC_rll_est_req_DCCH_3'. ------ BTS_Tests.TC_rll_est_req_DCCH_3 ------ Mon Nov 28 21:57:49 UTC 2022 NOTE: unable to use dumpcap due to missing capabilities or suid bit Waiting for packet dumper to start... 0 MTC@1d681ca672cf: External command `../ttcn3-tcpdump-start.sh BTS_Tests.TC_rll_est_req_DCCH_3' was executed successfully (exit status: 0). MTC@1d681ca672cf: Test case TC_rll_est_req_DCCH_3 started. TC_rll_est_req_DCCH_3-RSL-IPA(638)@1d681ca672cf: Established a new IPA connection (conn_id=2) TC_rll_est_req_DCCH_3-RSL-IPA(638)@1d681ca672cf: CCM Tx:{ msg_type := IPAC_MSGT_ID_GET (4), u := { get := { { len := 1, tag := IPAC_IDTAG_UNITNAME (1) }, { len := 1, tag := IPAC_IDTAG_UNITID (8) } } } } TC_rll_est_req_DCCH_3-RSL(639)@1d681ca672cf: A new IPA/RSL connection has been established (conn_id=2), waiting for IDENTITY RESPONSE... TC_rll_est_req_DCCH_3-RSL-IPA(638)@1d681ca672cf: CCM Rx:{ msg_type := IPAC_MSGT_ID_RESP (5), u := { resp := { { len := 28, tag := IPAC_IDTAG_UNITNAME (1), data := '6F736D6F2D6274732D30322D34322D61632D31322D30392D313400'O }, { len := 10, tag := IPAC_IDTAG_UNITID (8), data := '313233342F302F3000'O } } } } TC_rll_est_req_DCCH_3-RSL-IPA(638)@1d681ca672cf: IPA ID RESP: { { len := 28, tag := IPAC_IDTAG_UNITNAME (1), data := '6F736D6F2D6274732D30322D34322D61632D31322D30392D313400'O }, { len := 10, tag := IPAC_IDTAG_UNITID (8), data := '313233342F302F3000'O } } TC_rll_est_req_DCCH_3-RSL-IPA(638)@1d681ca672cf: CCM Tx:{ msg_type := IPAC_MSGT_ID_ACK (6), u := omit } TC_rll_est_req_DCCH_3-RSL(639)@1d681ca672cf: Got IDENTITY RESPONSE (conn_id=2): { { len := 28, tag := IPAC_IDTAG_UNITNAME (1), data := '6F736D6F2D6274732D30322D34322D61632D31322D30392D313400'O }, { len := 10, tag := IPAC_IDTAG_UNITID (8), data := '313233342F302F3000'O } } TC_rll_est_req_DCCH_3-RSL-IPA(638)@1d681ca672cf: CCM Rx:{ msg_type := IPAC_MSGT_ID_ACK (6), u := omit } TC_rll_est_req_DCCH_3-RSL(639)@1d681ca672cf: Warning: The first argument (instr) of function regexp(), which is "1234/0/0" & char(0, 0, 0, 0), contains a character with zero character code at index 8. The rest of the string will be ignored during matching. TC_rll_est_req_DCCH_3-RSL(639)@1d681ca672cf: Mapped TRX#0 to TCP/IP conn_id=2 MTC@1d681ca672cf: 1/4 transceiver(s) connected TC_rll_est_req_DCCH_3-RSL-IPA(638)@1d681ca672cf: Established a new IPA connection (conn_id=3) TC_rll_est_req_DCCH_3-RSL-IPA(638)@1d681ca672cf: CCM Tx:{ msg_type := IPAC_MSGT_ID_GET (4), u := { get := { { len := 1, tag := IPAC_IDTAG_UNITNAME (1) }, { len := 1, tag := IPAC_IDTAG_UNITID (8) } } } } TC_rll_est_req_DCCH_3-RSL(639)@1d681ca672cf: A new IPA/RSL connection has been established (conn_id=3), waiting for IDENTITY RESPONSE... MTC@1d681ca672cf: 1/4 RF Resource Indication(s) received TC_rll_est_req_DCCH_3-RSL-IPA(638)@1d681ca672cf: CCM Rx:{ msg_type := IPAC_MSGT_ID_RESP (5), u := { resp := { { len := 28, tag := IPAC_IDTAG_UNITNAME (1), data := '6F736D6F2D6274732D30322D34322D61632D31322D30392D313400'O }, { len := 10, tag := IPAC_IDTAG_UNITID (8), data := '313233342F302F3100'O } } } } TC_rll_est_req_DCCH_3-RSL-IPA(638)@1d681ca672cf: IPA ID RESP: { { len := 28, tag := IPAC_IDTAG_UNITNAME (1), data := '6F736D6F2D6274732D30322D34322D61632D31322D30392D313400'O }, { len := 10, tag := IPAC_IDTAG_UNITID (8), data := '313233342F302F3100'O } } TC_rll_est_req_DCCH_3-RSL-IPA(638)@1d681ca672cf: CCM Tx:{ msg_type := IPAC_MSGT_ID_ACK (6), u := omit } TC_rll_est_req_DCCH_3-RSL(639)@1d681ca672cf: Got IDENTITY RESPONSE (conn_id=3): { { len := 28, tag := IPAC_IDTAG_UNITNAME (1), data := '6F736D6F2D6274732D30322D34322D61632D31322D30392D313400'O }, { len := 10, tag := IPAC_IDTAG_UNITID (8), data := '313233342F302F3100'O } } TC_rll_est_req_DCCH_3-RSL(639)@1d681ca672cf: Warning: The first argument (instr) of function regexp(), which is "1234/0/1" & char(0, 0, 0, 0), contains a character with zero character code at index 8. The rest of the string will be ignored during matching. TC_rll_est_req_DCCH_3-RSL(639)@1d681ca672cf: Mapped TRX#1 to TCP/IP conn_id=3 TC_rll_est_req_DCCH_3-RSL-IPA(638)@1d681ca672cf: CCM Rx:{ msg_type := IPAC_MSGT_ID_ACK (6), u := omit } MTC@1d681ca672cf: 2/4 transceiver(s) connected TC_rll_est_req_DCCH_3-RSL-IPA(638)@1d681ca672cf: Established a new IPA connection (conn_id=4) TC_rll_est_req_DCCH_3-RSL-IPA(638)@1d681ca672cf: CCM Tx:{ msg_type := IPAC_MSGT_ID_GET (4), u := { get := { { len := 1, tag := IPAC_IDTAG_UNITNAME (1) }, { len := 1, tag := IPAC_IDTAG_UNITID (8) } } } } TC_rll_est_req_DCCH_3-RSL(639)@1d681ca672cf: A new IPA/RSL connection has been established (conn_id=4), waiting for IDENTITY RESPONSE... TC_rll_est_req_DCCH_3-RSL(639)@1d681ca672cf: A new IPA/RSL connection has been established (conn_id=5), waiting for IDENTITY RESPONSE... MTC@1d681ca672cf: 2/4 RF Resource Indication(s) received TC_rll_est_req_DCCH_3-RSL-IPA(638)@1d681ca672cf: Established a new IPA connection (conn_id=5) TC_rll_est_req_DCCH_3-RSL-IPA(638)@1d681ca672cf: CCM Tx:{ msg_type := IPAC_MSGT_ID_GET (4), u := { get := { { len := 1, tag := IPAC_IDTAG_UNITNAME (1) }, { len := 1, tag := IPAC_IDTAG_UNITID (8) } } } } TC_rll_est_req_DCCH_3-RSL-IPA(638)@1d681ca672cf: CCM Rx:{ msg_type := IPAC_MSGT_ID_RESP (5), u := { resp := { { len := 28, tag := IPAC_IDTAG_UNITNAME (1), data := '6F736D6F2D6274732D30322D34322D61632D31322D30392D313400'O }, { len := 10, tag := IPAC_IDTAG_UNITID (8), data := '313233342F302F3200'O } } } } TC_rll_est_req_DCCH_3-RSL-IPA(638)@1d681ca672cf: IPA ID RESP: { { len := 28, tag := IPAC_IDTAG_UNITNAME (1), data := '6F736D6F2D6274732D30322D34322D61632D31322D30392D313400'O }, { len := 10, tag := IPAC_IDTAG_UNITID (8), data := '313233342F302F3200'O } } TC_rll_est_req_DCCH_3-RSL-IPA(638)@1d681ca672cf: CCM Tx:{ msg_type := IPAC_MSGT_ID_ACK (6), u := omit } TC_rll_est_req_DCCH_3-RSL(639)@1d681ca672cf: Got IDENTITY RESPONSE (conn_id=4): { { len := 28, tag := IPAC_IDTAG_UNITNAME (1), data := '6F736D6F2D6274732D30322D34322D61632D31322D30392D313400'O }, { len := 10, tag := IPAC_IDTAG_UNITID (8), data := '313233342F302F3200'O } } TC_rll_est_req_DCCH_3-RSL(639)@1d681ca672cf: Warning: The first argument (instr) of function regexp(), which is "1234/0/2" & char(0, 0, 0, 0), contains a character with zero character code at index 8. The rest of the string will be ignored during matching. TC_rll_est_req_DCCH_3-RSL(639)@1d681ca672cf: Mapped TRX#2 to TCP/IP conn_id=4 TC_rll_est_req_DCCH_3-RSL-IPA(638)@1d681ca672cf: CCM Rx:{ msg_type := IPAC_MSGT_ID_ACK (6), u := omit } MTC@1d681ca672cf: 3/4 transceiver(s) connected MTC@1d681ca672cf: 3/4 RF Resource Indication(s) received TC_rll_est_req_DCCH_3-RSL-IPA(638)@1d681ca672cf: CCM Rx:{ msg_type := IPAC_MSGT_ID_RESP (5), u := { resp := { { len := 28, tag := IPAC_IDTAG_UNITNAME (1), data := '6F736D6F2D6274732D30322D34322D61632D31322D30392D313400'O }, { len := 10, tag := IPAC_IDTAG_UNITID (8), data := '313233342F302F3300'O } } } } TC_rll_est_req_DCCH_3-RSL-IPA(638)@1d681ca672cf: IPA ID RESP: { { len := 28, tag := IPAC_IDTAG_UNITNAME (1), data := '6F736D6F2D6274732D30322D34322D61632D31322D30392D313400'O }, { len := 10, tag := IPAC_IDTAG_UNITID (8), data := '313233342F302F3300'O } } TC_rll_est_req_DCCH_3-RSL-IPA(638)@1d681ca672cf: CCM Tx:{ msg_type := IPAC_MSGT_ID_ACK (6), u := omit } TC_rll_est_req_DCCH_3-RSL(639)@1d681ca672cf: Got IDENTITY RESPONSE (conn_id=5): { { len := 28, tag := IPAC_IDTAG_UNITNAME (1), data := '6F736D6F2D6274732D30322D34322D61632D31322D30392D313400'O }, { len := 10, tag := IPAC_IDTAG_UNITID (8), data := '313233342F302F3300'O } } TC_rll_est_req_DCCH_3-RSL(639)@1d681ca672cf: Warning: The first argument (instr) of function regexp(), which is "1234/0/3" & char(0, 0, 0, 0), contains a character with zero character code at index 8. The rest of the string will be ignored during matching. TC_rll_est_req_DCCH_3-RSL(639)@1d681ca672cf: Mapped TRX#3 to TCP/IP conn_id=5 TC_rll_est_req_DCCH_3-RSL-IPA(638)@1d681ca672cf: CCM Rx:{ msg_type := IPAC_MSGT_ID_ACK (6), u := omit } MTC@1d681ca672cf: 4/4 transceiver(s) connected MTC@1d681ca672cf: 4/4 RF Resource Indication(s) received MTC@1d681ca672cf: Setting RSL_SYSTEM_INFO_3 (3): { header := { l2_plen := { l2_plen := 18, zero_one := '01'B }, skip_indicator := 0, rr_protocol_discriminator := 6, message_type := SYSTEM_INFORMATION_TYPE_3 (27) }, payload := { si3 := { cell_id := 23, lai := { mcc_mnc := '262F42'H, lac := 42 }, ctrl_chan_desc := { msc_r99 := true, att := true, bs_ag_blks_res := 1, ccch_conf := CCHAN_DESC_1CCCH_COMBINED (1), si22ind := false, cbq3 := CBQ3_IU_MODE_NOT_SUPPORTED (0), spare := '00'B, bs_pa_mfrms := 0, t3212 := 1 }, cell_options := { dn_ind := false, pwrc := false, dtx := MS_MAY_USE_UL_DTX (0), radio_link_tout_div4 := 7 }, cell_sel_par := { cell_resel_hyst_2dB := 2, ms_txpwr_max_cch := 7, acs := '0'B, neci := true, rxlev_access_min := 0 }, rach_control := { max_retrans := RACH_MAX_RETRANS_7 (3), tx_integer := '1001'B, cell_barr_access := false, re_not_allowed := true, acc := '0000010000000000'B }, rest_octets := { sel_params := { presence := '0'B, params := omit }, pwr_offset := { presence := '0'B, offset := omit }, si_2ter_ind := '0'B, early_cm_ind := '0'B, sched_where := { presence := '0'B, where := omit }, gprs_ind := { presence := '1'B, ind := { ra_colour := 0, si13_pos := '0'B } }, umts_early_cm_ind := '0'B, si2_quater_ind := { presence := '0'B, ind := omit }, iu_mode_ind := omit, si21_ind := { presence := '0'B, pos := omit } } } } } MTC@1d681ca672cf: Setting RSL_SYSTEM_INFO_3 (3): '49061B001762F224002AC90001074740E504002C2B2B2B'O MTC@1d681ca672cf: Setting RSL_SYSTEM_INFO_2 (2): { header := { l2_plen := { l2_plen := 22, zero_one := '01'B }, skip_indicator := 0, rr_protocol_discriminator := 6, message_type := SYSTEM_INFORMATION_TYPE_2 (26) }, payload := { si2 := { bcch_freq_list := '00000000000000000000000000000000'O, ncc_permitted := '11111111'B, rach_control := { max_retrans := RACH_MAX_RETRANS_7 (3), tx_integer := '1001'B, cell_barr_access := false, re_not_allowed := true, acc := '0000010000000000'B } } } } MTC@1d681ca672cf: Setting RSL_SYSTEM_INFO_2 (2): '59061A00000000000000000000000000000000FFE50400'O MTC@1d681ca672cf: Setting RSL_SYSTEM_INFO_4 (4): { header := { l2_plen := { l2_plen := 12, zero_one := '01'B }, skip_indicator := 0, rr_protocol_discriminator := 6, message_type := SYSTEM_INFORMATION_TYPE_4 (28) }, payload := { si4 := { lai := { mcc_mnc := '262F42'H, lac := 42 }, cell_sel_par := { cell_resel_hyst_2dB := 2, ms_txpwr_max_cch := 7, acs := '0'B, neci := true, rxlev_access_min := 0 }, rach_control := { max_retrans := RACH_MAX_RETRANS_7 (3), tx_integer := '1001'B, cell_barr_access := false, re_not_allowed := true, acc := '0000010000000000'B }, cbch_chan_desc := omit, cbch_mobile_alloc := omit, rest_octets := { sel_params := { presence := '0'B, params := omit }, pwr_offset := { presence := '0'B, offset := omit }, gprs_ind := { presence := '1'B, ind := { ra_colour := 0, si13_pos := '0'B } }, s_presence := '0'B, s := omit } } } } MTC@1d681ca672cf: Setting RSL_SYSTEM_INFO_4 (4): '31061C62F224002A4740E50400012B2B2B2B2B2B2B2B2B'O MTC@1d681ca672cf: Warning: dec_TrxcMessage(): Data remained at the end of the stream after successful decoding: '00'O MTC@1d681ca672cf: Warning: dec_TrxcMessage(): Data remained at the end of the stream after successful decoding: '00'O MTC@1d681ca672cf: Warning: dec_TrxcMessage(): Data remained at the end of the stream after successful decoding: '00'O MTC@1d681ca672cf: "TC_rll_est_req_DCCH_3": XXX Starting { sapi := 3, link_id := { c := FACCH_SDCCH (0), na := false, prio := SAPI0_PRIO_NORMAL (0), sapi := 3 }, l3 := ''O, exp := true } on { u := { ch0 := RSL_CHAN_NR_Bm_ACCH (1) }, tn := 1 } TC_rll_est_req_DCCH_3(641)@1d681ca672cf: setverdict(pass): none -> pass TC_rll_est_req_DCCH_3(641)@1d681ca672cf: Rx LAPDm { ab := { addr := { spare := '0'B, lpd := 0, sapi := 0, c_r := true, ea := true }, ctrl := { u := { u := '000'B, p_f := false, u2 := '00'B, spare := '11'B } }, len := 0, m := false, el := 1, payload := ''O, padding := '2B2B2B2B2B2B2B2B2B2B2B2B2B2B2B2B2B2B2B2B'O ("++++++++++++++++++++") } } TC_rll_est_req_DCCH_3(641)@1d681ca672cf: Rx LAPDm { ab := { addr := { spare := '0'B, lpd := 0, sapi := 3, c_r := true, ea := true }, ctrl := { u := { u := '001'B, p_f := true, u2 := '11'B, spare := '11'B } }, len := 0, m := false, el := 1, payload := ''O, padding := '2B2B2B2B2B2B2B2B2B2B2B2B2B2B2B2B2B2B2B2B'O ("++++++++++++++++++++") } } TC_rll_est_req_DCCH_3(641)@1d681ca672cf: setverdict(pass): pass -> pass, component reason not changed TC_rll_est_req_DCCH_3(641)@1d681ca672cf: setverdict(pass): pass -> pass, component reason not changed TC_rll_est_req_DCCH_3(641)@1d681ca672cf: Final verdict of PTC: pass MTC@1d681ca672cf: "TC_rll_est_req_DCCH_3": XXX Starting { sapi := 3, link_id := { c := FACCH_SDCCH (0), na := false, prio := SAPI0_PRIO_NORMAL (0), sapi := 3 }, l3 := ''O, exp := true } on { u := { lm := { tag := '0001'B, sub_chan := 1 } }, tn := 5 } TC_rll_est_req_DCCH_3(642)@1d681ca672cf: setverdict(pass): none -> pass TC_rll_est_req_DCCH_3(642)@1d681ca672cf: Rx LAPDm { ab := { addr := { spare := '0'B, lpd := 0, sapi := 0, c_r := true, ea := true }, ctrl := { u := { u := '000'B, p_f := false, u2 := '00'B, spare := '11'B } }, len := 0, m := false, el := 1, payload := ''O, padding := '2B2B2B2B2B2B2B2B2B2B2B2B2B2B2B2B2B2B2B2B'O ("++++++++++++++++++++") } } TC_rll_est_req_DCCH_3(642)@1d681ca672cf: Rx LAPDm { ab := { addr := { spare := '0'B, lpd := 0, sapi := 3, c_r := true, ea := true }, ctrl := { u := { u := '001'B, p_f := true, u2 := '11'B, spare := '11'B } }, len := 0, m := false, el := 1, payload := ''O, padding := '2B2B2B2B2B2B2B2B2B2B2B2B2B2B2B2B2B2B2B2B'O ("++++++++++++++++++++") } } TC_rll_est_req_DCCH_3(642)@1d681ca672cf: setverdict(pass): pass -> pass, component reason not changed TC_rll_est_req_DCCH_3(642)@1d681ca672cf: setverdict(pass): pass -> pass, component reason not changed TC_rll_est_req_DCCH_3(642)@1d681ca672cf: Final verdict of PTC: pass MTC@1d681ca672cf: "TC_rll_est_req_DCCH_3": XXX Starting { sapi := 3, link_id := { c := FACCH_SDCCH (0), na := false, prio := SAPI0_PRIO_NORMAL (0), sapi := 3 }, l3 := ''O, exp := true } on { u := { sdcch4 := { tag := '001'B, sub_chan := 2 } }, tn := 0 } TC_rll_est_req_DCCH_3(643)@1d681ca672cf: setverdict(pass): none -> pass TC_rll_est_req_DCCH_3(643)@1d681ca672cf: Rx LAPDm { ab := { addr := { spare := '0'B, lpd := 0, sapi := 3, c_r := true, ea := true }, ctrl := { u := { u := '001'B, p_f := true, u2 := '11'B, spare := '11'B } }, len := 0, m := false, el := 1, payload := ''O, padding := '2B2B2B2B2B2B2B2B2B2B2B2B2B2B2B2B2B2B2B2B'O ("++++++++++++++++++++") } } TC_rll_est_req_DCCH_3(643)@1d681ca672cf: setverdict(pass): pass -> pass, component reason not changed TC_rll_est_req_DCCH_3(643)@1d681ca672cf: setverdict(pass): pass -> pass, component reason not changed TC_rll_est_req_DCCH_3(643)@1d681ca672cf: Final verdict of PTC: pass MTC@1d681ca672cf: "TC_rll_est_req_DCCH_3": XXX Starting { sapi := 3, link_id := { c := FACCH_SDCCH (0), na := false, prio := SAPI0_PRIO_NORMAL (0), sapi := 3 }, l3 := ''O, exp := true } on { u := { sdcch8 := { tag := '01'B, sub_chan := 4 } }, tn := 6 } TC_rll_est_req_DCCH_3(644)@1d681ca672cf: setverdict(pass): none -> pass TC_rll_est_req_DCCH_3(644)@1d681ca672cf: Rx LAPDm { ab := { addr := { spare := '0'B, lpd := 0, sapi := 3, c_r := true, ea := true }, ctrl := { u := { u := '001'B, p_f := true, u2 := '11'B, spare := '11'B } }, len := 0, m := false, el := 1, payload := ''O, padding := '2B2B2B2B2B2B2B2B2B2B2B2B2B2B2B2B2B2B2B2B'O ("++++++++++++++++++++") } } TC_rll_est_req_DCCH_3(644)@1d681ca672cf: setverdict(pass): pass -> pass, component reason not changed TC_rll_est_req_DCCH_3(644)@1d681ca672cf: setverdict(pass): pass -> pass, component reason not changed MTC@1d681ca672cf: Stopping testcase execution from "BTS_Tests.ttcn":7100 TC_rll_est_req_DCCH_3(644)@1d681ca672cf: Final verdict of PTC: pass TC_rll_est_req_DCCH_3-RSL(639)@1d681ca672cf: Final verdict of PTC: none IPA-CTRL-CLI-IPA(640)@1d681ca672cf: Final verdict of PTC: none TC_rll_est_req_DCCH_3-RSL-IPA(638)@1d681ca672cf: Final verdict of PTC: none MTC@1d681ca672cf: Setting final verdict of the test case. MTC@1d681ca672cf: Local verdict of MTC: none MTC@1d681ca672cf: Local verdict of PTC TC_rll_est_req_DCCH_3-RSL-IPA(638): none (none -> none) MTC@1d681ca672cf: Local verdict of PTC TC_rll_est_req_DCCH_3-RSL(639): none (none -> none) MTC@1d681ca672cf: Local verdict of PTC IPA-CTRL-CLI-IPA(640): none (none -> none) MTC@1d681ca672cf: Local verdict of PTC TC_rll_est_req_DCCH_3(641): pass (none -> pass) MTC@1d681ca672cf: Local verdict of PTC TC_rll_est_req_DCCH_3(642): pass (pass -> pass) MTC@1d681ca672cf: Local verdict of PTC TC_rll_est_req_DCCH_3(643): pass (pass -> pass) MTC@1d681ca672cf: Local verdict of PTC TC_rll_est_req_DCCH_3(644): pass (pass -> pass) MTC@1d681ca672cf: Test case TC_rll_est_req_DCCH_3 finished. Verdict: pass MTC@1d681ca672cf: Starting external command `../ttcn3-tcpdump-stop.sh BTS_Tests.TC_rll_est_req_DCCH_3 pass'. Mon Nov 28 21:57:55 UTC 2022 [1;32m====== BTS_Tests.TC_rll_est_req_DCCH_3 pass ======[0m
Saving talloc report from 172.18.9.20:4241 to BTS_Tests.TC_rll_est_req_DCCH_3.talloc
ERROR: failed to get talloc report via vty
Waiting for packet dumper to finish... 0 (prev_count=-1, count=2480635)
gzip: /data/BTS_Tests.TC_rll_est_req_DCCH_3.pcap.gz: No space left on device MTC@1d681ca672cf: Warning: External command `../ttcn3-tcpdump-stop.sh BTS_Tests.TC_rll_est_req_DCCH_3 pass' returned unsuccessful exit status (1). Fatal error during logging: Writing to log file failed. (No space left on device) Exiting. Error: Unexpected end of MTC connection from 1d681ca672cf [172.18.9.10]. MC@1d681ca672cf: The control connection to MTC is lost. Destroying all PTC connections. MC@1d681ca672cf: MTC terminated. ttcn3_start: error: the MTC terminated unexpectedly exit MC@1d681ca672cf: Shutting down session. MC@1d681ca672cf: Shutdown complete. Fatal error during logging: Writing to log file failed. (No space left on device) Exiting. FATAL: command execution failed java.io.EOFException at java.base/java.io.ObjectInputStream$PeekInputStream.readFully(ObjectInputStream.java:2905) at java.base/java.io.ObjectInputStream$BlockDataInputStream.readShort(ObjectInputStream.java:3400) at java.base/java.io.ObjectInputStream.readStreamHeader(ObjectInputStream.java:936) at java.base/java.io.ObjectInputStream.<init>(ObjectInputStream.java:379) at hudson.remoting.ObjectInputStreamEx.<init>(ObjectInputStreamEx.java:49) at hudson.remoting.Command.readFrom(Command.java:142) at hudson.remoting.Command.readFrom(Command.java:128) at hudson.remoting.AbstractSynchronousByteArrayCommandTransport.read(AbstractSynchronousByteArrayCommandTransport.java:35) at hudson.remoting.SynchronousCommandTransport$ReaderThread.run(SynchronousCommandTransport.java:61) Caused: java.io.IOException: Unexpected termination of the channel at hudson.remoting.SynchronousCommandTransport$ReaderThread.run(SynchronousCommandTransport.java:75) Caused: java.io.IOException: Backing channel 'gtp0-deb9build' is disconnected. at hudson.remoting.RemoteInvocationHandler.channelOrFail(RemoteInvocationHandler.java:215) at hudson.remoting.RemoteInvocationHandler.invoke(RemoteInvocationHandler.java:285) at com.sun.proxy.$Proxy77.isAlive(Unknown Source) at hudson.Launcher$RemoteLauncher$ProcImpl.isAlive(Launcher.java:1215) at hudson.Launcher$RemoteLauncher$ProcImpl.join(Launcher.java:1207) at hudson.tasks.CommandInterpreter.join(CommandInterpreter.java:195) at hudson.tasks.CommandInterpreter.perform(CommandInterpreter.java:145) at hudson.tasks.CommandInterpreter.perform(CommandInterpreter.java:92) at hudson.tasks.BuildStepMonitor$1.perform(BuildStepMonitor.java:20) at hudson.model.AbstractBuild$AbstractBuildExecution.perform(AbstractBuild.java:814) at hudson.model.Build$BuildExecution.build(Build.java:199) at hudson.model.Build$BuildExecution.doRun(Build.java:164) at hudson.model.AbstractBuild$AbstractBuildExecution.run(AbstractBuild.java:522) at hudson.model.Run.execute(Run.java:1896) at hudson.model.FreeStyleBuild.run(FreeStyleBuild.java:44) at hudson.model.ResourceController.execute(ResourceController.java:101) at hudson.model.Executor.run(Executor.java:442) FATAL: Unable to delete script file /tmp/jenkins490665341202114332.sh java.io.EOFException at java.base/java.io.ObjectInputStream$PeekInputStream.readFully(ObjectInputStream.java:2905) at java.base/java.io.ObjectInputStream$BlockDataInputStream.readShort(ObjectInputStream.java:3400) at java.base/java.io.ObjectInputStream.readStreamHeader(ObjectInputStream.java:936) at java.base/java.io.ObjectInputStream.<init>(ObjectInputStream.java:379) at hudson.remoting.ObjectInputStreamEx.<init>(ObjectInputStreamEx.java:49) at hudson.remoting.Command.readFrom(Command.java:142) at hudson.remoting.Command.readFrom(Command.java:128) at hudson.remoting.AbstractSynchronousByteArrayCommandTransport.read(AbstractSynchronousByteArrayCommandTransport.java:35) at hudson.remoting.SynchronousCommandTransport$ReaderThread.run(SynchronousCommandTransport.java:61) Caused: java.io.IOException: Unexpected termination of the channel at hudson.remoting.SynchronousCommandTransport$ReaderThread.run(SynchronousCommandTransport.java:75) Caused: hudson.remoting.ChannelClosedException: Channel "hudson.remoting.Channel@41bc373e:gtp0-deb9build": Remote call on gtp0-deb9build failed. The channel is closing down or has closed down at hudson.remoting.Channel.call(Channel.java:993) at hudson.FilePath.act(FilePath.java:1194) at hudson.FilePath.act(FilePath.java:1183) at hudson.FilePath.delete(FilePath.java:1730) at hudson.tasks.CommandInterpreter.perform(CommandInterpreter.java:163) at hudson.tasks.CommandInterpreter.perform(CommandInterpreter.java:92) at hudson.tasks.BuildStepMonitor$1.perform(BuildStepMonitor.java:20) at hudson.model.AbstractBuild$AbstractBuildExecution.perform(AbstractBuild.java:814) at hudson.model.Build$BuildExecution.build(Build.java:199) at hudson.model.Build$BuildExecution.doRun(Build.java:164) at hudson.model.AbstractBuild$AbstractBuildExecution.run(AbstractBuild.java:522) at hudson.model.Run.execute(Run.java:1896) at hudson.model.FreeStyleBuild.run(FreeStyleBuild.java:44) at hudson.model.ResourceController.execute(ResourceController.java:101) at hudson.model.Executor.run(Executor.java:442) Build step 'Execute shell' marked build as failure ERROR: Step ‘Publish JUnit test result report’ failed: no workspace for TTCN3-centos-bts-test-2022q2 #161
See https://jenkins.osmocom.org/jenkins/job/TTCN3-centos-bts-test-2022q2/177/display/redirect
Changes:
------------------------------------------ Started by timer Running as SYSTEM Building remotely on host2-deb11build-ansible (ttcn3 osmocom-gerrit osmocom-master) in workspace https://jenkins.osmocom.org/jenkins/job/TTCN3-centos-bts-test-2022q2/ws/ The recommended git tool is: NONE No credentials specified Wiping out workspace first. Cloning the remote Git repository Cloning repository https://gerrit.osmocom.org/docker-playground
git init https://jenkins.osmocom.org/jenkins/job/TTCN3-centos-bts-test-2022q2/ws/ # timeout=10
Fetching upstream changes from https://gerrit.osmocom.org/docker-playground
git --version # timeout=10 git --version # 'git version 2.30.2' git fetch --tags --force --progress -- https://gerrit.osmocom.org/docker-playground +refs/heads/*:refs/remotes/origin/* # timeout=10
ERROR: Error cloning remote repo 'origin' hudson.plugins.git.GitException: Command "git fetch --tags --force --progress -- https://gerrit.osmocom.org/docker-playground +refs/heads/*:refs/remotes/origin/*" returned status code 128: stdout: stderr: fatal: unable to access 'https://gerrit.osmocom.org/docker-playground/': Could not resolve host: gerrit.osmocom.org
at org.jenkinsci.plugins.gitclient.CliGitAPIImpl.launchCommandIn(CliGitAPIImpl.java:2675) at org.jenkinsci.plugins.gitclient.CliGitAPIImpl.launchCommandWithCredentials(CliGitAPIImpl.java:2099) at org.jenkinsci.plugins.gitclient.CliGitAPIImpl.access$500(CliGitAPIImpl.java:85) at org.jenkinsci.plugins.gitclient.CliGitAPIImpl$1.execute(CliGitAPIImpl.java:619) at org.jenkinsci.plugins.gitclient.CliGitAPIImpl$2.execute(CliGitAPIImpl.java:848) at org.jenkinsci.plugins.gitclient.RemoteGitImpl$CommandInvocationHandler$GitCommandMasterToSlaveCallable.call(RemoteGitImpl.java:158) at org.jenkinsci.plugins.gitclient.RemoteGitImpl$CommandInvocationHandler$GitCommandMasterToSlaveCallable.call(RemoteGitImpl.java:151) at hudson.remoting.UserRequest.perform(UserRequest.java:211) at hudson.remoting.UserRequest.perform(UserRequest.java:54) at hudson.remoting.Request$2.run(Request.java:376) at hudson.remoting.InterceptingExecutorService.lambda$wrap$0(InterceptingExecutorService.java:78) at java.base/java.util.concurrent.FutureTask.run(FutureTask.java:264) at java.base/java.util.concurrent.ThreadPoolExecutor.runWorker(ThreadPoolExecutor.java:1128) at java.base/java.util.concurrent.ThreadPoolExecutor$Worker.run(ThreadPoolExecutor.java:628) at java.base/java.lang.Thread.run(Thread.java:829) Suppressed: hudson.remoting.Channel$CallSiteStackTrace: Remote call to host2-deb11build-ansible at hudson.remoting.Channel.attachCallSiteStackTrace(Channel.java:1784) at hudson.remoting.UserRequest$ExceptionResponse.retrieve(UserRequest.java:356) at hudson.remoting.Channel.call(Channel.java:1000) at org.jenkinsci.plugins.gitclient.RemoteGitImpl$CommandInvocationHandler.execute(RemoteGitImpl.java:143) at jdk.internal.reflect.GeneratedMethodAccessor91.invoke(Unknown Source) at java.base/jdk.internal.reflect.DelegatingMethodAccessorImpl.invoke(DelegatingMethodAccessorImpl.java:43) at java.base/java.lang.reflect.Method.invoke(Method.java:566) at org.jenkinsci.plugins.gitclient.RemoteGitImpl$CommandInvocationHandler.invoke(RemoteGitImpl.java:129) at com.sun.proxy.$Proxy65.execute(Unknown Source) at hudson.plugins.git.GitSCM.retrieveChanges(GitSCM.java:1226) at hudson.plugins.git.GitSCM.checkout(GitSCM.java:1308) at hudson.scm.SCM.checkout(SCM.java:540) at hudson.model.AbstractProject.checkout(AbstractProject.java:1215) at hudson.model.AbstractBuild$AbstractBuildExecution.defaultCheckout(AbstractBuild.java:645) at jenkins.scm.SCMCheckoutStrategy.checkout(SCMCheckoutStrategy.java:85) at hudson.model.AbstractBuild$AbstractBuildExecution.run(AbstractBuild.java:517) at hudson.model.Run.execute(Run.java:1896) at hudson.model.FreeStyleBuild.run(FreeStyleBuild.java:44) at hudson.model.ResourceController.execute(ResourceController.java:101) at hudson.model.Executor.run(Executor.java:442) ERROR: Error cloning remote repo 'origin' Recording test results ERROR: Step ‘Publish JUnit test result report’ failed: No test report files were found. Configuration error?
jenkins-notifications@lists.osmocom.org