Changes:
[Oliver Smith] ansible: ttcn3: install netcat-openbsd
------------------------------------------ [...truncated 16.56 KB...] #21 0.350 'repo-install-test.sh' -> '/usr/local/bin/repo-install-test.sh' #21 0.350 'verify_endian_header.sh' -> '/usr/local/bin/verify_endian_header.sh' #21 0.350 'xgoldmon-jenkins.sh' -> '/usr/local/bin/xgoldmon-jenkins.sh' #21 0.350 'verify_log_statements.py' -> '/usr/local/bin/verify_log_statements.py' #21 0.350 'verify_value_string_arrays_are_terminated.py' -> '/usr/local/bin/verify_value_string_arrays_are_terminated.py' #21 0.350 + rm -rf osmo-ci #21 DONE 0.4s
#22 [13/16] ADD HTTPS://GERRIT.OSMOCOM.ORG/PLUGINS/GITILES/OSMO-GSM-MANUALS/+/MASTER?FORMAT=TEXT /tmp/osmo-gsm-manuals-commit #22 DONE 0.1s
#23 [14/16] RUN GIT -C /opt clone --depth=1 https://gerrit.osmocom.org/osmo-gsm-manuals #23 0.416 Cloning into 'osmo-gsm-manuals'... #23 DONE 0.5s
#24 [15/16] ADD HTTPS://DOWNLOADS.OSMOCOM.ORG/PACKAGES/OSMOCOM:/NIGHTLY/DEBIAN_12//RELEASE /tmp/Release #24 DONE 0.1s
#25 [16/16] RUN SET -x && echo "deb [signed-by=/etc/apt/trusted.gpg.d/obs.osmocom.org.asc] https://downloads.osmocom.org/packages/osmocom:/nightly/Debian_12/ ./" > /etc/apt/sources.list.d/osmocom-nightly.list && apt-get update && apt-get install -y --no-install-recommends liblimesuite-dev libuhd-dev libulfius-dev && apt-get clean #25 0.381 + echo deb [signed-by=/etc/apt/trusted.gpg.d/obs.osmocom.org.asc] https://downloads.osmocom.org/packages/osmocom:/nightly/Debian_12/ ./ #25 0.381 + apt-get update #25 0.426 Hit:1 http://deb.debian.org/debian bookworm InRelease #25 0.426 Hit:2 http://deb.debian.org/debian bookworm-updates InRelease #25 0.427 Get:3 https://downloads.osmocom.org/packages/osmocom:/nightly/Debian_12 ./ InRelease [1577 B] #25 0.427 Hit:4 http://deb.debian.org/debian-security bookworm-security InRelease #25 0.648 Get:5 https://downloads.osmocom.org/packages/osmocom:/nightly/Debian_12 ./ Packages [153 kB] #25 0.669 Fetched 154 kB in 0s (578 kB/s) #25 0.669 Reading package lists... #25 1.060 + apt-get install -y --no-install-recommends liblimesuite-dev libuhd-dev libulfius-dev #25 1.064 Reading package lists... #25 1.478 Building dependency tree... #25 1.590 Reading state information... #25 1.702 The following additional packages will be installed: #25 1.703 libcurl4-gnutls-dev liblimesuite22.09-1 libmicrohttpd-dev libmicrohttpd12 #25 1.703 liborcania-dev liborcania2.3 libsystemd-dev libuhd4.3.0 libulfius2.7 #25 1.703 libyder-dev libyder2.0 #25 1.704 Suggested packages: #25 1.704 libcurl4-doc libidn-dev libldap2-dev librtmp-dev libssh2-1-dev uhd-doc #25 1.704 uhd-host #25 1.704 Recommended packages: #25 1.704 limesuite-udev limesuite-images gnuradio-dev #25 1.809 The following NEW packages will be installed: #25 1.809 libcurl4-gnutls-dev liblimesuite-dev liblimesuite22.09-1 libmicrohttpd-dev #25 1.809 libmicrohttpd12 liborcania-dev liborcania2.3 libsystemd-dev libuhd-dev #25 1.809 libuhd4.3.0 libulfius-dev libulfius2.7 libyder-dev libyder2.0 #25 1.842 0 upgraded, 14 newly installed, 0 to remove and 0 not upgraded. #25 1.842 Need to get 5780 kB of archives. #25 1.842 After this operation, 24.8 MB of additional disk space will be used. #25 1.842 Get:1 http://deb.debian.org/debian-security bookworm-security/main amd64 libcurl4-gnutls-dev amd64 7.88.1-10+deb12u4 [485 kB] #25 1.853 Get:2 https://downloads.osmocom.org/packages/osmocom:/nightly/Debian_12 ./ liblimesuite22.09-1 22.09.1.17.4828.202310152026 [263 kB] #25 1.859 Get:3 https://downloads.osmocom.org/packages/osmocom:/nightly/Debian_12 ./ liblimesuite-dev 22.09.1.17.4828.202310152026 [52.8 kB] #25 1.866 Get:4 http://deb.debian.org/debian bookworm/main amd64 libmicrohttpd12 amd64 0.9.75-6 [119 kB] #25 1.867 Get:5 http://deb.debian.org/debian bookworm/main amd64 libmicrohttpd-dev amd64 0.9.75-6 [291 kB] #25 1.870 Get:6 http://deb.debian.org/debian bookworm/main amd64 liborcania2.3 amd64 2.3.2-1 [13.6 kB] #25 1.870 Get:7 http://deb.debian.org/debian bookworm/main amd64 liborcania-dev amd64 2.3.2-1 [115 kB] #25 1.871 Get:8 http://deb.debian.org/debian bookworm/main amd64 libsystemd-dev amd64 252.17-1~deb12u1 [352 kB] #25 1.875 Get:9 http://deb.debian.org/debian bookworm/main amd64 libuhd4.3.0 amd64 4.3.0.0+ds1-5 [3445 kB] #25 1.906 Get:10 http://deb.debian.org/debian bookworm/main amd64 libuhd-dev amd64 4.3.0.0+ds1-5 [219 kB] #25 1.907 Get:11 http://deb.debian.org/debian bookworm/main amd64 libyder2.0 amd64 1.4.19-1 [9420 B] #25 1.907 Get:12 http://deb.debian.org/debian bookworm/main amd64 libulfius2.7 amd64 2.7.13-1 [55.3 kB] #25 1.908 Get:13 http://deb.debian.org/debian bookworm/main amd64 libyder-dev amd64 1.4.19-1 [103 kB] #25 1.908 Get:14 http://deb.debian.org/debian bookworm/main amd64 libulfius-dev amd64 2.7.13-1 [256 kB] #25 2.055 debconf: delaying package configuration, since apt-utils is not installed #25 2.093 Fetched 5780 kB in 0s (60.5 MB/s) #25 2.125 Selecting previously unselected package libcurl4-gnutls-dev:amd64. #25 2.125 (Reading database ... (Reading database ... 5%(Reading database ... 10%(Reading database ... 15%(Reading database ... 20%(Reading database ... 25%(Reading database ... 30%(Reading database ... 35%(Reading database ... 40%(Reading database ... 45%(Reading database ... 50%(Reading database ... 55%(Reading database ... 60%(Reading database ... 65%(Reading database ... 70%(Reading database ... 75%(Reading database ... 80%(Reading database ... 85%(Reading database ... 90%(Reading database ... 95%(Reading database ... 100%(Reading database ... 114709 files and directories currently installed.) #25 2.163 Preparing to unpack .../00-libcurl4-gnutls-dev_7.88.1-10+deb12u4_amd64.deb ... #25 2.171 Unpacking libcurl4-gnutls-dev:amd64 (7.88.1-10+deb12u4) ... #25 2.264 Selecting previously unselected package liblimesuite22.09-1:amd64. #25 2.271 Preparing to unpack .../01-liblimesuite22.09-1_22.09.1.17.4828.202310152026_amd64.deb ... #25 2.283 Unpacking liblimesuite22.09-1:amd64 (22.09.1.17.4828.202310152026) ... #25 2.349 Selecting previously unselected package liblimesuite-dev. #25 2.356 Preparing to unpack .../02-liblimesuite-dev_22.09.1.17.4828.202310152026_amd64.deb ... #25 2.361 Unpacking liblimesuite-dev (22.09.1.17.4828.202310152026) ... #25 2.427 Selecting previously unselected package libmicrohttpd12:amd64. #25 2.434 Preparing to unpack .../03-libmicrohttpd12_0.9.75-6_amd64.deb ... #25 2.443 Unpacking libmicrohttpd12:amd64 (0.9.75-6) ... #25 2.498 Selecting previously unselected package libmicrohttpd-dev:amd64. #25 2.506 Preparing to unpack .../04-libmicrohttpd-dev_0.9.75-6_amd64.deb ... #25 2.514 Unpacking libmicrohttpd-dev:amd64 (0.9.75-6) ... #25 2.591 Selecting previously unselected package liborcania2.3:amd64. #25 2.599 Preparing to unpack .../05-liborcania2.3_2.3.2-1_amd64.deb ... #25 2.606 Unpacking liborcania2.3:amd64 (2.3.2-1) ... #25 2.658 Selecting previously unselected package liborcania-dev:amd64. #25 2.665 Preparing to unpack .../06-liborcania-dev_2.3.2-1_amd64.deb ... #25 2.672 Unpacking liborcania-dev:amd64 (2.3.2-1) ... #25 2.736 Selecting previously unselected package libsystemd-dev:amd64. #25 2.742 Preparing to unpack .../07-libsystemd-dev_252.17-1~deb12u1_amd64.deb ... #25 2.750 Unpacking libsystemd-dev:amd64 (252.17-1~deb12u1) ... #25 2.840 Selecting previously unselected package libuhd4.3.0:amd64. #25 2.845 Preparing to unpack .../08-libuhd4.3.0_4.3.0.0+ds1-5_amd64.deb ... #25 2.852 Unpacking libuhd4.3.0:amd64 (4.3.0.0+ds1-5) ... #25 3.111 Selecting previously unselected package libuhd-dev:amd64. #25 3.117 Preparing to unpack .../09-libuhd-dev_4.3.0.0+ds1-5_amd64.deb ... #25 3.124 Unpacking libuhd-dev:amd64 (4.3.0.0+ds1-5) ... #25 3.205 Selecting previously unselected package libyder2.0:amd64. #25 3.213 Preparing to unpack .../10-libyder2.0_1.4.19-1_amd64.deb ... #25 3.219 Unpacking libyder2.0:amd64 (1.4.19-1) ... #25 3.287 Selecting previously unselected package libulfius2.7:amd64. #25 3.294 Preparing to unpack .../11-libulfius2.7_2.7.13-1_amd64.deb ... #25 3.309 Unpacking libulfius2.7:amd64 (2.7.13-1) ... #25 3.367 Selecting previously unselected package libyder-dev:amd64. #25 3.375 Preparing to unpack .../12-libyder-dev_1.4.19-1_amd64.deb ... #25 3.381 Unpacking libyder-dev:amd64 (1.4.19-1) ... #25 3.464 Selecting previously unselected package libulfius-dev:amd64. #25 3.472 Preparing to unpack .../13-libulfius-dev_2.7.13-1_amd64.deb ... #25 3.482 Unpacking libulfius-dev:amd64 (2.7.13-1) ... #25 3.598 Setting up libuhd4.3.0:amd64 (4.3.0.0+ds1-5) ... #25 3.619 Setting up libcurl4-gnutls-dev:amd64 (7.88.1-10+deb12u4) ... #25 3.639 Setting up libmicrohttpd12:amd64 (0.9.75-6) ... #25 3.667 Setting up liborcania2.3:amd64 (2.3.2-1) ... #25 3.687 Setting up liblimesuite22.09-1:amd64 (22.09.1.17.4828.202310152026) ... #25 3.708 Setting up libyder2.0:amd64 (1.4.19-1) ... #25 3.729 Setting up libmicrohttpd-dev:amd64 (0.9.75-6) ... #25 3.748 Setting up libuhd-dev:amd64 (4.3.0.0+ds1-5) ... #25 3.769 Setting up libsystemd-dev:amd64 (252.17-1~deb12u1) ... #25 3.791 Setting up liblimesuite-dev (22.09.1.17.4828.202310152026) ... #25 3.815 Setting up liborcania-dev:amd64 (2.3.2-1) ... #25 3.837 Setting up libulfius2.7:amd64 (2.7.13-1) ... #25 3.864 Setting up libyder-dev:amd64 (1.4.19-1) ... #25 3.884 Setting up libulfius-dev:amd64 (2.7.13-1) ... #25 3.922 Processing triggers for man-db (2.11.2-2) ... #25 3.958 Processing triggers for libc-bin (2.36-9+deb12u3) ... #25 4.050 + apt-get clean #25 DONE 4.1s
#26 exporting to image #26 exporting layers #26 exporting layers 0.2s done #26 writing image sha256:6cac5716311bb2f94559a8acd916de15a92e1f15f305249b6765d28385b1fc90 done #26 naming to docker.io/osmocom-build/debian-bookworm-build:latest 0.0s done #26 DONE 0.3s rm -rf .common make: Leaving directory 'https://jenkins.osmocom.org/jenkins/job/update-osmo-ci-on-slaves/label=build2-deb11build-ansible/ws/_docker_playground/debian-bookworm-build' + docker_image_exists debian-bookworm-build + docker images -q osmocom-build/debian-bookworm-build + test -n 6cac5716311b + list_osmo_packages debian-bookworm debian-bookworm-build + local distro=debian-bookworm + local image=debian-bookworm-build + local docker_run_sh=docker run --rm --entrypoint=/bin/sh osmocom-build/debian-bookworm-build -c + [ -n ] + return + [ = registry.osmocom.org ] + docker_depends debian-bookworm-erlang + local feed + depends= + [ -n ] + docker_distro_from_image_name debian-bookworm-erlang + echo debian-bookworm + distro_arg=debian-bookworm + [ -z ] + docker_upstream_distro_from_image_name debian-bookworm-erlang + echo debian:bookworm + upstream_distro_arg=debian:bookworm + docker_dir_from_image_name debian-bookworm-erlang + echo debian-bookworm-erlang + dir=debian-bookworm-erlang + pull_arg=--pull + grep ^FROM ../debian-bookworm-erlang/Dockerfile + from_line=FROM ${REGISTRY}/${UPSTREAM_DISTRO} + echo FROM ${REGISTRY}/${UPSTREAM_DISTRO} + grep -q $USER + set +x Building image: debian-bookworm-erlang (export NO_DOCKER_IMAGE_BUILD=1 to prevent this) + make -C ../debian-bookworm-erlang BUILD_ARGS=--pull UPSTREAM_DISTRO=debian:bookworm DISTRO=debian-bookworm IMAGE=osmocom-build/debian-bookworm-erlang make: Entering directory 'https://jenkins.osmocom.org/jenkins/job/update-osmo-ci-on-slaves/label=build2-deb11build-ansible/ws/_docker_playground/debian-bookworm-erlang' awk: fatal: cannot open file `.release' for reading: No such file or directory awk: fatal: cannot open file `.release' for reading: No such file or directory awk: fatal: cannot open file `.release' for reading: No such file or directory rm -rf .common cp -r https://jenkins.osmocom.org/jenkins/job/update-osmo-ci-on-slaves/label=build2-deb11build-ansible/ws/_docker_playground/common .common INFO: .release created release=0.0.0 docker build \ --build-arg USER=osmocom-build \ --build-arg UID=1000 \ --build-arg REGISTRY=docker.io \ --build-arg OSMO_TTCN3_BRANCH=master \ --build-arg UPSTREAM_DISTRO=debian:bookworm \ --build-arg DISTRO=debian-bookworm \ --build-arg OSMOCOM_REPO_MIRROR=https://downloads.osmocom.org \ --build-arg OSMOCOM_REPO_PATH=packages/osmocom: \ --build-arg OSMOCOM_REPO_VERSION=latest \ --build-arg OSMOCOM_REPO_TESTSUITE_MIRROR=https://downloads.osmocom.org \ --build-arg LIBOSMOCORE_BRANCH=master \ --build-arg OSMO_BB_BRANCH=master \ --build-arg OSMO_BSC_BRANCH=master \ --build-arg OSMO_BTS_BRANCH=master \ --build-arg OSMO_CBC_BRANCH=master \ --build-arg OSMO_DIA2GSUP_BRANCH=master \ --build-arg OSMO_GBPROXY_BRANCH=master \ --build-arg OSMO_GGSN_BRANCH=master \ --build-arg OSMO_GSM_TESTER_BRANCH=master \ --build-arg OSMO_HLR_BRANCH=master \ --build-arg OSMO_HNBGW_BRANCH=master \ --build-arg OSMO_HNODEB_BRANCH=master \ --build-arg OSMO_IUH_BRANCH=master \ --build-arg OSMO_MGW_BRANCH=master \ --build-arg OSMO_MSC_BRANCH=master \ --build-arg OSMO_NITB_BRANCH=master \ --build-arg OSMO_PCU_BRANCH=master \ --build-arg OSMO_SGSN_BRANCH=master \ --build-arg OSMO_SIP_BRANCH=master \ --build-arg OSMO_STP_BRANCH=master \ --build-arg OSMO_UECUPS_BRANCH=master \ --build-arg OPEN5GS_BRANCH=main \ --pull -t osmocom-build/debian-bookworm-erlang:latest . #0 building with "default" instance using docker driver
#1 [internal] load .dockerignore #1 transferring context: 2B done #1 DONE 0.0s
#2 [internal] load build definition from Dockerfile #2 transferring dockerfile: 1.90kB done #2 DONE 0.0s
#3 [internal] load metadata for docker.io/library/debian:bookworm #3 DONE 0.4s
#4 [internal] load build context #4 DONE 0.0s
#5 https://downloads.osmocom.org/packages/osmocom:/latest/Debian_12//Release #5 DONE 0.0s
#6 [ 1/11] FROM docker.io/library/debian:bookworm@sha256:7d3e8810c96a6a278c218eb8e7f01efaec9d65f50c54aae37421dc3cbeba6535 #6 resolve docker.io/library/debian:bookworm@sha256:7d3e8810c96a6a278c218eb8e7f01efaec9d65f50c54aae37421dc3cbeba6535 0.0s done #6 CACHED
#7 [ 2/11] RUN SET -x && apt-get update && apt-get install -y --no-install-recommends erlang rebar && apt-get clean #7 0.221 + apt-get update #7 0.250 Get:1 http://deb.debian.org/debian bookworm InRelease [151 kB] #7 0.267 Get:2 http://deb.debian.org/debian bookworm-updates InRelease [52.1 kB] #7 0.272 Get:3 http://deb.debian.org/debian-security bookworm-security InRelease [48.0 kB] #7 0.330 Get:4 http://deb.debian.org/debian bookworm/main amd64 Packages [8780 kB] #7 CANCELED
#8 https://github.com/erlang/rebar3/archive/refs/tags/3.18.0.tar.gz #8 ERROR: invalid not-modified ETag: "fce57989250a021a2be5fe5eddd655d6d415eef04f769bf1437f3d6dddfa5559" ------
https://github.com/erlang/rebar3/archive/refs/tags/3.18.0.tar.gz:
------ ERROR: failed to solve: failed to load cache key: invalid not-modified ETag: "fce57989250a021a2be5fe5eddd655d6d415eef04f769bf1437f3d6dddfa5559" make: *** [../make/Makefile:91: docker-build] Error 1 make: Leaving directory 'https://jenkins.osmocom.org/jenkins/job/update-osmo-ci-on-slaves/label=build2-deb11build-ansible/ws/_docker_playground/debian-bookworm-erlang' + exit 1 Build step 'Execute shell' marked build as failure
Changes:
------------------------------------------ [...truncated 8.01 KB...] + echo FROM ${REGISTRY}/${UPSTREAM_DISTRO} + set +x Building image: debian-bookworm-build (export NO_DOCKER_IMAGE_BUILD=1 to prevent this) + make -C ../debian-bookworm-build BUILD_ARGS=--pull UPSTREAM_DISTRO=debian:bookworm DISTRO=debian-bookworm IMAGE=osmocom-build/debian-bookworm-build make: Entering directory 'https://jenkins.osmocom.org/jenkins/job/update-osmo-ci-on-slaves/label=build2-deb11build-ansible/ws/_docker_playground/debian-bookworm-build' awk: fatal: cannot open file `.release' for reading: No such file or directory awk: fatal: cannot open file `.release' for reading: No such file or directory awk: fatal: cannot open file `.release' for reading: No such file or directory rm -rf .common cp -r https://jenkins.osmocom.org/jenkins/job/update-osmo-ci-on-slaves/label=build2-deb11build-ansible/ws/_docker_playground/common .common INFO: .release created release=0.0.0 docker build \ --build-arg USER=osmocom-build \ --build-arg UID=1000 \ --build-arg REGISTRY=docker.io \ --build-arg OSMO_TTCN3_BRANCH=master \ --build-arg UPSTREAM_DISTRO=debian:bookworm \ --build-arg DISTRO=debian-bookworm \ --build-arg OSMOCOM_REPO_MIRROR=https://downloads.osmocom.org \ --build-arg OSMOCOM_REPO_PATH=packages/osmocom: \ --build-arg OSMOCOM_REPO_VERSION=latest \ --build-arg OSMOCOM_REPO_TESTSUITE_MIRROR=https://downloads.osmocom.org \ --build-arg LIBOSMOCORE_BRANCH=master \ --build-arg OSMO_BB_BRANCH=master \ --build-arg OSMO_BSC_BRANCH=master \ --build-arg OSMO_BTS_BRANCH=master \ --build-arg OSMO_CBC_BRANCH=master \ --build-arg OSMO_DIA2GSUP_BRANCH=master \ --build-arg OSMO_GBPROXY_BRANCH=master \ --build-arg OSMO_GGSN_BRANCH=master \ --build-arg OSMO_GSM_TESTER_BRANCH=master \ --build-arg OSMO_HLR_BRANCH=master \ --build-arg OSMO_HNBGW_BRANCH=master \ --build-arg OSMO_HNODEB_BRANCH=master \ --build-arg OSMO_IUH_BRANCH=master \ --build-arg OSMO_MGW_BRANCH=master \ --build-arg OSMO_MSC_BRANCH=master \ --build-arg OSMO_NITB_BRANCH=master \ --build-arg OSMO_PCU_BRANCH=master \ --build-arg OSMO_SGSN_BRANCH=master \ --build-arg OSMO_SIP_BRANCH=master \ --build-arg OSMO_STP_BRANCH=master \ --build-arg OSMO_UECUPS_BRANCH=master \ --build-arg OPEN5GS_BRANCH=main \ --pull -t osmocom-build/debian-bookworm-build:latest . #0 building with "default" instance using docker driver
#1 [internal] load build definition from Dockerfile #1 transferring dockerfile: 5.72kB done #1 DONE 0.0s
#2 [internal] load .dockerignore #2 transferring context: 2B done #2 DONE 0.0s
#3 [internal] load metadata for docker.io/library/debian:bookworm #3 DONE 0.8s
#4 https://downloads.osmocom.org/packages/osmocom:/nightly/Debian_12//Release #4 DONE 0.0s
#5 https://gitea.osmocom.org/sim-card/pysim/raw/branch/master/requirements.txt #5 DONE 0.0s
#6 [ 1/16] FROM docker.io/library/debian:bookworm@sha256:7d3e8810c96a6a278c218eb8e7f01efaec9d65f50c54aae37421dc3cbeba6535 #6 resolve docker.io/library/debian:bookworm@sha256:7d3e8810c96a6a278c218eb8e7f01efaec9d65f50c54aae37421dc3cbeba6535 0.0s done #6 DONE 0.0s
#7 [internal] load build context #7 transferring context: 1.96kB done #7 DONE 0.0s
#8 https://gerrit.osmocom.org/plugins/gitiles/osmo-gsm-manuals/+/master?format=... #8 DONE 0.1s
#9 https://gerrit.osmocom.org/plugins/gitiles/osmo-ci/+/master?format=TEXT #9 DONE 0.1s
#10 https://gerrit.osmocom.org/plugins/gitiles/python/osmo-python-tests/+/master... #10 DONE 0.1s
#11 [ 7/16] ADD HTTPS://GITEA.OSMOCOM.ORG/SIM-CARD/PYSIM/RAW/BRANCH/MASTER/REQUIREMENTS.TXT /tmp/pysim_requirements.txt #11 CACHED
#12 [15/16] ADD HTTPS://DOWNLOADS.OSMOCOM.ORG/PACKAGES/OSMOCOM:/NIGHTLY/DEBIAN_12//RELEASE /tmp/Release #12 CACHED
#13 [14/16] RUN GIT -C /opt clone --depth=1 https://gerrit.osmocom.org/osmo-gsm-manuals #13 CACHED
#14 [ 9/16] ADD HTTPS://GERRIT.OSMOCOM.ORG/PLUGINS/GITILES/PYTHON/OSMO-PYTHON-TESTS/+/MASTER?FORMAT=TEXT /tmp/osmo-python-tests-commit #14 CACHED
#15 [ 8/16] RUN SET -x && cat /tmp/pysim_requirements.txt && pip3 install --break-system-packages 'git+https://github.com/eriwen/lcov-to-cobertura-xml.git' 'git+https://github.com/osmocom/sphinx-argparse@master#egg=sphinx-argparse' 'git+https://github.com/podshumok/python-smpplib.git' 'pydbus' 'pylint' 'pysispm' 'sphinx' 'sphinxcontrib-napoleon' -r /tmp/pysim_requirements.txt #15 CACHED
#16 [ 3/16] COPY .COMMON/RELEASE.KEY /etc/apt/trusted.gpg.d/obs.osmocom.org.asc #16 CACHED
#17 [ 5/16] RUN IF [ "$(arch)" != "x86_64" ]; then echo "ERROR: use debian-bookworm-build-arm instead"; exit 1; fi && set -x && apt-get update && apt-get install -y --no-install-recommends ca-certificates libtinfo5 wget && apt-get clean && wget https://github.com/ARM-software/LLVM-embedded-toolchain-for-Arm/releases/dow... && tar -xf LLVMEmbeddedToolchainForArm-14.0.0-linux.tar.gz && rm LLVMEmbeddedToolchainForArm-14.0.0-linux.tar.gz && mv LLVMEmbeddedToolchainForArm-14.0.0 /opt/llvm-arm && /opt/llvm-arm/bin/clang --version && /opt/llvm-arm/bin/clang --print-targets #17 CACHED
#18 [12/16] RUN set -x && git clone --depth=1 https://gerrit.osmocom.org/osmo-ci osmo-ci && su build -c "cd osmo-ci/scripts && cp -v *.sh *.py /usr/local/bin" && rm -rf osmo-ci #18 CACHED
#19 [13/16] ADD HTTPS://GERRIT.OSMOCOM.ORG/PLUGINS/GITILES/OSMO-GSM-MANUALS/+/MASTER?FORMAT=TEXT /tmp/osmo-gsm-manuals-commit #19 CACHED
#20 [ 2/16] COPY .COMMON/RESPAWN.SH /usr/local/bin/respawn.sh #20 CACHED
#21 [ 6/16] RUN SET -x && apt-get update && apt-get install -y --no-install-recommends asciidoc asciidoc-dblatex autoconf autoconf-archive autogen automake bc bison build-essential bzip2 ca-certificates ccache cmake coccinelle cppcheck curl dahdi-source dblatex dbus debhelper devscripts dh-autoreconf docbook5-xml doxygen equivs flex g++ gawk gcc gcc-arm-none-eabi ghostscript git gnupg graphviz htop iproute2 latexmk lcov libaio-dev libasound2-dev libboost-all-dev libc-ares-dev libcdk5-dev libcsv-dev libdbd-sqlite3 libdbi-dev libelf-dev libffi-dev libfftw3-dev libgmp-dev libgnutls28-dev libgps-dev libgsm1-dev libjansson-dev liblua5.3-dev libmnl-dev libncurses5-dev libnewlib-arm-none-eabi libnftables-dev libnl-3-dev libnl-route-3-dev liboping-dev libortp-dev libpcap-dev libpcsclite-dev libreadline-dev librsvg2-bin libsctp-dev libsigsegv-dev libsnmp-dev libsofia-sip-ua-glib-dev libsqlite3-dev libssl-dev libtalloc-dev libtinfo5 libtool liburing-dev libusb-1.0-0-dev libusb-dev libxml2-utils libzmq3-dev locales lua-socket make mscgen ofono openssh-client patchelf picolibc-arm-none-eabi pkg-config python3 python3-gi python3-mako python3-nwdiag python3-pip python3-pyflakes python3-setuptools python3-usb python3-yaml rsync sdcc source-highlight sqlite3 stow sudo swig systemd tcpdump telnet tex-gyre texinfo unzip xsltproc && apt-get clean #21 CACHED
#22 [ 4/16] RUN SET -x && useradd --uid=1000 build && mkdir /build && chown -R build:build /build /usr/local && echo "path-exclude=/usr/share/man/*" > /etc/dpkg/dpkg.cfg.d/exclude-man-pages && rm -rf /usr/share/man/ #22 CACHED
#23 [10/16] RUN SET -x && git clone --depth=1 https://gerrit.osmocom.org/python/osmo-python-tests osmo-python-tests && cd osmo-python-tests && python3 setup.py clean build install && cd .. && rm -rf osmo-python-tests #23 CACHED
#24 [11/16] ADD HTTPS://GERRIT.OSMOCOM.ORG/PLUGINS/GITILES/OSMO-CI/+/MASTER?FORMAT=TEXT /tmp/osmo-ci-commit #24 CACHED
#25 [16/16] RUN SET -x && echo "deb [signed-by=/etc/apt/trusted.gpg.d/obs.osmocom.org.asc] https://downloads.osmocom.org/packages/osmocom:/nightly/Debian_12/ ./" > /etc/apt/sources.list.d/osmocom-nightly.list && apt-get update && apt-get install -y --no-install-recommends liblimesuite-dev libuhd-dev libulfius-dev && apt-get clean #25 CACHED
#26 exporting to image #26 exporting layers done #26 writing image sha256:6cac5716311bb2f94559a8acd916de15a92e1f15f305249b6765d28385b1fc90 done #26 naming to docker.io/osmocom-build/debian-bookworm-build:latest done #26 DONE 0.0s rm -rf .common make: Leaving directory 'https://jenkins.osmocom.org/jenkins/job/update-osmo-ci-on-slaves/label=build2-deb11build-ansible/ws/_docker_playground/debian-bookworm-build' + docker_image_exists debian-bookworm-build + docker images -q osmocom-build/debian-bookworm-build + test -n 6cac5716311b + list_osmo_packages debian-bookworm debian-bookworm-build + local distro=debian-bookworm + local image=debian-bookworm-build + local docker_run_sh=docker run --rm --entrypoint=/bin/sh osmocom-build/debian-bookworm-build -c + [ -n ] + return + [ = registry.osmocom.org ] + docker_depends debian-bookworm-erlang + local feed + depends= + [ -n ] + docker_distro_from_image_name debian-bookworm-erlang + echo debian-bookworm + distro_arg=debian-bookworm + [ -z ] + docker_upstream_distro_from_image_name debian-bookworm-erlang + echo debian:bookworm + upstream_distro_arg=debian:bookworm + docker_dir_from_image_name debian-bookworm-erlang + echo debian-bookworm-erlang + dir=debian-bookworm-erlang + pull_arg=--pull + grep ^FROM ../debian-bookworm-erlang/Dockerfile + from_line=FROM ${REGISTRY}/${UPSTREAM_DISTRO} + echo FROM ${REGISTRY}/${UPSTREAM_DISTRO} + grep -q $USER + set +x Building image: debian-bookworm-erlang (export NO_DOCKER_IMAGE_BUILD=1 to prevent this) + make -C ../debian-bookworm-erlang BUILD_ARGS=--pull UPSTREAM_DISTRO=debian:bookworm DISTRO=debian-bookworm IMAGE=osmocom-build/debian-bookworm-erlang make: Entering directory 'https://jenkins.osmocom.org/jenkins/job/update-osmo-ci-on-slaves/label=build2-deb11build-ansible/ws/_docker_playground/debian-bookworm-erlang' awk: fatal: cannot open file `.release' for reading: No such file or directory awk: fatal: cannot open file `.release' for reading: No such file or directory awk: fatal: cannot open file `.release' for reading: No such file or directory rm -rf .common cp -r https://jenkins.osmocom.org/jenkins/job/update-osmo-ci-on-slaves/label=build2-deb11build-ansible/ws/_docker_playground/common .common INFO: .release created release=0.0.0 docker build \ --build-arg USER=osmocom-build \ --build-arg UID=1000 \ --build-arg REGISTRY=docker.io \ --build-arg OSMO_TTCN3_BRANCH=master \ --build-arg UPSTREAM_DISTRO=debian:bookworm \ --build-arg DISTRO=debian-bookworm \ --build-arg OSMOCOM_REPO_MIRROR=https://downloads.osmocom.org \ --build-arg OSMOCOM_REPO_PATH=packages/osmocom: \ --build-arg OSMOCOM_REPO_VERSION=latest \ --build-arg OSMOCOM_REPO_TESTSUITE_MIRROR=https://downloads.osmocom.org \ --build-arg LIBOSMOCORE_BRANCH=master \ --build-arg OSMO_BB_BRANCH=master \ --build-arg OSMO_BSC_BRANCH=master \ --build-arg OSMO_BTS_BRANCH=master \ --build-arg OSMO_CBC_BRANCH=master \ --build-arg OSMO_DIA2GSUP_BRANCH=master \ --build-arg OSMO_GBPROXY_BRANCH=master \ --build-arg OSMO_GGSN_BRANCH=master \ --build-arg OSMO_GSM_TESTER_BRANCH=master \ --build-arg OSMO_HLR_BRANCH=master \ --build-arg OSMO_HNBGW_BRANCH=master \ --build-arg OSMO_HNODEB_BRANCH=master \ --build-arg OSMO_IUH_BRANCH=master \ --build-arg OSMO_MGW_BRANCH=master \ --build-arg OSMO_MSC_BRANCH=master \ --build-arg OSMO_NITB_BRANCH=master \ --build-arg OSMO_PCU_BRANCH=master \ --build-arg OSMO_SGSN_BRANCH=master \ --build-arg OSMO_SIP_BRANCH=master \ --build-arg OSMO_STP_BRANCH=master \ --build-arg OSMO_UECUPS_BRANCH=master \ --build-arg OPEN5GS_BRANCH=main \ --pull -t osmocom-build/debian-bookworm-erlang:latest . #0 building with "default" instance using docker driver
#1 [internal] load build definition from Dockerfile #1 transferring dockerfile: 1.90kB done #1 DONE 0.0s
#2 [internal] load .dockerignore #2 transferring context: 2B done #2 DONE 0.0s
#3 [internal] load metadata for docker.io/library/debian:bookworm #3 DONE 0.2s
#4 [internal] load build context #4 DONE 0.0s
#5 https://downloads.osmocom.org/packages/osmocom:/latest/Debian_12//Release #5 DONE 0.0s
#6 [ 1/11] FROM docker.io/library/debian:bookworm@sha256:7d3e8810c96a6a278c218eb8e7f01efaec9d65f50c54aae37421dc3cbeba6535 #6 resolve docker.io/library/debian:bookworm@sha256:7d3e8810c96a6a278c218eb8e7f01efaec9d65f50c54aae37421dc3cbeba6535 0.0s done #6 CACHED
#7 [ 2/11] RUN SET -x && apt-get update && apt-get install -y --no-install-recommends erlang rebar && apt-get clean #7 0.215 + apt-get update #7 0.242 Get:1 http://deb.debian.org/debian bookworm InRelease [151 kB] #7 0.260 Get:2 http://deb.debian.org/debian bookworm-updates InRelease [52.1 kB] #7 0.264 Get:3 http://deb.debian.org/debian-security bookworm-security InRelease [48.0 kB] #7 0.324 Get:4 http://deb.debian.org/debian bookworm/main amd64 Packages [8780 kB] #7 CANCELED
#8 https://github.com/erlang/rebar3/archive/refs/tags/3.18.0.tar.gz #8 ERROR: invalid not-modified ETag: "fce57989250a021a2be5fe5eddd655d6d415eef04f769bf1437f3d6dddfa5559" ------
https://github.com/erlang/rebar3/archive/refs/tags/3.18.0.tar.gz:
------ ERROR: failed to solve: failed to load cache key: invalid not-modified ETag: "fce57989250a021a2be5fe5eddd655d6d415eef04f769bf1437f3d6dddfa5559" make: *** [../make/Makefile:91: docker-build] Error 1 make: Leaving directory 'https://jenkins.osmocom.org/jenkins/job/update-osmo-ci-on-slaves/label=build2-deb11build-ansible/ws/_docker_playground/debian-bookworm-erlang' + exit 1 Build step 'Execute shell' marked build as failure
Changes:
[Oliver Smith] ansible: hosts: remove gtp0-deb(10,11)build
------------------------------------------ [...truncated 16.38 KB...] #21 0.342 'osmocom-packages-docker.sh' -> '/usr/local/bin/osmocom-packages-docker.sh' #21 0.342 'repo-install-test.sh' -> '/usr/local/bin/repo-install-test.sh' #21 0.342 'verify_endian_header.sh' -> '/usr/local/bin/verify_endian_header.sh' #21 0.342 'xgoldmon-jenkins.sh' -> '/usr/local/bin/xgoldmon-jenkins.sh' #21 0.342 'verify_log_statements.py' -> '/usr/local/bin/verify_log_statements.py' #21 0.342 'verify_value_string_arrays_are_terminated.py' -> '/usr/local/bin/verify_value_string_arrays_are_terminated.py' #21 0.343 + rm -rf osmo-ci #21 DONE 0.4s
#22 [13/16] ADD HTTPS://GERRIT.OSMOCOM.ORG/PLUGINS/GITILES/OSMO-GSM-MANUALS/+/MASTER?FORMAT=TEXT /tmp/osmo-gsm-manuals-commit #22 DONE 0.1s
#23 [14/16] RUN GIT -C /opt clone --depth=1 https://gerrit.osmocom.org/osmo-gsm-manuals #23 0.368 Cloning into 'osmo-gsm-manuals'... #23 DONE 0.5s
#24 [15/16] ADD HTTPS://DOWNLOADS.OSMOCOM.ORG/PACKAGES/OSMOCOM:/NIGHTLY/DEBIAN_12//RELEASE /tmp/Release #24 DONE 0.1s
#25 [16/16] RUN SET -x && echo "deb [signed-by=/etc/apt/trusted.gpg.d/obs.osmocom.org.asc] https://downloads.osmocom.org/packages/osmocom:/nightly/Debian_12/ ./" > /etc/apt/sources.list.d/osmocom-nightly.list && apt-get update && apt-get install -y --no-install-recommends liblimesuite-dev libuhd-dev libulfius-dev && apt-get clean #25 0.394 + echo deb [signed-by=/etc/apt/trusted.gpg.d/obs.osmocom.org.asc] https://downloads.osmocom.org/packages/osmocom:/nightly/Debian_12/ ./ #25 0.394 + apt-get update #25 0.482 Hit:1 http://deb.debian.org/debian bookworm InRelease #25 0.482 Hit:2 http://deb.debian.org/debian bookworm-updates InRelease #25 0.482 Hit:3 http://deb.debian.org/debian-security bookworm-security InRelease #25 0.556 Get:4 https://downloads.osmocom.org/packages/osmocom:/nightly/Debian_12 ./ InRelease [1577 B] #25 0.704 Get:5 https://downloads.osmocom.org/packages/osmocom:/nightly/Debian_12 ./ Packages [153 kB] #25 0.719 Fetched 154 kB in 0s (506 kB/s) #25 0.719 Reading package lists... #25 1.135 + apt-get install -y --no-install-recommends liblimesuite-dev libuhd-dev libulfius-dev #25 1.142 Reading package lists... #25 1.566 Building dependency tree... #25 1.694 Reading state information... #25 1.820 The following additional packages will be installed: #25 1.820 libcurl4-gnutls-dev liblimesuite22.09-1 libmicrohttpd-dev libmicrohttpd12 #25 1.820 liborcania-dev liborcania2.3 libsystemd-dev libuhd4.3.0 libulfius2.7 #25 1.820 libyder-dev libyder2.0 #25 1.822 Suggested packages: #25 1.822 libcurl4-doc libidn-dev libldap2-dev librtmp-dev libssh2-1-dev uhd-doc #25 1.822 uhd-host #25 1.822 Recommended packages: #25 1.822 limesuite-udev limesuite-images gnuradio-dev #25 1.926 The following NEW packages will be installed: #25 1.926 libcurl4-gnutls-dev liblimesuite-dev liblimesuite22.09-1 libmicrohttpd-dev #25 1.926 libmicrohttpd12 liborcania-dev liborcania2.3 libsystemd-dev libuhd-dev #25 1.926 libuhd4.3.0 libulfius-dev libulfius2.7 libyder-dev libyder2.0 #25 1.953 0 upgraded, 14 newly installed, 0 to remove and 0 not upgraded. #25 1.953 Need to get 5780 kB of archives. #25 1.953 After this operation, 24.8 MB of additional disk space will be used. #25 1.953 Get:1 http://deb.debian.org/debian-security bookworm-security/main amd64 libcurl4-gnutls-dev amd64 7.88.1-10+deb12u4 [485 kB] #25 1.987 Get:2 http://deb.debian.org/debian bookworm/main amd64 libmicrohttpd12 amd64 0.9.75-6 [119 kB] #25 1.995 Get:3 http://deb.debian.org/debian bookworm/main amd64 libmicrohttpd-dev amd64 0.9.75-6 [291 kB] #25 1.995 Get:4 http://deb.debian.org/debian bookworm/main amd64 liborcania2.3 amd64 2.3.2-1 [13.6 kB] #25 1.995 Get:5 http://deb.debian.org/debian bookworm/main amd64 liborcania-dev amd64 2.3.2-1 [115 kB] #25 1.996 Get:6 http://deb.debian.org/debian bookworm/main amd64 libsystemd-dev amd64 252.17-1~deb12u1 [352 kB] #25 1.998 Get:7 http://deb.debian.org/debian bookworm/main amd64 libuhd4.3.0 amd64 4.3.0.0+ds1-5 [3445 kB] #25 2.032 Get:8 http://deb.debian.org/debian bookworm/main amd64 libuhd-dev amd64 4.3.0.0+ds1-5 [219 kB] #25 2.032 Get:9 http://deb.debian.org/debian bookworm/main amd64 libyder2.0 amd64 1.4.19-1 [9420 B] #25 2.033 Get:10 http://deb.debian.org/debian bookworm/main amd64 libulfius2.7 amd64 2.7.13-1 [55.3 kB] #25 2.033 Get:11 http://deb.debian.org/debian bookworm/main amd64 libyder-dev amd64 1.4.19-1 [103 kB] #25 2.033 Get:12 http://deb.debian.org/debian bookworm/main amd64 libulfius-dev amd64 2.7.13-1 [256 kB] #25 2.097 Get:13 https://downloads.osmocom.org/packages/osmocom:/nightly/Debian_12 ./ liblimesuite22.09-1 22.09.1.17.4828.202310152026 [263 kB] #25 2.102 Get:14 https://downloads.osmocom.org/packages/osmocom:/nightly/Debian_12 ./ liblimesuite-dev 22.09.1.17.4828.202310152026 [52.8 kB] #25 2.246 debconf: delaying package configuration, since apt-utils is not installed #25 2.281 Fetched 5780 kB in 0s (33.7 MB/s) #25 2.316 Selecting previously unselected package libcurl4-gnutls-dev:amd64. #25 2.316 (Reading database ... (Reading database ... 5%(Reading database ... 10%(Reading database ... 15%(Reading database ... 20%(Reading database ... 25%(Reading database ... 30%(Reading database ... 35%(Reading database ... 40%(Reading database ... 45%(Reading database ... 50%(Reading database ... 55%(Reading database ... 60%(Reading database ... 65%(Reading database ... 70%(Reading database ... 75%(Reading database ... 80%(Reading database ... 85%(Reading database ... 90%(Reading database ... 95%(Reading database ... 100%(Reading database ... 114709 files and directories currently installed.) #25 2.354 Preparing to unpack .../00-libcurl4-gnutls-dev_7.88.1-10+deb12u4_amd64.deb ... #25 2.361 Unpacking libcurl4-gnutls-dev:amd64 (7.88.1-10+deb12u4) ... #25 2.457 Selecting previously unselected package liblimesuite22.09-1:amd64. #25 2.464 Preparing to unpack .../01-liblimesuite22.09-1_22.09.1.17.4828.202310152026_amd64.deb ... #25 2.482 Unpacking liblimesuite22.09-1:amd64 (22.09.1.17.4828.202310152026) ... #25 2.556 Selecting previously unselected package liblimesuite-dev. #25 2.562 Preparing to unpack .../02-liblimesuite-dev_22.09.1.17.4828.202310152026_amd64.deb ... #25 2.569 Unpacking liblimesuite-dev (22.09.1.17.4828.202310152026) ... #25 2.638 Selecting previously unselected package libmicrohttpd12:amd64. #25 2.645 Preparing to unpack .../03-libmicrohttpd12_0.9.75-6_amd64.deb ... #25 2.652 Unpacking libmicrohttpd12:amd64 (0.9.75-6) ... #25 2.708 Selecting previously unselected package libmicrohttpd-dev:amd64. #25 2.716 Preparing to unpack .../04-libmicrohttpd-dev_0.9.75-6_amd64.deb ... #25 2.723 Unpacking libmicrohttpd-dev:amd64 (0.9.75-6) ... #25 2.796 Selecting previously unselected package liborcania2.3:amd64. #25 2.804 Preparing to unpack .../05-liborcania2.3_2.3.2-1_amd64.deb ... #25 2.811 Unpacking liborcania2.3:amd64 (2.3.2-1) ... #25 2.863 Selecting previously unselected package liborcania-dev:amd64. #25 2.869 Preparing to unpack .../06-liborcania-dev_2.3.2-1_amd64.deb ... #25 2.876 Unpacking liborcania-dev:amd64 (2.3.2-1) ... #25 2.940 Selecting previously unselected package libsystemd-dev:amd64. #25 2.946 Preparing to unpack .../07-libsystemd-dev_252.17-1~deb12u1_amd64.deb ... #25 2.955 Unpacking libsystemd-dev:amd64 (252.17-1~deb12u1) ... #25 3.045 Selecting previously unselected package libuhd4.3.0:amd64. #25 3.053 Preparing to unpack .../08-libuhd4.3.0_4.3.0.0+ds1-5_amd64.deb ... #25 3.059 Unpacking libuhd4.3.0:amd64 (4.3.0.0+ds1-5) ... #25 3.323 Selecting previously unselected package libuhd-dev:amd64. #25 3.330 Preparing to unpack .../09-libuhd-dev_4.3.0.0+ds1-5_amd64.deb ... #25 3.337 Unpacking libuhd-dev:amd64 (4.3.0.0+ds1-5) ... #25 3.433 Selecting previously unselected package libyder2.0:amd64. #25 3.441 Preparing to unpack .../10-libyder2.0_1.4.19-1_amd64.deb ... #25 3.448 Unpacking libyder2.0:amd64 (1.4.19-1) ... #25 3.507 Selecting previously unselected package libulfius2.7:amd64. #25 3.514 Preparing to unpack .../11-libulfius2.7_2.7.13-1_amd64.deb ... #25 3.521 Unpacking libulfius2.7:amd64 (2.7.13-1) ... #25 3.573 Selecting previously unselected package libyder-dev:amd64. #25 3.580 Preparing to unpack .../12-libyder-dev_1.4.19-1_amd64.deb ... #25 3.587 Unpacking libyder-dev:amd64 (1.4.19-1) ... #25 3.648 Selecting previously unselected package libulfius-dev:amd64. #25 3.654 Preparing to unpack .../13-libulfius-dev_2.7.13-1_amd64.deb ... #25 3.662 Unpacking libulfius-dev:amd64 (2.7.13-1) ... #25 3.778 Setting up libuhd4.3.0:amd64 (4.3.0.0+ds1-5) ... #25 3.798 Setting up libcurl4-gnutls-dev:amd64 (7.88.1-10+deb12u4) ... #25 3.818 Setting up libmicrohttpd12:amd64 (0.9.75-6) ... #25 3.860 Setting up liborcania2.3:amd64 (2.3.2-1) ... #25 3.881 Setting up liblimesuite22.09-1:amd64 (22.09.1.17.4828.202310152026) ... #25 3.905 Setting up libyder2.0:amd64 (1.4.19-1) ... #25 3.928 Setting up libmicrohttpd-dev:amd64 (0.9.75-6) ... #25 3.951 Setting up libuhd-dev:amd64 (4.3.0.0+ds1-5) ... #25 3.969 Setting up libsystemd-dev:amd64 (252.17-1~deb12u1) ... #25 3.992 Setting up liblimesuite-dev (22.09.1.17.4828.202310152026) ... #25 4.012 Setting up liborcania-dev:amd64 (2.3.2-1) ... #25 4.033 Setting up libulfius2.7:amd64 (2.7.13-1) ... #25 4.054 Setting up libyder-dev:amd64 (1.4.19-1) ... #25 4.073 Setting up libulfius-dev:amd64 (2.7.13-1) ... #25 4.092 Processing triggers for man-db (2.11.2-2) ... #25 4.117 Processing triggers for libc-bin (2.36-9+deb12u3) ... #25 4.214 + apt-get clean #25 DONE 4.3s
#26 exporting to image #26 exporting layers #26 exporting layers 0.2s done #26 writing image sha256:aab88deacce5c3ff9d3b6809f30b589ccd950750e10f72f6ef2380a3b69cff8a done #26 naming to docker.io/osmocom-build/debian-bookworm-build:latest 0.0s done #26 DONE 0.3s rm -rf .common make: Leaving directory 'https://jenkins.osmocom.org/jenkins/job/update-osmo-ci-on-slaves/label=build2-deb11build-ansible/ws/_docker_playground/debian-bookworm-build' + docker_image_exists debian-bookworm-build + docker images -q osmocom-build/debian-bookworm-build + test -n aab88deacce5 + list_osmo_packages debian-bookworm debian-bookworm-build + local distro=debian-bookworm + local image=debian-bookworm-build + local docker_run_sh=docker run --rm --entrypoint=/bin/sh osmocom-build/debian-bookworm-build -c + [ -n ] + return + [ = registry.osmocom.org ] + docker_depends debian-bookworm-erlang + local feed + depends= + [ -n ] + docker_distro_from_image_name debian-bookworm-erlang + echo debian-bookworm + distro_arg=debian-bookworm + [ -z ] + docker_upstream_distro_from_image_name debian-bookworm-erlang + echo debian:bookworm + upstream_distro_arg=debian:bookworm + docker_dir_from_image_name debian-bookworm-erlang + echo debian-bookworm-erlang + dir=debian-bookworm-erlang + pull_arg=--pull + grep ^FROM ../debian-bookworm-erlang/Dockerfile + from_line=FROM ${REGISTRY}/${UPSTREAM_DISTRO} + echo FROM ${REGISTRY}/${UPSTREAM_DISTRO} + grep -q $USER + set +x Building image: debian-bookworm-erlang (export NO_DOCKER_IMAGE_BUILD=1 to prevent this) + make -C ../debian-bookworm-erlang BUILD_ARGS=--pull UPSTREAM_DISTRO=debian:bookworm DISTRO=debian-bookworm IMAGE=osmocom-build/debian-bookworm-erlang make: Entering directory 'https://jenkins.osmocom.org/jenkins/job/update-osmo-ci-on-slaves/label=build2-deb11build-ansible/ws/_docker_playground/debian-bookworm-erlang' awk: fatal: cannot open file `.release' for reading: No such file or directory awk: fatal: cannot open file `.release' for reading: No such file or directory awk: fatal: cannot open file `.release' for reading: No such file or directory rm -rf .common cp -r https://jenkins.osmocom.org/jenkins/job/update-osmo-ci-on-slaves/label=build2-deb11build-ansible/ws/_docker_playground/common .common INFO: .release created release=0.0.0 docker build \ --build-arg USER=osmocom-build \ --build-arg UID=1000 \ --build-arg REGISTRY=docker.io \ --build-arg OSMO_TTCN3_BRANCH=master \ --build-arg UPSTREAM_DISTRO=debian:bookworm \ --build-arg DISTRO=debian-bookworm \ --build-arg OSMOCOM_REPO_MIRROR=https://downloads.osmocom.org \ --build-arg OSMOCOM_REPO_PATH=packages/osmocom: \ --build-arg OSMOCOM_REPO_VERSION=latest \ --build-arg OSMOCOM_REPO_TESTSUITE_MIRROR=https://downloads.osmocom.org \ --build-arg LIBOSMOCORE_BRANCH=master \ --build-arg OSMO_BB_BRANCH=master \ --build-arg OSMO_BSC_BRANCH=master \ --build-arg OSMO_BTS_BRANCH=master \ --build-arg OSMO_CBC_BRANCH=master \ --build-arg OSMO_DIA2GSUP_BRANCH=master \ --build-arg OSMO_GBPROXY_BRANCH=master \ --build-arg OSMO_GGSN_BRANCH=master \ --build-arg OSMO_GSM_TESTER_BRANCH=master \ --build-arg OSMO_HLR_BRANCH=master \ --build-arg OSMO_HNBGW_BRANCH=master \ --build-arg OSMO_HNODEB_BRANCH=master \ --build-arg OSMO_IUH_BRANCH=master \ --build-arg OSMO_MGW_BRANCH=master \ --build-arg OSMO_MSC_BRANCH=master \ --build-arg OSMO_NITB_BRANCH=master \ --build-arg OSMO_PCU_BRANCH=master \ --build-arg OSMO_SGSN_BRANCH=master \ --build-arg OSMO_SIP_BRANCH=master \ --build-arg OSMO_STP_BRANCH=master \ --build-arg OSMO_UECUPS_BRANCH=master \ --build-arg OPEN5GS_BRANCH=main \ --pull -t osmocom-build/debian-bookworm-erlang:latest . #0 building with "default" instance using docker driver
#1 [internal] load .dockerignore #1 transferring context: 2B done #1 DONE 0.0s
#2 [internal] load build definition from Dockerfile #2 transferring dockerfile: 1.90kB done #2 DONE 0.0s
#3 [internal] load metadata for docker.io/library/debian:bookworm #3 DONE 0.4s
#4 [internal] load build context #4 DONE 0.0s
#5 https://downloads.osmocom.org/packages/osmocom:/latest/Debian_12//Release #5 DONE 0.0s
#6 [ 1/11] FROM docker.io/library/debian:bookworm@sha256:7d3e8810c96a6a278c218eb8e7f01efaec9d65f50c54aae37421dc3cbeba6535 #6 resolve docker.io/library/debian:bookworm@sha256:7d3e8810c96a6a278c218eb8e7f01efaec9d65f50c54aae37421dc3cbeba6535 0.0s done #6 CACHED
#7 [ 2/11] RUN SET -x && apt-get update && apt-get install -y --no-install-recommends erlang rebar && apt-get clean #7 ...
#8 https://github.com/erlang/rebar3/archive/refs/tags/3.18.0.tar.gz #8 ERROR: invalid not-modified ETag: "fce57989250a021a2be5fe5eddd655d6d415eef04f769bf1437f3d6dddfa5559"
#7 [ 2/11] RUN SET -x && apt-get update && apt-get install -y --no-install-recommends erlang rebar && apt-get clean #7 0.217 + apt-get update #7 CANCELED ------
https://github.com/erlang/rebar3/archive/refs/tags/3.18.0.tar.gz:
------ ERROR: failed to solve: failed to load cache key: invalid not-modified ETag: "fce57989250a021a2be5fe5eddd655d6d415eef04f769bf1437f3d6dddfa5559" make: *** [../make/Makefile:91: docker-build] Error 1 make: Leaving directory 'https://jenkins.osmocom.org/jenkins/job/update-osmo-ci-on-slaves/label=build2-deb11build-ansible/ws/_docker_playground/debian-bookworm-erlang' + exit 1 Build step 'Execute shell' marked build as failure
jenkins-notifications@lists.osmocom.org