Changes:
------------------------------------------ [...truncated 501.03 KiB...] 23172 376 24096 47644 ba1c board/compal_e99/compal_dsp_dump.highram.elf SIZE board/compal_e99/compal_dsp_dump.compalram.size text data bss dec hex filename 23168 376 24128 47672 ba38 board/compal_e99/compal_dsp_dump.compalram.elf SIZE board/se_j100/compal_dsp_dump.highram.size text data bss dec hex filename 23116 376 23676 47168 b840 board/se_j100/compal_dsp_dump.highram.elf SIZE board/se_j100/compal_dsp_dump.compalram.size text data bss dec hex filename 23112 376 23708 47196 b85c board/se_j100/compal_dsp_dump.compalram.elf SIZE board/se_k2xx/compal_dsp_dump.highram.size text data bss dec hex filename 23251 376 33940 57567 e0df board/se_k2xx/compal_dsp_dump.highram.elf SIZE board/gta0x/compal_dsp_dump.highram.size text data bss dec hex filename 16343 344 17556 34243 85c3 board/gta0x/compal_dsp_dump.highram.elf SIZE board/gtm900b/compal_dsp_dump.highram.size text data bss dec hex filename 17411 344 17560 35315 89f3 board/gtm900b/compal_dsp_dump.highram.elf SIZE board/fcdev3b/compal_dsp_dump.highram.size text data bss dec hex filename 15999 344 17556 33899 846b board/fcdev3b/compal_dsp_dump.highram.elf SIZE board/pirelli_dpl10/compal_dsp_dump.highram.size text data bss dec hex filename 23515 376 33940 57831 e1e7 board/pirelli_dpl10/compal_dsp_dump.highram.elf SIZE board/tr800/compal_dsp_dump.highram.size text data bss dec hex filename 18244 344 17556 36144 8d30 board/tr800/compal_dsp_dump.highram.elf SIZE board/compal_e88/layer1.compalram.size text data bss dec hex filename 59458 3946 27080 90484 16174 board/compal_e88/layer1.compalram.elf SIZE board/compal_e88/layer1.e88flash.size text data bss dec hex filename 59566 3948 27247 90761 16289 board/compal_e88/layer1.e88flash.elf SIZE board/compal_e88/layer1.e88loader.size text data bss dec hex filename 59242 3948 35495 98685 1817d board/compal_e88/layer1.e88loader.elf SIZE board/compal_e88/layer1.highram.size text data bss dec hex filename 59462 3946 27048 90456 16158 board/compal_e88/layer1.highram.elf SIZE board/compal_e86/layer1.compalram.size text data bss dec hex filename 57494 3922 32316 93732 16e24 board/compal_e86/layer1.compalram.elf SIZE board/compal_e86/layer1.highram.size text data bss dec hex filename 57466 3922 32284 93672 16de8 board/compal_e86/layer1.highram.elf SIZE board/compal_e99/layer1.compalram.size text data bss dec hex filename 56859 3922 32712 93493 16d35 board/compal_e99/layer1.compalram.elf SIZE board/compal_e99/layer1.highram.size text data bss dec hex filename 56863 3922 32680 93465 16d19 board/compal_e99/layer1.highram.elf SIZE board/se_j100/layer1.highram.size text data bss dec hex filename 56807 3922 32260 92989 16b3d board/se_j100/layer1.highram.elf SIZE board/se_j100/layer1.compalram.size text data bss dec hex filename 56835 3922 32292 93049 16b79 board/se_j100/layer1.compalram.elf SIZE board/se_k2xx/layer1.highram.size text data bss dec hex filename 58195 3922 42524 104641 198c1 board/se_k2xx/layer1.highram.elf SIZE board/gta0x/layer1.highram.size text data bss dec hex filename 51327 3890 26140 81357 13dcd board/gta0x/layer1.highram.elf SIZE board/gtm900b/layer1.highram.size text data bss dec hex filename 52491 3890 26148 82529 14261 board/gtm900b/layer1.highram.elf SIZE board/fcdev3b/layer1.highram.size text data bss dec hex filename 51047 3890 26140 81077 13cb5 board/fcdev3b/layer1.highram.elf SIZE board/pirelli_dpl10/layer1.highram.size text data bss dec hex filename 56914 3922 42528 103364 193c4 board/pirelli_dpl10/layer1.highram.elf SIZE board/tr800/layer1.highram.size text data bss dec hex filename 51739 3890 26140 81769 13f69 board/tr800/layer1.highram.elf SIZE board/compal_e88/loader.highram.size text data bss dec hex filename 27627 420 18532 46579 b5f3 board/compal_e88/loader.highram.elf SIZE board/compal_e88/loader.compalram.size text data bss dec hex filename 27625 420 18564 46609 b611 board/compal_e88/loader.compalram.elf SIZE board/compal_e86/loader.compalram.size text data bss dec hex filename 25531 388 23800 49719 c237 board/compal_e86/loader.compalram.elf SIZE board/compal_e86/loader.highram.size text data bss dec hex filename 25533 388 23768 49689 c219 board/compal_e86/loader.highram.elf SIZE board/compal_e99/loader.compalram.size text data bss dec hex filename 24931 388 24196 49515 c16b board/compal_e99/loader.compalram.elf SIZE board/compal_e99/loader.highram.size text data bss dec hex filename 24933 388 24164 49485 c14d board/compal_e99/loader.highram.elf SIZE board/se_j100/loader.compalram.size text data bss dec hex filename 24871 388 23776 49035 bf8b board/se_j100/loader.compalram.elf SIZE board/se_j100/loader.highram.size text data bss dec hex filename 24873 388 23744 49005 bf6d board/se_j100/loader.highram.elf SIZE board/se_k2xx/loader.highram.size text data bss dec hex filename 24975 388 34008 59371 e7eb board/se_k2xx/loader.highram.elf SIZE board/gta0x/loader.highram.size text data bss dec hex filename 18037 356 17624 36017 8cb1 board/gta0x/loader.highram.elf SIZE board/gtm900b/loader.highram.size text data bss dec hex filename 18325 356 17628 36309 8dd5 board/gtm900b/loader.highram.elf SIZE board/fcdev3b/loader.highram.size text data bss dec hex filename 17695 356 17624 35675 8b5b board/fcdev3b/loader.highram.elf SIZE board/pirelli_dpl10/loader.highram.size text data bss dec hex filename 25215 388 34008 59611 e8db board/pirelli_dpl10/loader.highram.elf SIZE board/tr800/loader.highram.size text data bss dec hex filename 19937 356 17624 37917 941d board/tr800/loader.highram.elf SIZE board/compal_e88/rssi.e88flash.size text data bss dec hex filename 77820 4060 25251 107131 1a27b board/compal_e88/rssi.e88flash.elf SIZE board/compal_e88/rssi.e88loader.size text data bss dec hex filename 77464 4060 33499 115023 1c14f board/compal_e88/rssi.e88loader.elf SIZE board/compal_e88/rssi.highram.size text data bss dec hex filename 77716 4058 25052 106826 1a14a board/compal_e88/rssi.highram.elf SIZE board/compal_e86/rssi.highram.size text data bss dec hex filename 75716 4034 30308 110058 1adea board/compal_e86/rssi.highram.elf SIZE board/compal_e99/rssi.highram.size text data bss dec hex filename 75117 4034 30708 109859 1ad23 board/compal_e99/rssi.highram.elf SIZE board/se_j100/rssi.highram.size text data bss dec hex filename 75061 4034 30284 109379 1ab43 board/se_j100/rssi.highram.elf SIZE board/se_k2xx/rssi.highram.size text data bss dec hex filename 76449 4034 40548 121031 1d8c7 board/se_k2xx/rssi.highram.elf SIZE board/gta0x/rssi.highram.size text data bss dec hex filename 69577 4002 24164 97743 17dcf board/gta0x/rssi.highram.elf SIZE board/gtm900b/rssi.highram.size text data bss dec hex filename 70741 4002 24172 98915 18263 board/gtm900b/rssi.highram.elf SIZE board/fcdev3b/rssi.highram.size text data bss dec hex filename 69297 4002 24164 97463 17cb7 board/fcdev3b/rssi.highram.elf SIZE board/pirelli_dpl10/rssi.highram.size text data bss dec hex filename 75164 4034 40552 119750 1d3c6 board/pirelli_dpl10/rssi.highram.elf SIZE board/tr800/rssi.highram.size text data bss dec hex filename 69989 4002 24164 98155 17f6b board/tr800/rssi.highram.elf SIZE board/compal_e88/menu.compalram.size text data bss dec hex filename 25987 404 19280 45671 b267 board/compal_e88/menu.compalram.elf SIZE board/compal_e88/menu.e88flash.size text data bss dec hex filename 26095 404 19447 45946 b37a board/compal_e88/menu.e88flash.elf SIZE board/compal_e88/menu.e88loader.size text data bss dec hex filename 25995 404 27695 54094 d34e board/compal_e88/menu.e88loader.elf SIZE board/compal_e86/menu.compalram.size text data bss dec hex filename 23861 380 24516 48757 be75 board/compal_e86/menu.compalram.elf SIZE board/compal_e99/menu.compalram.size text data bss dec hex filename 23308 380 24912 48600 bdd8 board/compal_e99/menu.compalram.elf SIZE board/se_j100/menu.compalram.size text data bss dec hex filename 23252 380 24492 48124 bbfc board/se_j100/menu.compalram.elf make[1]: Leaving directory '/build/src/target/firmware' + cd /build/src/target/trx_toolkit + python3 -m unittest discover -v test_no_timing_error_accumulated (test_clck_gen.CLCKGen_Test.test_no_timing_error_accumulated) ... WARNING:root:CLCKGen: time overrun by -779us; resetting the clock WARNING:root:CLCKGen: time overrun by -2555us; resetting the clock WARNING:root:CLCKGen: time overrun by -1004us; resetting the clock WARNING:root:CLCKGen: time overrun by -860us; resetting the clock WARNING:root:CLCKGen: time overrun by -2014us; resetting the clock WARNING:root:CLCKGen: time overrun by -2935us; resetting the clock FAIL test_period_is_gsm_frame (test_clck_gen.CLCKGen_Test.test_period_is_gsm_frame) ... ok test_from_bytes (test_codec.BitFieldSet.test_from_bytes) ... ok test_from_bytes_spare (test_codec.BitFieldSet.test_from_bytes_spare) ... ok test_from_bytes_val (test_codec.BitFieldSet.test_from_bytes_val) ... ok test_len_auto (test_codec.BitFieldSet.test_len_auto) ... ok test_offset_mask (test_codec.BitFieldSet.test_offset_mask) ... ok test_overflow (test_codec.BitFieldSet.test_overflow) ... ok test_to_bytes (test_codec.BitFieldSet.test_to_bytes) ... ok test_to_bytes_spare (test_codec.BitFieldSet.test_to_bytes_spare) ... ok test_to_bytes_val (test_codec.BitFieldSet.test_to_bytes_val) ... ok test_from_bytes (test_codec.Buf.test_from_bytes) ... ok test_to_bytes (test_codec.Buf.test_to_bytes) ... ok test_field_raises (test_codec.Envelope.test_field_raises) ... ok test_from_bytes (test_codec.Envelope.test_from_bytes) ... ok test_from_bytes_check (test_codec.Envelope.test_from_bytes_check) ... ok test_rest_octets (test_codec.Envelope.test_rest_octets) ... ok test_to_bytes (test_codec.Envelope.test_to_bytes) ... ok test_to_bytes_check (test_codec.Envelope.test_to_bytes_check) ... ok test_from_bytes (test_codec.Field.test_from_bytes) ... ok test_get_len (test_codec.Field.test_get_len) ... ok test_get_pres (test_codec.Field.test_get_pres) ... ok test_get_val (test_codec.Field.test_get_val) ... ok test_to_bytes (test_codec.Field.test_to_bytes) ... ok test_from_bytes (test_codec.Sequence.test_from_bytes) ... ok test_to_bytes (test_codec.Sequence.test_to_bytes) ... ok test_from_bytes (test_codec.Spare.test_from_bytes) ... ok test_to_bytes (test_codec.Spare.test_to_bytes) ... ok test_int16 (test_codec.Uint.test_int16) ... ok test_int32 (test_codec.Uint.test_int32) ... ok test_int8 (test_codec.Uint.test_int8) ... ok test_offset_mult (test_codec.Uint.test_offset_mult) ... ok test_uint16 (test_codec.Uint.test_uint16) ... ok test_uint32 (test_codec.Uint.test_uint32) ... ok test_uint8 (test_codec.Uint.test_uint8) ... ok test_parse_all_empty (test_data_dump.DATADump_Test.test_parse_all_empty) ... ok test_parse_empty (test_data_dump.DATADump_Test.test_parse_empty) ... ok test_parse_len_overflow (test_data_dump.DATADump_Test.test_parse_len_overflow) ... ok test_parse_msg_idx (test_data_dump.DATADump_Test.test_parse_msg_idx) ... ok test_parse_unknown_tag (test_data_dump.DATADump_Test.test_parse_unknown_tag) ... ok test_store_and_parse_all (test_data_dump.DATADump_Test.test_store_and_parse_all) ... ok test_store_and_parse_rx_msg (test_data_dump.DATADump_Test.test_store_and_parse_rx_msg) ... ok test_store_and_parse_tx_msg (test_data_dump.DATADump_Test.test_store_and_parse_tx_msg) ... ok test_bit_conv (test_data_msg.Msg_Test.test_bit_conv) ... ok test_enc_dec (test_data_msg.Msg_Test.test_enc_dec) ... ok test_rand_hdr_burst (test_data_msg.Msg_Test.test_rand_hdr_burst) ... ok test_transform (test_data_msg.Msg_Test.test_transform) ... ok test_validate (test_data_msg.Msg_Test.test_validate) ... ok
====================================================================== FAIL: test_no_timing_error_accumulated (test_clck_gen.CLCKGen_Test.test_no_timing_error_accumulated) ---------------------------------------------------------------------- Traceback (most recent call last): File "/build/src/target/trx_toolkit/test_clck_gen.py", line 60, in test_no_timing_error_accumulated self.assertTrue((ntick+1)*clck.ctr_interval > dT, "tick #%d: time overrun by %dus total" % AssertionError: False is not true : tick #200: time overrun by 11275us total
---------------------------------------------------------------------- Ran 48 tests in 0.997s
FAILED (failures=1) Build step 'Execute shell' marked build as failure $ ssh-agent -k unset SSH_AUTH_SOCK; unset SSH_AGENT_PID; echo Agent pid 2410060 killed; [ssh-agent] Stopped. Archiving artifacts
jenkins-notifications@lists.osmocom.org