Changes:
------------------------------------------ Started by upstream project "master-osmo-e1-hardware" build number 4 originally caused by: Started by user laforge Running as SYSTEM Building remotely on build2-deb9build-ansible (ttcn3 osmo-gsm-tester-build osmocom-gerrit-debian9 osmocom-master-debian9 coverity) in workspace https://jenkins.osmocom.org/jenkins/job/master-osmo-e1-hardware/a1=default,a2=default,a3=default,a4=default,label=osmocom-master-debian9/ws/ No credentials specified
git rev-parse --is-inside-work-tree # timeout=10
Fetching changes from the remote Git repository
git config remote.origin.url git://git.osmocom.org/osmo-e1-hardware # timeout=10
Fetching upstream changes from git://git.osmocom.org/osmo-e1-hardware
git --version # timeout=10 git fetch --tags --progress -- git://git.osmocom.org/osmo-e1-hardware +refs/heads/*:refs/remotes/origin/* # timeout=10
Checking out Revision 3255b7418767e2421ed615ebd5fb080c6e5b3cbe (refs/remotes/origin/master)
git config core.sparsecheckout # timeout=10 git checkout -f 3255b7418767e2421ed615ebd5fb080c6e5b3cbe # timeout=10
Commit message: "firmware: Build firmware files with auto-generated version numbers"
git rev-list --no-walk 3255b7418767e2421ed615ebd5fb080c6e5b3cbe # timeout=10
[osmocom-master-debian9] $ /bin/sh -xe /tmp/jenkins6752091751780936592.sh + docker pull registry.osmocom.org/osmocom-build/fpga-build Using default tag: latest latest: Pulling from osmocom-build/fpga-build 6c33745f49b4: Already exists 4f358f044f03: Pulling fs layer a7797217bec1: Pulling fs layer 3b3fca9c39a5: Pulling fs layer 54e98580560d: Pulling fs layer ad3e927f1018: Pulling fs layer 4e16ce7e2dc3: Pulling fs layer 158869286875: Pulling fs layer 54e98580560d: Waiting 4e16ce7e2dc3: Waiting ad3e927f1018: Waiting a7797217bec1: Verifying Checksum a7797217bec1: Download complete 3b3fca9c39a5: Verifying Checksum 3b3fca9c39a5: Download complete ad3e927f1018: Verifying Checksum ad3e927f1018: Download complete 4e16ce7e2dc3: Download complete 158869286875: Verifying Checksum 158869286875: Download complete 4f358f044f03: Verifying Checksum 4f358f044f03: Download complete 54e98580560d: Verifying Checksum 4f358f044f03: Pull complete a7797217bec1: Pull complete 3b3fca9c39a5: Pull complete 54e98580560d: Pull complete ad3e927f1018: Pull complete 4e16ce7e2dc3: Pull complete 158869286875: Pull complete Digest: sha256:b762bfc187e36882dcf7b8f0c2128439712098be08c540dbcd4d5d72ff38a2de Status: Downloaded newer image for registry.osmocom.org/osmocom-build/fpga-build:latest registry.osmocom.org/osmocom-build/fpga-build:latest + ARTIFACT_STORE=/home/osmocom-build/jenkins_build_artifact_store + mkdir -p /home/osmocom-build/jenkins_build_artifact_store + docker run --rm=true --cap-add SYS_PTRACE -e ARTIFACT_STORE=/artifact_store -e ASCIIDOC_WARNINGS_CHECK=1 -e HOME=/build -e JOB_NAME=master-osmo-e1-hardware/a1=default,a2=default,a3=default,a4=default,label=osmocom-master-debian9 -e MAKE=make -e OSMOPY_DEBUG_TCP_SOCKETS=1 -e PARALLEL_MAKE=-j 8 -e PATH=/usr/local/bin:/usr/bin:/bin:/usr/games:/home/osmocom-build/bin:/build_bin -e PUBLISH=1 -e WITH_MANUALS=1 -w /build -i -u build -v https://jenkins.osmocom.org/jenkins/job/master-osmo-e1-hardware/a1=default,a2=default,a3=default,a4=default,label=osmocom-master-debian9/ws/:/build -v /home/osmocom-build/bin:/build_bin -v /home/osmocom-build/jenkins_build_artifact_store:/artifact_store -v /home/osmocom-build/.ssh:/home/build/.ssh:ro registry.osmocom.org/osmocom-build/fpga-build /build/contrib/jenkins.sh docker: Error response from daemon: unable to find user build: no matching entries in passwd file. Build step 'Execute shell' marked build as failure [WARNINGS]Skipping publisher since build result is FAILURE
Changes:
------------------------------------------ Started by upstream project "master-osmo-e1-hardware" build number 5 originally caused by: Started by user laforge Started by upstream project "master-osmo-e1-hardware" build number 4 originally caused by: Started by user laforge Running as SYSTEM Building remotely on build2-deb9build-ansible (ttcn3 osmo-gsm-tester-build osmocom-gerrit-debian9 osmocom-master-debian9 coverity) in workspace https://jenkins.osmocom.org/jenkins/job/master-osmo-e1-hardware/a1=default,a2=default,a3=default,a4=default,label=osmocom-master-debian9/ws/ No credentials specified
git rev-parse --is-inside-work-tree # timeout=10
Fetching changes from the remote Git repository
git config remote.origin.url git://git.osmocom.org/osmo-e1-hardware # timeout=10
Fetching upstream changes from git://git.osmocom.org/osmo-e1-hardware
git --version # timeout=10 git fetch --tags --progress -- git://git.osmocom.org/osmo-e1-hardware +refs/heads/*:refs/remotes/origin/* # timeout=10
Checking out Revision 3255b7418767e2421ed615ebd5fb080c6e5b3cbe (refs/remotes/origin/master)
git config core.sparsecheckout # timeout=10 git checkout -f 3255b7418767e2421ed615ebd5fb080c6e5b3cbe # timeout=10
Commit message: "firmware: Build firmware files with auto-generated version numbers"
git rev-list --no-walk 3255b7418767e2421ed615ebd5fb080c6e5b3cbe # timeout=10
[osmocom-master-debian9] $ /bin/sh -xe /tmp/jenkins1125692230932424615.sh + docker pull registry.osmocom.org/osmocom-build/fpga-build Using default tag: latest latest: Pulling from osmocom-build/fpga-build 6c33745f49b4: Already exists 4f358f044f03: Already exists 160d446d5404: Pulling fs layer 8e5cca03a298: Pulling fs layer bad41e39e79e: Pulling fs layer b283334cc9e1: Pulling fs layer 3ec746f84cf2: Pulling fs layer 2803e27468de: Pulling fs layer 3ed3d4f2e027: Pulling fs layer ba100fc90fdc: Pulling fs layer 3ec746f84cf2: Waiting b283334cc9e1: Waiting 2803e27468de: Waiting ba100fc90fdc: Waiting 3ed3d4f2e027: Waiting 8e5cca03a298: Download complete bad41e39e79e: Verifying Checksum bad41e39e79e: Download complete 160d446d5404: Verifying Checksum 2803e27468de: Verifying Checksum 2803e27468de: Download complete 3ed3d4f2e027: Verifying Checksum ba100fc90fdc: Download complete b283334cc9e1: Verifying Checksum 3ec746f84cf2: Verifying Checksum 3ec746f84cf2: Download complete 160d446d5404: Pull complete 8e5cca03a298: Pull complete bad41e39e79e: Pull complete b283334cc9e1: Pull complete 3ec746f84cf2: Pull complete 2803e27468de: Pull complete 3ed3d4f2e027: Pull complete ba100fc90fdc: Pull complete Digest: sha256:4856afb7a033efd4df1f19cb8bb13362660d3a2bcdbef4c012fe2ded7ca3d2a0 Status: Downloaded newer image for registry.osmocom.org/osmocom-build/fpga-build:latest registry.osmocom.org/osmocom-build/fpga-build:latest + ARTIFACT_STORE=/home/osmocom-build/jenkins_build_artifact_store + mkdir -p /home/osmocom-build/jenkins_build_artifact_store + docker run --rm=true --cap-add SYS_PTRACE -e ARTIFACT_STORE=/artifact_store -e ASCIIDOC_WARNINGS_CHECK=1 -e HOME=/build -e JOB_NAME=master-osmo-e1-hardware/a1=default,a2=default,a3=default,a4=default,label=osmocom-master-debian9 -e MAKE=make -e OSMOPY_DEBUG_TCP_SOCKETS=1 -e PARALLEL_MAKE=-j 8 -e PATH=/usr/local/bin:/usr/bin:/bin:/usr/games:/home/osmocom-build/bin:/build_bin -e PUBLISH=1 -e WITH_MANUALS=1 -w /build -i -u build -v https://jenkins.osmocom.org/jenkins/job/master-osmo-e1-hardware/a1=default,a2=default,a3=default,a4=default,label=osmocom-master-debian9/ws/:/build -v /home/osmocom-build/bin:/build_bin -v /home/osmocom-build/jenkins_build_artifact_store:/artifact_store -v /home/osmocom-build/.ssh:/home/build/.ssh:ro registry.osmocom.org/osmocom-build/fpga-build /build/contrib/jenkins.sh --publish docker: Error response from daemon: OCI runtime create failed: container_linux.go:349: starting container process caused "exec: "/build/contrib/jenkins.sh": stat /build/contrib/jenkins.sh: no such file or directory": unknown. Build step 'Execute shell' marked build as failure [WARNINGS]Skipping publisher since build result is FAILURE
Changes:
[laforge] add contrib/jenkins.sh for build verification + manual / firmware upload
------------------------------------------ Started by upstream project "master-osmo-e1-hardware" build number 6 originally caused by: Started by user laforge Started by upstream project "master-osmo-e1-hardware" build number 5 originally caused by: Started by user laforge Started by upstream project "master-osmo-e1-hardware" build number 4 originally caused by: Started by user laforge Running as SYSTEM Building remotely on build2-deb9build-ansible (ttcn3 osmo-gsm-tester-build osmocom-gerrit-debian9 osmocom-master-debian9 coverity) in workspace https://jenkins.osmocom.org/jenkins/job/master-osmo-e1-hardware/a1=default,a2=default,a3=default,a4=default,label=osmocom-master-debian9/ws/ No credentials specified
git rev-parse --is-inside-work-tree # timeout=10
Fetching changes from the remote Git repository
git config remote.origin.url git://git.osmocom.org/osmo-e1-hardware # timeout=10
Fetching upstream changes from git://git.osmocom.org/osmo-e1-hardware
git --version # timeout=10 git fetch --tags --progress -- git://git.osmocom.org/osmo-e1-hardware +refs/heads/*:refs/remotes/origin/* # timeout=10
Checking out Revision e7bccbac8b1d21e0b43611ab79bfdc5d6b90ae73 (refs/remotes/origin/master)
git config core.sparsecheckout # timeout=10 git checkout -f e7bccbac8b1d21e0b43611ab79bfdc5d6b90ae73 # timeout=10
Commit message: "add contrib/jenkins.sh for build verification + manual / firmware upload"
git rev-list --no-walk 3255b7418767e2421ed615ebd5fb080c6e5b3cbe # timeout=10
[osmocom-master-debian9] $ /bin/sh -xe /tmp/jenkins3397817595067299532.sh + docker pull registry.osmocom.org/osmocom-build/fpga-build Using default tag: latest latest: Pulling from osmocom-build/fpga-build Digest: sha256:4856afb7a033efd4df1f19cb8bb13362660d3a2bcdbef4c012fe2ded7ca3d2a0 Status: Image is up to date for registry.osmocom.org/osmocom-build/fpga-build:latest registry.osmocom.org/osmocom-build/fpga-build:latest + ARTIFACT_STORE=/home/osmocom-build/jenkins_build_artifact_store + mkdir -p /home/osmocom-build/jenkins_build_artifact_store + docker run --rm=true --cap-add SYS_PTRACE -e ARTIFACT_STORE=/artifact_store -e ASCIIDOC_WARNINGS_CHECK=1 -e HOME=/build -e JOB_NAME=master-osmo-e1-hardware/a1=default,a2=default,a3=default,a4=default,label=osmocom-master-debian9 -e MAKE=make -e OSMOPY_DEBUG_TCP_SOCKETS=1 -e PARALLEL_MAKE=-j 8 -e PATH=/usr/local/bin:/usr/bin:/bin:/usr/games:/home/osmocom-build/bin:/build_bin -e PUBLISH=1 -e WITH_MANUALS=1 -w /build -i -u build -v https://jenkins.osmocom.org/jenkins/job/master-osmo-e1-hardware/a1=default,a2=default,a3=default,a4=default,label=osmocom-master-debian9/ws/:/build -v /home/osmocom-build/bin:/build_bin -v /home/osmocom-build/jenkins_build_artifact_store:/artifact_store -v /home/osmocom-build/.ssh:/home/build/.ssh:ro registry.osmocom.org/osmocom-build/fpga-build /build/contrib/jenkins.sh --publish
=============== firmware/ice40-riscv/e1-tracer FIRMWARE ============== make: Entering directory '/build/firmware/ice40-riscv/e1-tracer' Makefile:20: ../../../gateware/cores/no2usb/fw/fw.mk: No such file or directory make: *** No rule to make target '../../../gateware/cores/no2usb/fw/fw.mk'. Stop. make: Leaving directory '/build/firmware/ice40-riscv/e1-tracer' Build step 'Execute shell' marked build as failure [WARNINGS]Skipping publisher since build result is FAILURE
Changes:
------------------------------------------ Started by upstream project "master-osmo-e1-hardware" build number 7 originally caused by: Started by user laforge Running as SYSTEM Building remotely on build2-deb9build-ansible (ttcn3 osmo-gsm-tester-build osmocom-gerrit-debian9 osmocom-master-debian9 coverity) in workspace https://jenkins.osmocom.org/jenkins/job/master-osmo-e1-hardware/a1=default,a2=default,a3=default,a4=default,label=osmocom-master-debian9/ws/ No credentials specified
git rev-parse --is-inside-work-tree # timeout=10
Fetching changes from the remote Git repository
git config remote.origin.url git://git.osmocom.org/osmo-e1-hardware # timeout=10
Fetching upstream changes from git://git.osmocom.org/osmo-e1-hardware
git --version # timeout=10 git fetch --tags --progress -- git://git.osmocom.org/osmo-e1-hardware +refs/heads/*:refs/remotes/origin/* # timeout=10
Checking out Revision e7bccbac8b1d21e0b43611ab79bfdc5d6b90ae73 (refs/remotes/origin/master)
git config core.sparsecheckout # timeout=10 git checkout -f e7bccbac8b1d21e0b43611ab79bfdc5d6b90ae73 # timeout=10
Commit message: "add contrib/jenkins.sh for build verification + manual / firmware upload"
git rev-list --no-walk e7bccbac8b1d21e0b43611ab79bfdc5d6b90ae73 # timeout=10 git remote # timeout=10 git submodule init # timeout=10 git submodule sync # timeout=10 git config --get remote.origin.url # timeout=10 git submodule init # timeout=10 git config -f .gitmodules --get-regexp ^submodule.(.+).url # timeout=10 git config --get submodule.gateware/build.url # timeout=10 git config -f .gitmodules --get submodule.gateware/build.path # timeout=10 git config --get submodule.gateware/cores/no2e1.url # timeout=10 git config -f .gitmodules --get submodule.gateware/cores/no2e1.path # timeout=10 git config --get submodule.gateware/cores/no2ice40.url # timeout=10 git config -f .gitmodules --get submodule.gateware/cores/no2ice40.path # timeout=10 git config --get submodule.gateware/cores/no2misc.url # timeout=10 git config -f .gitmodules --get submodule.gateware/cores/no2misc.path # timeout=10 git config --get submodule.gateware/cores/no2usb.url # timeout=10 git config -f .gitmodules --get submodule.gateware/cores/no2usb.path # timeout=10 git submodule update --init --recursive gateware/build # timeout=10 git submodule update --init --recursive gateware/cores/no2e1 # timeout=10 git submodule update --init --recursive gateware/cores/no2ice40 # timeout=10 git submodule update --init --recursive gateware/cores/no2misc # timeout=10 git submodule update --init --recursive gateware/cores/no2usb # timeout=10
[osmocom-master-debian9] $ /bin/sh -xe /tmp/jenkins3518227145613621783.sh + docker pull registry.osmocom.org/osmocom-build/fpga-build Using default tag: latest latest: Pulling from osmocom-build/fpga-build Digest: sha256:4856afb7a033efd4df1f19cb8bb13362660d3a2bcdbef4c012fe2ded7ca3d2a0 Status: Image is up to date for registry.osmocom.org/osmocom-build/fpga-build:latest registry.osmocom.org/osmocom-build/fpga-build:latest + ARTIFACT_STORE=/home/osmocom-build/jenkins_build_artifact_store + mkdir -p /home/osmocom-build/jenkins_build_artifact_store + docker run --rm=true --cap-add SYS_PTRACE -e ARTIFACT_STORE=/artifact_store -e ASCIIDOC_WARNINGS_CHECK=1 -e HOME=/build -e JOB_NAME=master-osmo-e1-hardware/a1=default,a2=default,a3=default,a4=default,label=osmocom-master-debian9 -e MAKE=make -e OSMOPY_DEBUG_TCP_SOCKETS=1 -e PARALLEL_MAKE=-j 8 -e PATH=/usr/local/bin:/usr/bin:/bin:/usr/games:/home/osmocom-build/bin:/build_bin -e PUBLISH=1 -e WITH_MANUALS=1 -w /build -i -u build -v https://jenkins.osmocom.org/jenkins/job/master-osmo-e1-hardware/a1=default,a2=default,a3=default,a4=default,label=osmocom-master-debian9/ws/:/build -v /home/osmocom-build/bin:/build_bin -v /home/osmocom-build/jenkins_build_artifact_store:/artifact_store -v /home/osmocom-build/.ssh:/home/build/.ssh:ro registry.osmocom.org/osmocom-build/fpga-build /build/contrib/jenkins.sh --publish
=============== firmware/ice40-riscv/e1-tracer FIRMWARE ============== make: Entering directory '/build/firmware/ice40-riscv/e1-tracer' rm -f *.bin *.hex *.elf *.o *.gen.h /build/gateware/cores/no2usb/fw/usb_gen_strings.py usb_str_app.txt usb_str_app.gen.h e1-tracer riscv-none-embed-gcc -Wall -Wextra -Wno-unused -Os -march=rv32i -mabi=ilp32 -ffreestanding -flto -nostartfiles -fomit-frame-pointer -Wl,--gc-section --specs=nano.specs -DBOARD_E1_TRACER -I. -I../common -I/build/gateware/cores/no2usb/fw/v0/include -Wl,-Bstatic,-T,../common/lnk-app.lds,--strip-debug -o e1_tracer-fw-0.1-3-ge7bccba.elf ../common/../common/start.S ../common/console.c ../common/dma.c ../common/led.c ../common/mini-printf.c ../common/spi.c ../common/utils.c /build/gateware/cores/no2usb/fw/v0/src/usb.c /build/gateware/cores/no2usb/fw/v0/src/usb_ctrl_ep0.c /build/gateware/cores/no2usb/fw/v0/src/usb_ctrl_std.c /build/gateware/cores/no2usb/fw/v0/src/usb_dfu.c /build/gateware/cores/no2usb/fw/v0/src/usb_dfu_rt.c /build/gateware/cores/no2usb/fw/v0/src/usb_dfu_vendor.c /build/gateware/cores/no2usb/fw/v0/src/usb_msos20.c e1.c fw_app.c misc.c usb_desc_app.c usb_e1.c make: riscv-none-embed-gcc: Command not found make: *** [Makefile:67: e1_tracer-fw-0.1-3-ge7bccba.elf] Error 127 make: Leaving directory '/build/firmware/ice40-riscv/e1-tracer' Build step 'Execute shell' marked build as failure [WARNINGS] Skipping publisher since build result is FAILURE
Changes:
------------------------------------------ Started by upstream project "master-osmo-e1-hardware" build number 8 originally caused by: Started by user laforge Running as SYSTEM Building remotely on build2-deb9build-ansible (ttcn3 osmo-gsm-tester-build osmocom-gerrit-debian9 osmocom-master-debian9 coverity) in workspace https://jenkins.osmocom.org/jenkins/job/master-osmo-e1-hardware/a1=default,a2=default,a3=default,a4=default,label=osmocom-master-debian9/ws/ No credentials specified
git rev-parse --is-inside-work-tree # timeout=10
Fetching changes from the remote Git repository
git config remote.origin.url git://git.osmocom.org/osmo-e1-hardware # timeout=10
Fetching upstream changes from git://git.osmocom.org/osmo-e1-hardware
git --version # timeout=10 git fetch --tags --progress -- git://git.osmocom.org/osmo-e1-hardware +refs/heads/*:refs/remotes/origin/* # timeout=10
Checking out Revision e7bccbac8b1d21e0b43611ab79bfdc5d6b90ae73 (refs/remotes/origin/master)
git config core.sparsecheckout # timeout=10 git checkout -f e7bccbac8b1d21e0b43611ab79bfdc5d6b90ae73 # timeout=10
Commit message: "add contrib/jenkins.sh for build verification + manual / firmware upload"
git rev-list --no-walk e7bccbac8b1d21e0b43611ab79bfdc5d6b90ae73 # timeout=10 git remote # timeout=10 git submodule init # timeout=10 git submodule sync # timeout=10 git config --get remote.origin.url # timeout=10 git submodule init # timeout=10 git config -f .gitmodules --get-regexp ^submodule.(.+).url # timeout=10 git config --get submodule.gateware/build.url # timeout=10 git config -f .gitmodules --get submodule.gateware/build.path # timeout=10 git config --get submodule.gateware/cores/no2e1.url # timeout=10 git config -f .gitmodules --get submodule.gateware/cores/no2e1.path # timeout=10 git config --get submodule.gateware/cores/no2ice40.url # timeout=10 git config -f .gitmodules --get submodule.gateware/cores/no2ice40.path # timeout=10 git config --get submodule.gateware/cores/no2misc.url # timeout=10 git config -f .gitmodules --get submodule.gateware/cores/no2misc.path # timeout=10 git config --get submodule.gateware/cores/no2usb.url # timeout=10 git config -f .gitmodules --get submodule.gateware/cores/no2usb.path # timeout=10 git submodule update --init --recursive gateware/build # timeout=10 git submodule update --init --recursive gateware/cores/no2e1 # timeout=10 git submodule update --init --recursive gateware/cores/no2ice40 # timeout=10 git submodule update --init --recursive gateware/cores/no2misc # timeout=10 git submodule update --init --recursive gateware/cores/no2usb # timeout=10
[osmocom-master-debian9] $ /bin/sh -xe /tmp/jenkins8454171333439115916.sh + docker pull registry.osmocom.org/osmocom-build/fpga-build Using default tag: latest latest: Pulling from osmocom-build/fpga-build 6c33745f49b4: Already exists 4f358f044f03: Already exists 160d446d5404: Already exists 8e5cca03a298: Already exists bad41e39e79e: Already exists b283334cc9e1: Already exists 3ec746f84cf2: Already exists 2803e27468de: Already exists 3ed3d4f2e027: Already exists ba100fc90fdc: Already exists cfff2baaf33b: Pulling fs layer cfff2baaf33b: Verifying Checksum cfff2baaf33b: Download complete cfff2baaf33b: Pull complete Digest: sha256:69957104100f45a4645ad3f0ed4ca9e9ae4c1b3ab521f093ca7b6219daaec119 Status: Downloaded newer image for registry.osmocom.org/osmocom-build/fpga-build:latest registry.osmocom.org/osmocom-build/fpga-build:latest + ARTIFACT_STORE=/home/osmocom-build/jenkins_build_artifact_store + mkdir -p /home/osmocom-build/jenkins_build_artifact_store + docker run --rm=true --cap-add SYS_PTRACE -e ARTIFACT_STORE=/artifact_store -e ASCIIDOC_WARNINGS_CHECK=1 -e HOME=/build -e JOB_NAME=master-osmo-e1-hardware/a1=default,a2=default,a3=default,a4=default,label=osmocom-master-debian9 -e MAKE=make -e OSMOPY_DEBUG_TCP_SOCKETS=1 -e PARALLEL_MAKE=-j 8 -e PATH=/usr/local/bin:/usr/bin:/bin:/usr/games:/home/osmocom-build/bin:/build_bin -e PUBLISH=1 -e WITH_MANUALS=1 -w /build -i -u build -v https://jenkins.osmocom.org/jenkins/job/master-osmo-e1-hardware/a1=default,a2=default,a3=default,a4=default,label=osmocom-master-debian9/ws/:/build -v /home/osmocom-build/bin:/build_bin -v /home/osmocom-build/jenkins_build_artifact_store:/artifact_store -v /home/osmocom-build/.ssh:/home/build/.ssh:ro registry.osmocom.org/osmocom-build/fpga-build /build/contrib/jenkins.sh --publish
=============== firmware/ice40-riscv/e1-tracer FIRMWARE ============== make: Entering directory '/build/firmware/ice40-riscv/e1-tracer' rm -f *.bin *.hex *.elf *.o *.gen.h /build/gateware/cores/no2usb/fw/usb_gen_strings.py usb_str_app.txt usb_str_app.gen.h e1-tracer riscv-none-embed-gcc -Wall -Wextra -Wno-unused -Os -march=rv32i -mabi=ilp32 -ffreestanding -flto -nostartfiles -fomit-frame-pointer -Wl,--gc-section --specs=nano.specs -DBOARD_E1_TRACER -I. -I../common -I/build/gateware/cores/no2usb/fw/v0/include -Wl,-Bstatic,-T,../common/lnk-app.lds,--strip-debug -o e1_tracer-fw-0.1-3-ge7bccba.elf ../common/../common/start.S ../common/console.c ../common/dma.c ../common/led.c ../common/mini-printf.c ../common/spi.c ../common/utils.c /build/gateware/cores/no2usb/fw/v0/src/usb.c /build/gateware/cores/no2usb/fw/v0/src/usb_ctrl_ep0.c /build/gateware/cores/no2usb/fw/v0/src/usb_ctrl_std.c /build/gateware/cores/no2usb/fw/v0/src/usb_dfu.c /build/gateware/cores/no2usb/fw/v0/src/usb_dfu_rt.c /build/gateware/cores/no2usb/fw/v0/src/usb_dfu_vendor.c /build/gateware/cores/no2usb/fw/v0/src/usb_msos20.c e1.c fw_app.c misc.c usb_desc_app.c usb_e1.c make: riscv-none-embed-gcc: Command not found make: *** [Makefile:67: e1_tracer-fw-0.1-3-ge7bccba.elf] Error 127 make: Leaving directory '/build/firmware/ice40-riscv/e1-tracer' Build step 'Execute shell' marked build as failure [WARNINGS] Skipping publisher since build result is FAILURE
Changes:
------------------------------------------ Started by upstream project "master-osmo-e1-hardware" build number 9 originally caused by: Started by user laforge Running as SYSTEM Building remotely on build2-deb9build-ansible (ttcn3 osmo-gsm-tester-build osmocom-gerrit-debian9 osmocom-master-debian9 coverity) in workspace https://jenkins.osmocom.org/jenkins/job/master-osmo-e1-hardware/a1=default,a2=default,a3=default,a4=default,label=osmocom-master-debian9/ws/ No credentials specified
git rev-parse --is-inside-work-tree # timeout=10
Fetching changes from the remote Git repository
git config remote.origin.url git://git.osmocom.org/osmo-e1-hardware # timeout=10
Fetching upstream changes from git://git.osmocom.org/osmo-e1-hardware
git --version # timeout=10 git fetch --tags --progress -- git://git.osmocom.org/osmo-e1-hardware +refs/heads/*:refs/remotes/origin/* # timeout=10
Checking out Revision e7bccbac8b1d21e0b43611ab79bfdc5d6b90ae73 (refs/remotes/origin/master)
git config core.sparsecheckout # timeout=10 git checkout -f e7bccbac8b1d21e0b43611ab79bfdc5d6b90ae73 # timeout=10
Commit message: "add contrib/jenkins.sh for build verification + manual / firmware upload"
git rev-list --no-walk e7bccbac8b1d21e0b43611ab79bfdc5d6b90ae73 # timeout=10 git remote # timeout=10 git submodule init # timeout=10 git submodule sync # timeout=10 git config --get remote.origin.url # timeout=10 git submodule init # timeout=10 git config -f .gitmodules --get-regexp ^submodule.(.+).url # timeout=10 git config --get submodule.gateware/build.url # timeout=10 git config -f .gitmodules --get submodule.gateware/build.path # timeout=10 git config --get submodule.gateware/cores/no2e1.url # timeout=10 git config -f .gitmodules --get submodule.gateware/cores/no2e1.path # timeout=10 git config --get submodule.gateware/cores/no2ice40.url # timeout=10 git config -f .gitmodules --get submodule.gateware/cores/no2ice40.path # timeout=10 git config --get submodule.gateware/cores/no2misc.url # timeout=10 git config -f .gitmodules --get submodule.gateware/cores/no2misc.path # timeout=10 git config --get submodule.gateware/cores/no2usb.url # timeout=10 git config -f .gitmodules --get submodule.gateware/cores/no2usb.path # timeout=10 git submodule update --init --recursive gateware/build # timeout=10 git submodule update --init --recursive gateware/cores/no2e1 # timeout=10 git submodule update --init --recursive gateware/cores/no2ice40 # timeout=10 git submodule update --init --recursive gateware/cores/no2misc # timeout=10 git submodule update --init --recursive gateware/cores/no2usb # timeout=10
[osmocom-master-debian9] $ /bin/sh -xe /tmp/jenkins5226423805522353197.sh + docker pull registry.osmocom.org/osmocom-build/fpga-build Using default tag: latest latest: Pulling from osmocom-build/fpga-build Digest: sha256:69957104100f45a4645ad3f0ed4ca9e9ae4c1b3ab521f093ca7b6219daaec119 Status: Image is up to date for registry.osmocom.org/osmocom-build/fpga-build:latest registry.osmocom.org/osmocom-build/fpga-build:latest + ARTIFACT_STORE=/home/osmocom-build/jenkins_build_artifact_store + mkdir -p /home/osmocom-build/jenkins_build_artifact_store + docker run --rm=true --cap-add SYS_PTRACE -e ARTIFACT_STORE=/artifact_store -e ASCIIDOC_WARNINGS_CHECK=1 -e HOME=/build -e JOB_NAME=master-osmo-e1-hardware/a1=default,a2=default,a3=default,a4=default,label=osmocom-master-debian9 -e MAKE=make -e OSMOPY_DEBUG_TCP_SOCKETS=1 -e PARALLEL_MAKE=-j 8 -e PUBLISH=1 -e WITH_MANUALS=1 -w /build -i -u build -v https://jenkins.osmocom.org/jenkins/job/master-osmo-e1-hardware/a1=default,a2=default,a3=default,a4=default,label=osmocom-master-debian9/ws/:/build -v /home/osmocom-build/bin:/build_bin -v /home/osmocom-build/jenkins_build_artifact_store:/artifact_store -v /home/osmocom-build/.ssh:/home/build/.ssh:ro registry.osmocom.org/osmocom-build/fpga-build /build/contrib/jenkins.sh --publish
=============== firmware/ice40-riscv/e1-tracer FIRMWARE ============== make: Entering directory '/build/firmware/ice40-riscv/e1-tracer' rm -f *.bin *.hex *.elf *.o *.gen.h /build/gateware/cores/no2usb/fw/usb_gen_strings.py usb_str_app.txt usb_str_app.gen.h e1-tracer riscv-none-embed-gcc -Wall -Wextra -Wno-unused -Os -march=rv32i -mabi=ilp32 -ffreestanding -flto -nostartfiles -fomit-frame-pointer -Wl,--gc-section --specs=nano.specs -DBOARD_E1_TRACER -I. -I../common -I/build/gateware/cores/no2usb/fw/v0/include -Wl,-Bstatic,-T,../common/lnk-app.lds,--strip-debug -o e1_tracer-fw-0.1-3-ge7bccba.elf ../common/../common/start.S ../common/console.c ../common/dma.c ../common/led.c ../common/mini-printf.c ../common/spi.c ../common/utils.c /build/gateware/cores/no2usb/fw/v0/src/usb.c /build/gateware/cores/no2usb/fw/v0/src/usb_ctrl_ep0.c /build/gateware/cores/no2usb/fw/v0/src/usb_ctrl_std.c /build/gateware/cores/no2usb/fw/v0/src/usb_dfu.c /build/gateware/cores/no2usb/fw/v0/src/usb_dfu_rt.c /build/gateware/cores/no2usb/fw/v0/src/usb_dfu_vendor.c /build/gateware/cores/no2usb/fw/v0/src/usb_msos20.c e1.c fw_app.c misc.c usb_desc_app.c usb_e1.c riscv-none-embed-objcopy -O binary e1_tracer-fw-0.1-3-ge7bccba.elf e1_tracer-fw-0.1-3-ge7bccba.bin ln -sf e1_tracer-fw-0.1-3-ge7bccba.bin e1_tracer-fw.bin ln -sf e1_tracer-fw-0.1-3-ge7bccba.elf e1_tracer-fw.elf make: Leaving directory '/build/firmware/ice40-riscv/e1-tracer'
=============== firmware/ice40-riscv/icE1usb FIRMWARE ============== make: Entering directory '/build/firmware/ice40-riscv/icE1usb' rm -f *.bin *.hex *.elf *.o *.gen.h /build/gateware/cores/no2usb/fw/usb_gen_strings.py usb_str_app.txt usb_str_app.gen.h ice1usb riscv-none-embed-gcc -Wall -Wextra -Wno-unused -Os -march=rv32i -mabi=ilp32 -ffreestanding -flto -nostartfiles -fomit-frame-pointer -Wl,--gc-section --specs=nano.specs -DBOARD_ICE1USB -I. -I../common -I/build/gateware/cores/no2usb/fw/v0/include -Wl,-Bstatic,-T,../common/lnk-app.lds,--strip-debug -o icE1usb-fw-0.1-3-ge7bccba.elf ../common/../common/start.S ../common/console.c ../common/dma.c ../common/led.c ../common/mini-printf.c ../common/spi.c ../common/utils.c /build/gateware/cores/no2usb/fw/v0/src/usb.c /build/gateware/cores/no2usb/fw/v0/src/usb_ctrl_ep0.c /build/gateware/cores/no2usb/fw/v0/src/usb_ctrl_std.c /build/gateware/cores/no2usb/fw/v0/src/usb_dfu.c /build/gateware/cores/no2usb/fw/v0/src/usb_dfu_rt.c /build/gateware/cores/no2usb/fw/v0/src/usb_dfu_vendor.c /build/gateware/cores/no2usb/fw/v0/src/usb_msos20.c e1.c fw_app.c misc.c usb_desc_app.c usb_e1.c riscv-none-embed-objcopy -O binary icE1usb-fw-0.1-3-ge7bccba.elf icE1usb-fw-0.1-3-ge7bccba.bin ln -sf icE1usb-fw-0.1-3-ge7bccba.bin icE1usb-fw.bin ln -sf icE1usb-fw-0.1-3-ge7bccba.elf icE1usb-fw.elf make: Leaving directory '/build/firmware/ice40-riscv/icE1usb'
=============== UPLOAD FIRMWARE ============== /build/contrib/jenkins.sh: line 35: rsync: command not found Build step 'Execute shell' marked build as failure [WARNINGS] Skipping publisher since build result is FAILURE
Changes:
------------------------------------------ Started by upstream project "master-osmo-e1-hardware" build number 10 originally caused by: Started by user laforge Running as SYSTEM Building remotely on build2-deb9build-ansible (ttcn3 osmo-gsm-tester-build osmocom-gerrit-debian9 osmocom-master-debian9 coverity) in workspace https://jenkins.osmocom.org/jenkins/job/master-osmo-e1-hardware/a1=default,a2=default,a3=default,a4=default,label=osmocom-master-debian9/ws/ No credentials specified
git rev-parse --is-inside-work-tree # timeout=10
Fetching changes from the remote Git repository
git config remote.origin.url git://git.osmocom.org/osmo-e1-hardware # timeout=10
Fetching upstream changes from git://git.osmocom.org/osmo-e1-hardware
git --version # timeout=10 git fetch --tags --progress -- git://git.osmocom.org/osmo-e1-hardware +refs/heads/*:refs/remotes/origin/* # timeout=10
Checking out Revision e7bccbac8b1d21e0b43611ab79bfdc5d6b90ae73 (refs/remotes/origin/master)
git config core.sparsecheckout # timeout=10 git checkout -f e7bccbac8b1d21e0b43611ab79bfdc5d6b90ae73 # timeout=10
Commit message: "add contrib/jenkins.sh for build verification + manual / firmware upload"
git rev-list --no-walk e7bccbac8b1d21e0b43611ab79bfdc5d6b90ae73 # timeout=10 git remote # timeout=10 git submodule init # timeout=10 git submodule sync # timeout=10 git config --get remote.origin.url # timeout=10 git submodule init # timeout=10 git config -f .gitmodules --get-regexp ^submodule.(.+).url # timeout=10 git config --get submodule.gateware/build.url # timeout=10 git config -f .gitmodules --get submodule.gateware/build.path # timeout=10 git config --get submodule.gateware/cores/no2e1.url # timeout=10 git config -f .gitmodules --get submodule.gateware/cores/no2e1.path # timeout=10 git config --get submodule.gateware/cores/no2ice40.url # timeout=10 git config -f .gitmodules --get submodule.gateware/cores/no2ice40.path # timeout=10 git config --get submodule.gateware/cores/no2misc.url # timeout=10 git config -f .gitmodules --get submodule.gateware/cores/no2misc.path # timeout=10 git config --get submodule.gateware/cores/no2usb.url # timeout=10 git config -f .gitmodules --get submodule.gateware/cores/no2usb.path # timeout=10 git submodule update --init --recursive gateware/build # timeout=10 git submodule update --init --recursive gateware/cores/no2e1 # timeout=10 git submodule update --init --recursive gateware/cores/no2ice40 # timeout=10 git submodule update --init --recursive gateware/cores/no2misc # timeout=10 git submodule update --init --recursive gateware/cores/no2usb # timeout=10
[osmocom-master-debian9] $ /bin/sh -xe /tmp/jenkins5754750015860907380.sh + docker pull registry.osmocom.org/osmocom-build/fpga-build Using default tag: latest latest: Pulling from osmocom-build/fpga-build Digest: sha256:6c9fa4125cce6b8991bb941a90b5ce1f7fc07fed4049ecc7918d14070b56393a Status: Image is up to date for registry.osmocom.org/osmocom-build/fpga-build:latest registry.osmocom.org/osmocom-build/fpga-build:latest + ARTIFACT_STORE=/home/osmocom-build/jenkins_build_artifact_store + mkdir -p /home/osmocom-build/jenkins_build_artifact_store + docker run --rm=true --cap-add SYS_PTRACE -e ARTIFACT_STORE=/artifact_store -e ASCIIDOC_WARNINGS_CHECK=1 -e HOME=/build -e JOB_NAME=master-osmo-e1-hardware/a1=default,a2=default,a3=default,a4=default,label=osmocom-master-debian9 -e MAKE=make -e OSMOPY_DEBUG_TCP_SOCKETS=1 -e PARALLEL_MAKE=-j 8 -e PUBLISH=1 -e WITH_MANUALS=1 -w /build -i -u build -v https://jenkins.osmocom.org/jenkins/job/master-osmo-e1-hardware/a1=default,a2=default,a3=default,a4=default,label=osmocom-master-debian9/ws/:/build -v /home/osmocom-build/bin:/build_bin -v /home/osmocom-build/jenkins_build_artifact_store:/artifact_store -v /home/osmocom-build/.ssh:/home/build/.ssh:ro registry.osmocom.org/osmocom-build/fpga-build /build/contrib/jenkins.sh --publish
=============== firmware/ice40-riscv/e1-tracer FIRMWARE ============== make: Entering directory '/build/firmware/ice40-riscv/e1-tracer' rm -f *.bin *.hex *.elf *.o *.gen.h /build/gateware/cores/no2usb/fw/usb_gen_strings.py usb_str_app.txt usb_str_app.gen.h e1-tracer riscv-none-embed-gcc -Wall -Wextra -Wno-unused -Os -march=rv32i -mabi=ilp32 -ffreestanding -flto -nostartfiles -fomit-frame-pointer -Wl,--gc-section --specs=nano.specs -DBOARD_E1_TRACER -I. -I../common -I/build/gateware/cores/no2usb/fw/v0/include -Wl,-Bstatic,-T,../common/lnk-app.lds,--strip-debug -o e1_tracer-fw-0.1-3-ge7bccba.elf ../common/../common/start.S ../common/console.c ../common/dma.c ../common/led.c ../common/mini-printf.c ../common/spi.c ../common/utils.c /build/gateware/cores/no2usb/fw/v0/src/usb.c /build/gateware/cores/no2usb/fw/v0/src/usb_ctrl_ep0.c /build/gateware/cores/no2usb/fw/v0/src/usb_ctrl_std.c /build/gateware/cores/no2usb/fw/v0/src/usb_dfu.c /build/gateware/cores/no2usb/fw/v0/src/usb_dfu_rt.c /build/gateware/cores/no2usb/fw/v0/src/usb_dfu_vendor.c /build/gateware/cores/no2usb/fw/v0/src/usb_msos20.c e1.c fw_app.c misc.c usb_desc_app.c usb_e1.c riscv-none-embed-objcopy -O binary e1_tracer-fw-0.1-3-ge7bccba.elf e1_tracer-fw-0.1-3-ge7bccba.bin ln -sf e1_tracer-fw-0.1-3-ge7bccba.bin e1_tracer-fw.bin ln -sf e1_tracer-fw-0.1-3-ge7bccba.elf e1_tracer-fw.elf make: Leaving directory '/build/firmware/ice40-riscv/e1-tracer'
=============== firmware/ice40-riscv/icE1usb FIRMWARE ============== make: Entering directory '/build/firmware/ice40-riscv/icE1usb' rm -f *.bin *.hex *.elf *.o *.gen.h /build/gateware/cores/no2usb/fw/usb_gen_strings.py usb_str_app.txt usb_str_app.gen.h ice1usb riscv-none-embed-gcc -Wall -Wextra -Wno-unused -Os -march=rv32i -mabi=ilp32 -ffreestanding -flto -nostartfiles -fomit-frame-pointer -Wl,--gc-section --specs=nano.specs -DBOARD_ICE1USB -I. -I../common -I/build/gateware/cores/no2usb/fw/v0/include -Wl,-Bstatic,-T,../common/lnk-app.lds,--strip-debug -o icE1usb-fw-0.1-3-ge7bccba.elf ../common/../common/start.S ../common/console.c ../common/dma.c ../common/led.c ../common/mini-printf.c ../common/spi.c ../common/utils.c /build/gateware/cores/no2usb/fw/v0/src/usb.c /build/gateware/cores/no2usb/fw/v0/src/usb_ctrl_ep0.c /build/gateware/cores/no2usb/fw/v0/src/usb_ctrl_std.c /build/gateware/cores/no2usb/fw/v0/src/usb_dfu.c /build/gateware/cores/no2usb/fw/v0/src/usb_dfu_rt.c /build/gateware/cores/no2usb/fw/v0/src/usb_dfu_vendor.c /build/gateware/cores/no2usb/fw/v0/src/usb_msos20.c e1.c fw_app.c misc.c usb_desc_app.c usb_e1.c riscv-none-embed-objcopy -O binary icE1usb-fw-0.1-3-ge7bccba.elf icE1usb-fw-0.1-3-ge7bccba.bin ln -sf icE1usb-fw-0.1-3-ge7bccba.bin icE1usb-fw.bin ln -sf icE1usb-fw-0.1-3-ge7bccba.elf icE1usb-fw.elf make: Leaving directory '/build/firmware/ice40-riscv/icE1usb'
=============== UPLOAD FIRMWARE ============== rsync: Failed to exec ssh: No such file or directory (2) rsync error: error in IPC code (code 14) at pipe.c(85) [sender=3.1.3] rsync: connection unexpectedly closed (0 bytes received so far) [sender] rsync error: error in IPC code (code 14) at io.c(235) [sender=3.1.3] Build step 'Execute shell' marked build as failure [WARNINGS] Skipping publisher since build result is FAILURE
Changes:
------------------------------------------ Started by upstream project "master-osmo-e1-hardware" build number 11 originally caused by: Started by user laforge Running as SYSTEM Building remotely on build2-deb9build-ansible (ttcn3 osmo-gsm-tester-build osmocom-gerrit-debian9 osmocom-master-debian9 coverity) in workspace https://jenkins.osmocom.org/jenkins/job/master-osmo-e1-hardware/a1=default,a2=default,a3=default,a4=default,label=osmocom-master-debian9/ws/ No credentials specified
git rev-parse --is-inside-work-tree # timeout=10
Fetching changes from the remote Git repository
git config remote.origin.url git://git.osmocom.org/osmo-e1-hardware # timeout=10
Fetching upstream changes from git://git.osmocom.org/osmo-e1-hardware
git --version # timeout=10 git fetch --tags --progress -- git://git.osmocom.org/osmo-e1-hardware +refs/heads/*:refs/remotes/origin/* # timeout=10
Checking out Revision e7bccbac8b1d21e0b43611ab79bfdc5d6b90ae73 (refs/remotes/origin/master)
git config core.sparsecheckout # timeout=10 git checkout -f e7bccbac8b1d21e0b43611ab79bfdc5d6b90ae73 # timeout=10
Commit message: "add contrib/jenkins.sh for build verification + manual / firmware upload"
git rev-list --no-walk e7bccbac8b1d21e0b43611ab79bfdc5d6b90ae73 # timeout=10 git remote # timeout=10 git submodule init # timeout=10 git submodule sync # timeout=10 git config --get remote.origin.url # timeout=10 git submodule init # timeout=10 git config -f .gitmodules --get-regexp ^submodule.(.+).url # timeout=10 git config --get submodule.gateware/build.url # timeout=10 git config -f .gitmodules --get submodule.gateware/build.path # timeout=10 git config --get submodule.gateware/cores/no2e1.url # timeout=10 git config -f .gitmodules --get submodule.gateware/cores/no2e1.path # timeout=10 git config --get submodule.gateware/cores/no2ice40.url # timeout=10 git config -f .gitmodules --get submodule.gateware/cores/no2ice40.path # timeout=10 git config --get submodule.gateware/cores/no2misc.url # timeout=10 git config -f .gitmodules --get submodule.gateware/cores/no2misc.path # timeout=10 git config --get submodule.gateware/cores/no2usb.url # timeout=10 git config -f .gitmodules --get submodule.gateware/cores/no2usb.path # timeout=10 git submodule update --init --recursive gateware/build # timeout=10 git submodule update --init --recursive gateware/cores/no2e1 # timeout=10 git submodule update --init --recursive gateware/cores/no2ice40 # timeout=10 git submodule update --init --recursive gateware/cores/no2misc # timeout=10 git submodule update --init --recursive gateware/cores/no2usb # timeout=10
[osmocom-master-debian9] $ /bin/sh -xe /tmp/jenkins5024738560190810774.sh + docker pull registry.osmocom.org/osmocom-build/fpga-build Using default tag: latest latest: Pulling from osmocom-build/fpga-build Digest: sha256:98f49734b55b825864c94e5466c6e4bb915893545500c4e30a1ca69dd109ab15 Status: Image is up to date for registry.osmocom.org/osmocom-build/fpga-build:latest registry.osmocom.org/osmocom-build/fpga-build:latest + ARTIFACT_STORE=/home/osmocom-build/jenkins_build_artifact_store + mkdir -p /home/osmocom-build/jenkins_build_artifact_store + docker run --rm=true --cap-add SYS_PTRACE -e ARTIFACT_STORE=/artifact_store -e ASCIIDOC_WARNINGS_CHECK=1 -e HOME=/build -e JOB_NAME=master-osmo-e1-hardware/a1=default,a2=default,a3=default,a4=default,label=osmocom-master-debian9 -e MAKE=make -e OSMOPY_DEBUG_TCP_SOCKETS=1 -e PARALLEL_MAKE=-j 8 -e PUBLISH=1 -e WITH_MANUALS=1 -w /build -i -u build -v https://jenkins.osmocom.org/jenkins/job/master-osmo-e1-hardware/a1=default,a2=default,a3=default,a4=default,label=osmocom-master-debian9/ws/:/build -v /home/osmocom-build/bin:/build_bin -v /home/osmocom-build/jenkins_build_artifact_store:/artifact_store -v /home/osmocom-build/.ssh:/home/build/.ssh:ro registry.osmocom.org/osmocom-build/fpga-build /build/contrib/jenkins.sh --publish
=============== firmware/ice40-riscv/e1-tracer FIRMWARE ============== make: Entering directory '/build/firmware/ice40-riscv/e1-tracer' rm -f *.bin *.hex *.elf *.o *.gen.h /build/gateware/cores/no2usb/fw/usb_gen_strings.py usb_str_app.txt usb_str_app.gen.h e1-tracer riscv-none-embed-gcc -Wall -Wextra -Wno-unused -Os -march=rv32i -mabi=ilp32 -ffreestanding -flto -nostartfiles -fomit-frame-pointer -Wl,--gc-section --specs=nano.specs -DBOARD_E1_TRACER -I. -I../common -I/build/gateware/cores/no2usb/fw/v0/include -Wl,-Bstatic,-T,../common/lnk-app.lds,--strip-debug -o e1_tracer-fw-0.1-3-ge7bccba.elf ../common/../common/start.S ../common/console.c ../common/dma.c ../common/led.c ../common/mini-printf.c ../common/spi.c ../common/utils.c /build/gateware/cores/no2usb/fw/v0/src/usb.c /build/gateware/cores/no2usb/fw/v0/src/usb_ctrl_ep0.c /build/gateware/cores/no2usb/fw/v0/src/usb_ctrl_std.c /build/gateware/cores/no2usb/fw/v0/src/usb_dfu.c /build/gateware/cores/no2usb/fw/v0/src/usb_dfu_rt.c /build/gateware/cores/no2usb/fw/v0/src/usb_dfu_vendor.c /build/gateware/cores/no2usb/fw/v0/src/usb_msos20.c e1.c fw_app.c misc.c usb_desc_app.c usb_e1.c riscv-none-embed-objcopy -O binary e1_tracer-fw-0.1-3-ge7bccba.elf e1_tracer-fw-0.1-3-ge7bccba.bin ln -sf e1_tracer-fw-0.1-3-ge7bccba.bin e1_tracer-fw.bin ln -sf e1_tracer-fw-0.1-3-ge7bccba.elf e1_tracer-fw.elf make: Leaving directory '/build/firmware/ice40-riscv/e1-tracer'
=============== firmware/ice40-riscv/icE1usb FIRMWARE ============== make: Entering directory '/build/firmware/ice40-riscv/icE1usb' rm -f *.bin *.hex *.elf *.o *.gen.h /build/gateware/cores/no2usb/fw/usb_gen_strings.py usb_str_app.txt usb_str_app.gen.h ice1usb riscv-none-embed-gcc -Wall -Wextra -Wno-unused -Os -march=rv32i -mabi=ilp32 -ffreestanding -flto -nostartfiles -fomit-frame-pointer -Wl,--gc-section --specs=nano.specs -DBOARD_ICE1USB -I. -I../common -I/build/gateware/cores/no2usb/fw/v0/include -Wl,-Bstatic,-T,../common/lnk-app.lds,--strip-debug -o icE1usb-fw-0.1-3-ge7bccba.elf ../common/../common/start.S ../common/console.c ../common/dma.c ../common/led.c ../common/mini-printf.c ../common/spi.c ../common/utils.c /build/gateware/cores/no2usb/fw/v0/src/usb.c /build/gateware/cores/no2usb/fw/v0/src/usb_ctrl_ep0.c /build/gateware/cores/no2usb/fw/v0/src/usb_ctrl_std.c /build/gateware/cores/no2usb/fw/v0/src/usb_dfu.c /build/gateware/cores/no2usb/fw/v0/src/usb_dfu_rt.c /build/gateware/cores/no2usb/fw/v0/src/usb_dfu_vendor.c /build/gateware/cores/no2usb/fw/v0/src/usb_msos20.c e1.c fw_app.c misc.c usb_desc_app.c usb_e1.c riscv-none-embed-objcopy -O binary icE1usb-fw-0.1-3-ge7bccba.elf icE1usb-fw-0.1-3-ge7bccba.bin ln -sf icE1usb-fw-0.1-3-ge7bccba.bin icE1usb-fw.bin ln -sf icE1usb-fw-0.1-3-ge7bccba.elf icE1usb-fw.elf make: Leaving directory '/build/firmware/ice40-riscv/icE1usb'
=============== UPLOAD FIRMWARE ============== Warning: Permanently added the ECDSA host key for IP address '[144.76.43.76]:48' to the list of known hosts. sending incremental file list icE1usb-fw-0.1-3-ge7bccba.bin icE1usb-fw-0.1-3-ge7bccba.elf
sent 16,066 bytes received 54 bytes 32,240.00 bytes/sec total size is 29,204 speedup is 1.81 sending incremental file list icE1usb-fw.bin -> icE1usb-fw-0.1-3-ge7bccba.bin icE1usb-fw.elf -> icE1usb-fw-0.1-3-ge7bccba.elf
sent 148 bytes received 22 bytes 113.33 bytes/sec total size is 58 speedup is 0.34 sending incremental file list e1_tracer-fw-0.1-3-ge7bccba.bin e1_tracer-fw-0.1-3-ge7bccba.elf
sent 15,358 bytes received 54 bytes 30,824.00 bytes/sec total size is 28,188 speedup is 1.83 sending incremental file list e1_tracer-fw.bin -> e1_tracer-fw-0.1-3-ge7bccba.bin e1_tracer-fw.elf -> e1_tracer-fw-0.1-3-ge7bccba.elf
sent 158 bytes received 22 bytes 360.00 bytes/sec total size is 62 speedup is 0.34 make: Entering directory '/build/doc/manuals' Package osmo-gsm-manuals was not found in the pkg-config search path. Perhaps you should add the directory containing `osmo-gsm-manuals.pc' to the PKG_CONFIG_PATH environment variable No package 'osmo-gsm-manuals' found make: Leaving directory '/build/doc/manuals' Makefile:9: /build/Makefile.common.inc: No such file or directory make: *** No rule to make target '/build/Makefile.common.inc'. Stop. Build step 'Execute shell' marked build as failure [WARNINGS] Skipping publisher since build result is FAILURE
Changes:
[laforge] add missing icE1usb-usermanual-docinfo.xml
[laforge] contrib/jenkins.sh 'publish' fixes
------------------------------------------ Started by upstream project "master-osmo-e1-hardware" build number 12 originally caused by: Started by an SCM change Running as SYSTEM Building remotely on host2-deb9build-ansible (ttcn3 osmo-gsm-tester-build osmocom-gerrit-debian9 osmocom-master-debian9 coverity) in workspace https://jenkins.osmocom.org/jenkins/job/master-osmo-e1-hardware/a1=default,a2=default,a3=default,a4=default,label=osmocom-master-debian9/ws/ No credentials specified
git rev-parse --is-inside-work-tree # timeout=10
Fetching changes from the remote Git repository
git config remote.origin.url git://git.osmocom.org/osmo-e1-hardware # timeout=10
Fetching upstream changes from git://git.osmocom.org/osmo-e1-hardware
git --version # timeout=10 git fetch --tags --progress -- git://git.osmocom.org/osmo-e1-hardware +refs/heads/*:refs/remotes/origin/* # timeout=10
Checking out Revision a624ef80d73663d27f216bd917805871db50a657 (refs/remotes/origin/master)
git config core.sparsecheckout # timeout=10 git checkout -f a624ef80d73663d27f216bd917805871db50a657 # timeout=10
Commit message: "contrib/jenkins.sh 'publish' fixes"
git rev-list --no-walk e7bccbac8b1d21e0b43611ab79bfdc5d6b90ae73 # timeout=10 git remote # timeout=10 git submodule init # timeout=10 git submodule sync # timeout=10 git config --get remote.origin.url # timeout=10 git submodule init # timeout=10 git config -f .gitmodules --get-regexp ^submodule.(.+).url # timeout=10 git config --get submodule.gateware/build.url # timeout=10 git config -f .gitmodules --get submodule.gateware/build.path # timeout=10 git config --get submodule.gateware/cores/no2e1.url # timeout=10 git config -f .gitmodules --get submodule.gateware/cores/no2e1.path # timeout=10 git config --get submodule.gateware/cores/no2ice40.url # timeout=10 git config -f .gitmodules --get submodule.gateware/cores/no2ice40.path # timeout=10 git config --get submodule.gateware/cores/no2misc.url # timeout=10 git config -f .gitmodules --get submodule.gateware/cores/no2misc.path # timeout=10 git config --get submodule.gateware/cores/no2usb.url # timeout=10 git config -f .gitmodules --get submodule.gateware/cores/no2usb.path # timeout=10 git submodule update --init --recursive gateware/build # timeout=10 git submodule update --init --recursive gateware/cores/no2e1 # timeout=10 git submodule update --init --recursive gateware/cores/no2ice40 # timeout=10 git submodule update --init --recursive gateware/cores/no2misc # timeout=10 git submodule update --init --recursive gateware/cores/no2usb # timeout=10
[osmocom-master-debian9] $ /bin/sh -xe /tmp/jenkins2708487397297959252.sh + docker pull registry.osmocom.org/osmocom-build/fpga-build Using default tag: latest latest: Pulling from osmocom-build/fpga-build 6c33745f49b4: Already exists ea6ca88d7686: Pulling fs layer d45498198c52: Pulling fs layer a886b8782056: Pulling fs layer 418a1d2ec941: Pulling fs layer 29d25a142151: Pulling fs layer 308aadc98913: Pulling fs layer ab7c0b7c227b: Pulling fs layer 6991d0272c51: Pulling fs layer bc2fcda83685: Pulling fs layer ed77b86e8604: Pulling fs layer 689d2f069aa1: Pulling fs layer 418a1d2ec941: Waiting 6991d0272c51: Waiting bc2fcda83685: Waiting ab7c0b7c227b: Waiting ed77b86e8604: Waiting 308aadc98913: Waiting 29d25a142151: Waiting 689d2f069aa1: Waiting a886b8782056: Verifying Checksum a886b8782056: Download complete 418a1d2ec941: Verifying Checksum 418a1d2ec941: Download complete ea6ca88d7686: Verifying Checksum ea6ca88d7686: Download complete d45498198c52: Verifying Checksum d45498198c52: Download complete ab7c0b7c227b: Download complete 6991d0272c51: Download complete bc2fcda83685: Verifying Checksum bc2fcda83685: Download complete ed77b86e8604: Download complete 689d2f069aa1: Verifying Checksum 689d2f069aa1: Download complete 29d25a142151: Verifying Checksum 29d25a142151: Download complete 308aadc98913: Verifying Checksum 308aadc98913: Download complete ea6ca88d7686: Pull complete d45498198c52: Pull complete a886b8782056: Pull complete 418a1d2ec941: Pull complete 29d25a142151: Pull complete 308aadc98913: Pull complete ab7c0b7c227b: Pull complete 6991d0272c51: Pull complete bc2fcda83685: Pull complete ed77b86e8604: Pull complete 689d2f069aa1: Pull complete Digest: sha256:98f49734b55b825864c94e5466c6e4bb915893545500c4e30a1ca69dd109ab15 Status: Downloaded newer image for registry.osmocom.org/osmocom-build/fpga-build:latest registry.osmocom.org/osmocom-build/fpga-build:latest + ARTIFACT_STORE=/home/osmocom-build/jenkins_build_artifact_store + mkdir -p /home/osmocom-build/jenkins_build_artifact_store + docker run --rm=true --cap-add SYS_PTRACE -e ARTIFACT_STORE=/artifact_store -e ASCIIDOC_WARNINGS_CHECK=1 -e HOME=/build -e JOB_NAME=master-osmo-e1-hardware/a1=default,a2=default,a3=default,a4=default,label=osmocom-master-debian9 -e MAKE=make -e OSMOPY_DEBUG_TCP_SOCKETS=1 -e PARALLEL_MAKE=-j 4 -e PUBLISH=1 -e WITH_MANUALS=1 -w /build -i -u build -v https://jenkins.osmocom.org/jenkins/job/master-osmo-e1-hardware/a1=default,a2=default,a3=default,a4=default,label=osmocom-master-debian9/ws/:/build -v /home/osmocom-build/bin:/build_bin -v /home/osmocom-build/jenkins_build_artifact_store:/artifact_store -v /home/osmocom-build/.ssh:/home/build/.ssh:ro registry.osmocom.org/osmocom-build/fpga-build /build/contrib/jenkins.sh --publish Error: We need to have scripts/osmo-deps.sh from http://git.osmocom.org/osmo-ci/ in PATH ! Build step 'Execute shell' marked build as failure [WARNINGS] Skipping publisher since build result is FAILURE
Changes:
------------------------------------------ Started by upstream project "master-osmo-e1-hardware" build number 13 originally caused by: Started by user laforge Running as SYSTEM Building remotely on host2-deb9build-ansible (ttcn3 osmo-gsm-tester-build osmocom-gerrit-debian9 osmocom-master-debian9 coverity) in workspace https://jenkins.osmocom.org/jenkins/job/master-osmo-e1-hardware/a1=default,a2=default,a3=default,a4=default,label=osmocom-master-debian9/ws/ No credentials specified
git rev-parse --is-inside-work-tree # timeout=10
Fetching changes from the remote Git repository
git config remote.origin.url git://git.osmocom.org/osmo-e1-hardware # timeout=10
Fetching upstream changes from git://git.osmocom.org/osmo-e1-hardware
git --version # timeout=10 git fetch --tags --progress -- git://git.osmocom.org/osmo-e1-hardware +refs/heads/*:refs/remotes/origin/* # timeout=10
Checking out Revision a624ef80d73663d27f216bd917805871db50a657 (refs/remotes/origin/master)
git config core.sparsecheckout # timeout=10 git checkout -f a624ef80d73663d27f216bd917805871db50a657 # timeout=10
Commit message: "contrib/jenkins.sh 'publish' fixes"
git rev-list --no-walk a624ef80d73663d27f216bd917805871db50a657 # timeout=10 git remote # timeout=10 git submodule init # timeout=10 git submodule sync # timeout=10 git config --get remote.origin.url # timeout=10 git submodule init # timeout=10 git config -f .gitmodules --get-regexp ^submodule.(.+).url # timeout=10 git config --get submodule.gateware/build.url # timeout=10 git config -f .gitmodules --get submodule.gateware/build.path # timeout=10 git config --get submodule.gateware/cores/no2e1.url # timeout=10 git config -f .gitmodules --get submodule.gateware/cores/no2e1.path # timeout=10 git config --get submodule.gateware/cores/no2ice40.url # timeout=10 git config -f .gitmodules --get submodule.gateware/cores/no2ice40.path # timeout=10 git config --get submodule.gateware/cores/no2misc.url # timeout=10 git config -f .gitmodules --get submodule.gateware/cores/no2misc.path # timeout=10 git config --get submodule.gateware/cores/no2usb.url # timeout=10 git config -f .gitmodules --get submodule.gateware/cores/no2usb.path # timeout=10 git submodule update --init --recursive gateware/build # timeout=10 git submodule update --init --recursive gateware/cores/no2e1 # timeout=10 git submodule update --init --recursive gateware/cores/no2ice40 # timeout=10 git submodule update --init --recursive gateware/cores/no2misc # timeout=10 git submodule update --init --recursive gateware/cores/no2usb # timeout=10
[osmocom-master-debian9] $ /bin/sh -xe /tmp/jenkins550776283553572547.sh + docker pull registry.osmocom.org/osmocom-build/fpga-build Using default tag: latest latest: Pulling from osmocom-build/fpga-build 6c33745f49b4: Already exists 4f358f044f03: Pulling fs layer 2056a4c7a7f0: Pulling fs layer 18e35279c22c: Pulling fs layer 12d63f98fa54: Pulling fs layer 67f439c96339: Pulling fs layer f89e7740a1f9: Pulling fs layer 542ea6fba3e5: Pulling fs layer bcee23b0a42b: Pulling fs layer 643917465953: Pulling fs layer 2fe72e2b9fe3: Pulling fs layer 542ea6fba3e5: Waiting f89e7740a1f9: Waiting bcee23b0a42b: Waiting 2fe72e2b9fe3: Waiting 67f439c96339: Waiting 643917465953: Waiting 12d63f98fa54: Waiting 18e35279c22c: Verifying Checksum 18e35279c22c: Download complete 12d63f98fa54: Verifying Checksum 12d63f98fa54: Download complete 4f358f044f03: Verifying Checksum 4f358f044f03: Download complete 2056a4c7a7f0: Verifying Checksum 2056a4c7a7f0: Download complete 542ea6fba3e5: Verifying Checksum 542ea6fba3e5: Download complete bcee23b0a42b: Download complete 643917465953: Verifying Checksum 643917465953: Download complete 2fe72e2b9fe3: Download complete 67f439c96339: Verifying Checksum 67f439c96339: Download complete f89e7740a1f9: Verifying Checksum f89e7740a1f9: Download complete 4f358f044f03: Pull complete 2056a4c7a7f0: Pull complete 18e35279c22c: Pull complete 12d63f98fa54: Pull complete 67f439c96339: Pull complete f89e7740a1f9: Pull complete 542ea6fba3e5: Pull complete bcee23b0a42b: Pull complete 643917465953: Pull complete 2fe72e2b9fe3: Pull complete Digest: sha256:64e9880cc38fc13fb08abf94605144c980a53d7237ff8275086a9e19021e7448 Status: Downloaded newer image for registry.osmocom.org/osmocom-build/fpga-build:latest registry.osmocom.org/osmocom-build/fpga-build:latest + ARTIFACT_STORE=/home/osmocom-build/jenkins_build_artifact_store + mkdir -p /home/osmocom-build/jenkins_build_artifact_store + docker run --rm=true --cap-add SYS_PTRACE -e ARTIFACT_STORE=/artifact_store -e ASCIIDOC_WARNINGS_CHECK=1 -e HOME=/build -e JOB_NAME=master-osmo-e1-hardware/a1=default,a2=default,a3=default,a4=default,label=osmocom-master-debian9 -e MAKE=make -e OSMOPY_DEBUG_TCP_SOCKETS=1 -e PARALLEL_MAKE=-j 4 -e PUBLISH=1 -e WITH_MANUALS=1 -w /build -i -u build -v https://jenkins.osmocom.org/jenkins/job/master-osmo-e1-hardware/a1=default,a2=default,a3=default,a4=default,label=osmocom-master-debian9/ws/:/build -v /home/osmocom-build/bin:/build_bin -v /home/osmocom-build/jenkins_build_artifact_store:/artifact_store -v /home/osmocom-build/.ssh:/home/build/.ssh:ro registry.osmocom.org/osmocom-build/fpga-build /build/contrib/jenkins.sh --publish Error: We need to have scripts/osmo-deps.sh from http://git.osmocom.org/osmo-ci/ in PATH ! Build step 'Execute shell' marked build as failure [WARNINGS] Skipping publisher since build result is FAILURE
Changes:
[laforge] contrib/jenkins.sh: ugly work-around for PATH problems
------------------------------------------ [...truncated 49.90 KB...] asciidoc: rf.adoc: line 673: evaluating: {set2:target:test-usermanual__55.png} asciidoc: rf.adoc: line 679: filtering: "/usr/bin/python2" "/etc/asciidoc/filters/graphviz/graphviz2png.py" -v -o "/build/deps/osmo-gsm-manuals/tests/test-usermanual__55.png" -L dot -F png - Execute: dot -Tpng "/build/deps/osmo-gsm-manuals/tests/test-usermanual__55.txt" > "/build/deps/osmo-gsm-manuals/tests/test-usermanual__55.png" asciidoc: include: /build/deps/osmo-gsm-manuals/common/chapters/gb-variants.adoc asciidoc: test-usermanual.adoc: line 33: reading: /build/deps/osmo-gsm-manuals/common/chapters/gb-variants.adoc asciidoc: include: /build/deps/osmo-gsm-manuals/common/chapters/gb-ip-sns.msc asciidoc: gb-variants.adoc: line 163: reading: /build/deps/osmo-gsm-manuals/common/chapters/gb-ip-sns.msc asciidoc: gb-variants.adoc: line 162: evaluating: {counter2:target-number} asciidoc: gb-variants.adoc: line 162: evaluating: {set2:target:test-usermanual__56.png} asciidoc: gb-ip-sns.msc: line 38: filtering: "/usr/bin/python2" "./build/filter-wrapper.py" mscgen -o "/build/deps/osmo-gsm-manuals/tests/test-usermanual__56.png" -Tpng - asciidoc: include: /build/deps/osmo-gsm-manuals/common/chapters/glossary.adoc asciidoc: test-usermanual.adoc: line 34: reading: /build/deps/osmo-gsm-manuals/common/chapters/glossary.adoc
a2x: executing: "dblatex" -t pdf -p "/etc/asciidoc/dblatex/asciidoc-dblatex.xsl" -s "/etc/asciidoc/dblatex/asciidoc-dblatex.sty" -s ../build/custom-dblatex.sty -P draft.mode=yes -P draft.watermark=0 -V "/build/deps/osmo-gsm-manuals/tests/test-usermanual.xml"
Build the book set list... xsltproc -o doclist.txt --xinclude --xincludestyle doclist.xsl /build/deps/osmo-gsm-manuals/tests/test-usermanual.xml /build/deps/osmo-gsm-manuals/tests/test-usermanual.xml:643: element section: validity error : ID mgcp-extension-osmux already defined <section id="mgcp-extension-osmux"> ^ Build the listings... xsltproc -o listings.xml --xinclude --xincludestyle --param current.dir '/build/deps/osmo-gsm-manuals/tests' /usr/share/dblatex/xsl/common/mklistings.xsl /build/deps/osmo-gsm-manuals/tests/test-usermanual.xml /build/deps/osmo-gsm-manuals/tests/test-usermanual.xml:643: element section: validity error : ID mgcp-extension-osmux already defined <section id="mgcp-extension-osmux"> ^ xsltproc -o test-usermanual.rtex --xinclude --xincludestyle --param current.dir '/build/deps/osmo-gsm-manuals/tests' --param listings.xml '/tmp/tmpQ96HPU/listings.xml' /tmp/tmpQ96HPU/custom.xsl /build/deps/osmo-gsm-manuals/tests/test-usermanual.xml /build/deps/osmo-gsm-manuals/tests/test-usermanual.xml:643: element section: validity error : ID mgcp-extension-osmux already defined <section id="mgcp-extension-osmux"> ^ XSLT stylesheets DocBook - LaTeX 2e (0.3.10) =================================================== Error: no ID for constraint linkend: ctrl_common_var. XRef to nonexistent id: ctrl_common_var Error: no ID for constraint linkend: 3gpp-ts-23-041. XRef to nonexistent id: 3gpp-ts-23-041 Error: no ID for constraint linkend: gsm-bands. XRef to nonexistent id: gsm-bands Error: no ID for constraint linkend: ietf-rfc791. XRef to nonexistent id: ietf-rfc791 Section level > 6 not well supported for bibliodiv Error: no ID for constraint linkend: modified-vesion. XRef to nonexistent id: modified-vesion Image 'dblatex' not found Cannot convert 'test-usermanual__1.png' to pdf Cannot convert 'test-usermanual__2.png' to pdf Cannot convert 'test-usermanual__3.png' to pdf Cannot convert 'test-usermanual__4.png' to pdf Cannot convert 'test-usermanual__5.png' to pdf Cannot convert 'test-usermanual__6.png' to pdf Cannot convert 'test-usermanual__7.png' to pdf Cannot convert 'test-usermanual__8.png' to pdf Cannot convert 'test-usermanual__9.png' to pdf Cannot convert 'test-usermanual__10.png' to pdf Cannot convert 'test-usermanual__11.png' to pdf Cannot convert 'test-usermanual__12.png' to pdf Cannot convert 'test-usermanual__13.png' to pdf Cannot convert 'test-usermanual__14.png' to pdf Cannot convert 'test-usermanual__15.png' to pdf Cannot convert 'test-usermanual__16.png' to pdf Cannot convert 'test-usermanual__17.png' to pdf Cannot convert 'test-usermanual__18.png' to pdf Cannot convert 'test-usermanual__19.png' to pdf Cannot convert 'test-usermanual__20.png' to pdf Cannot convert 'test-usermanual__21.png' to pdf Cannot convert 'test-usermanual__22.png' to pdf Cannot convert 'test-usermanual__23.png' to pdf Cannot convert './common/images/wireshark-gsmtap-log.png' to pdf Cannot convert 'test-usermanual__24.png' to pdf Cannot convert 'test-usermanual__25.png' to pdf Cannot convert 'test-usermanual__26.png' to pdf Cannot convert 'test-usermanual__27.png' to pdf Cannot convert 'test-usermanual__28.png' to pdf Cannot convert 'test-usermanual__29.png' to pdf Cannot convert 'test-usermanual__30.png' to pdf Cannot convert 'test-usermanual__31.png' to pdf Cannot convert 'test-usermanual__32.png' to pdf Cannot convert 'test-usermanual__33.png' to pdf Cannot convert 'test-usermanual__34.png' to pdf Cannot convert 'test-usermanual__35.png' to pdf Cannot convert 'test-usermanual__36.png' to pdf Cannot convert 'test-usermanual__37.png' to pdf Cannot convert 'test-usermanual__38.png' to pdf Cannot convert 'test-usermanual__39.png' to pdf Cannot convert 'test-usermanual__40.png' to pdf Cannot convert 'test-usermanual__41.png' to pdf Cannot convert 'test-usermanual__42.png' to pdf Cannot convert 'test-usermanual__43.png' to pdf Cannot convert 'test-usermanual__44.png' to pdf Cannot convert 'test-usermanual__45.png' to pdf Cannot convert 'test-usermanual__46.png' to pdf Cannot convert 'test-usermanual__47.png' to pdf Cannot convert 'test-usermanual__48.png' to pdf Cannot convert 'test-usermanual__49.png' to pdf Cannot convert 'test-usermanual__50.png' to pdf Cannot convert 'test-usermanual__51.png' to pdf Cannot convert 'test-usermanual__52.png' to pdf Cannot convert 'test-usermanual__53.png' to pdf Cannot convert 'test-usermanual__54.png' to pdf Cannot convert 'test-usermanual__55.png' to pdf Cannot convert 'test-usermanual__56.png' to pdf Build test-usermanual.pdf built-in module pdftex registered no support found for ifthen no support found for ifxetex no support found for fontspec no support found for xltxtra no support found for fontenc no support found for inputenc no support found for fancybox built-in module makeidx registered no support found for custom-dblatex built-in module bibtopic registered building additional files... checking if compiling is necessary... the output file doesn't exist pdflatex -interaction=batchmode test-usermanual.tex running post-compilation scripts... [index] the index file /tmp/tmpQ96HPU/test-usermanual.idx is empty test-usermanual.aux MD5 checksum changed test-usermanual.toc MD5 checksum changed the /tmp/tmpQ96HPU/test-usermanual.aux file has changed pdflatex -interaction=batchmode test-usermanual.tex running post-compilation scripts... [index] the index file /tmp/tmpQ96HPU/test-usermanual.idx is empty no new compilation is needed running last-compilation scripts... 'test-usermanual.pdf' successfully built
a2x: deleting /build/deps/osmo-gsm-manuals/tests/test-usermanual.xml if [ "1" != "1" ]; then \ for i in test-usermanual.pdf test-vty-reference.pdf test2-vty-reference.pdf; do \ install -vDm644 "$i" "/build/deps/install/stow/osmo-gsm-manuals/share/doc/osmo-gsm-manuals-doc/$i" || exit 1; \ done; \ fi rm generated/docbook_test2-vty-reference.xml make[2]: Leaving directory '/build/deps/osmo-gsm-manuals/tests' make[2]: Entering directory '/build/deps/osmo-gsm-manuals' make[3]: Entering directory '/build/deps/osmo-gsm-manuals' make[3]: Nothing to be done for 'install-exec-am'. /bin/mkdir -p '/build/deps/install/stow/osmo-gsm-manuals/lib/pkgconfig' /usr/bin/install -c -m 644 osmo-gsm-manuals.pc '/build/deps/install/stow/osmo-gsm-manuals/lib/pkgconfig' make install-data-hook make[4]: Entering directory '/build/deps/osmo-gsm-manuals' cd "." && \ files="$(find build common *.xsl -not -type d)" && \ for i in $files; do \ if [ -x "$i" ]; then \ mode=755; \ else \ mode=644; \ fi; \ install -vDm$mode "$i" ""/build/deps/install/stow/osmo-gsm-manuals/share/osmo-gsm-manuals"/$i" || exit 1; \ done; install: creating directory '/build/deps/install/stow/osmo-gsm-manuals/share' install: creating directory '/build/deps/install/stow/osmo-gsm-manuals/share/osmo-gsm-manuals' install: creating directory '/build/deps/install/stow/osmo-gsm-manuals/share/osmo-gsm-manuals/build' 'build/Makefile.common.inc' -> '/build/deps/install/stow/osmo-gsm-manuals/share/osmo-gsm-manuals/build/Makefile.common.inc' 'build/unix-time-to-fmt.py' -> '/build/deps/install/stow/osmo-gsm-manuals/share/osmo-gsm-manuals/build/unix-time-to-fmt.py' 'build/docinfo-releaseinfo.conf' -> '/build/deps/install/stow/osmo-gsm-manuals/share/osmo-gsm-manuals/build/docinfo-releaseinfo.conf' 'build/mscgen-filter.conf' -> '/build/deps/install/stow/osmo-gsm-manuals/share/osmo-gsm-manuals/build/mscgen-filter.conf' 'build/filter-wrapper.py' -> '/build/deps/install/stow/osmo-gsm-manuals/share/osmo-gsm-manuals/build/filter-wrapper.py' 'build/Makefile.docbook.inc' -> '/build/deps/install/stow/osmo-gsm-manuals/share/osmo-gsm-manuals/build/Makefile.docbook.inc' 'build/custom-dblatex.sty' -> '/build/deps/install/stow/osmo-gsm-manuals/share/osmo-gsm-manuals/build/custom-dblatex.sty' 'build/Makefile.vty-reference.inc' -> '/build/deps/install/stow/osmo-gsm-manuals/share/osmo-gsm-manuals/build/Makefile.vty-reference.inc' 'build/find_existing_path.sh' -> '/build/deps/install/stow/osmo-gsm-manuals/share/osmo-gsm-manuals/build/find_existing_path.sh' 'build/diag-filter.conf' -> '/build/deps/install/stow/osmo-gsm-manuals/share/osmo-gsm-manuals/build/diag-filter.conf' 'build/known_hosts' -> '/build/deps/install/stow/osmo-gsm-manuals/share/osmo-gsm-manuals/build/known_hosts' 'build/vty_reference_combine.sh' -> '/build/deps/install/stow/osmo-gsm-manuals/share/osmo-gsm-manuals/build/vty_reference_combine.sh' 'build/Makefile.asciidoc.inc' -> '/build/deps/install/stow/osmo-gsm-manuals/share/osmo-gsm-manuals/build/Makefile.asciidoc.inc' install: creating directory '/build/deps/install/stow/osmo-gsm-manuals/share/osmo-gsm-manuals/common' install: creating directory '/build/deps/install/stow/osmo-gsm-manuals/share/osmo-gsm-manuals/common/snippets' 'common/snippets/dynamic_channel_type_bullets.adoc' -> '/build/deps/install/stow/osmo-gsm-manuals/share/osmo-gsm-manuals/common/snippets/dynamic_channel_type_bullets.adoc' 'common/vty_additions.xml' -> '/build/deps/install/stow/osmo-gsm-manuals/share/osmo-gsm-manuals/common/vty_additions.xml' 'common/ns_vty_additions.xml' -> '/build/deps/install/stow/osmo-gsm-manuals/share/osmo-gsm-manuals/common/ns_vty_additions.xml' install: creating directory '/build/deps/install/stow/osmo-gsm-manuals/share/osmo-gsm-manuals/common/images' 'common/images/sysmocom.pdf' -> '/build/deps/install/stow/osmo-gsm-manuals/share/osmo-gsm-manuals/common/images/sysmocom.pdf' 'common/images/wireshark-gsmtap-log.png' -> '/build/deps/install/stow/osmo-gsm-manuals/share/osmo-gsm-manuals/common/images/wireshark-gsmtap-log.png' 'common/images/gb-ip-nsvc.pdf' -> '/build/deps/install/stow/osmo-gsm-manuals/share/osmo-gsm-manuals/common/images/gb-ip-nsvc.pdf' 'common/images/osmocom.pdf' -> '/build/deps/install/stow/osmo-gsm-manuals/share/osmo-gsm-manuals/common/images/osmocom.pdf' 'common/images/lte-eps.dot' -> '/build/deps/install/stow/osmo-gsm-manuals/share/osmo-gsm-manuals/common/images/lte-eps.dot' 'common/images/gb-concepts-pool.pdf' -> '/build/deps/install/stow/osmo-gsm-manuals/share/osmo-gsm-manuals/common/images/gb-concepts-pool.pdf' 'common/images/lte-eps-sgs.dot' -> '/build/deps/install/stow/osmo-gsm-manuals/share/osmo-gsm-manuals/common/images/lte-eps-sgs.dot' install: creating directory '/build/deps/install/stow/osmo-gsm-manuals/share/osmo-gsm-manuals/common/chapters' 'common/chapters/msc_mncc_mt_sip_mgcp.msc' -> '/build/deps/install/stow/osmo-gsm-manuals/share/osmo-gsm-manuals/common/chapters/msc_mncc_mt_sip_mgcp.msc' 'common/chapters/preface.adoc' -> '/build/deps/install/stow/osmo-gsm-manuals/share/osmo-gsm-manuals/common/chapters/preface.adoc' install: creating directory '/build/deps/install/stow/osmo-gsm-manuals/share/osmo-gsm-manuals/common/chapters/osmux' 'common/chapters/osmux/osmux.adoc' -> '/build/deps/install/stow/osmo-gsm-manuals/share/osmo-gsm-manuals/common/chapters/osmux/osmux.adoc' 'common/chapters/osmux/network_osmux_sccplite.dot' -> '/build/deps/install/stow/osmo-gsm-manuals/share/osmo-gsm-manuals/common/chapters/osmux/network_osmux_sccplite.dot' 'common/chapters/osmux/network_osmux_aoip.dot' -> '/build/deps/install/stow/osmo-gsm-manuals/share/osmo-gsm-manuals/common/chapters/osmux/network_osmux_aoip.dot' 'common/chapters/osmux/mo_call_osmux_sccplite_nat.msc' -> '/build/deps/install/stow/osmo-gsm-manuals/share/osmo-gsm-manuals/common/chapters/osmux/mo_call_osmux_sccplite_nat.msc' 'common/chapters/osmux/mo_call_osmux_sccplite.msc' -> '/build/deps/install/stow/osmo-gsm-manuals/share/osmo-gsm-manuals/common/chapters/osmux/mo_call_osmux_sccplite.msc' 'common/chapters/osmux/mo_call_osmux_aoip.msc' -> '/build/deps/install/stow/osmo-gsm-manuals/share/osmo-gsm-manuals/common/chapters/osmux/mo_call_osmux_aoip.msc' 'common/chapters/osmux/network_osmux_sccplite_nat.dot' -> '/build/deps/install/stow/osmo-gsm-manuals/share/osmo-gsm-manuals/common/chapters/osmux/network_osmux_sccplite_nat.dot' 'common/chapters/osmux/mgcp_extension_osmux.adoc' -> '/build/deps/install/stow/osmo-gsm-manuals/share/osmo-gsm-manuals/common/chapters/osmux/mgcp_extension_osmux.adoc' 'common/chapters/msc_mncc_mo_sip_mgcp.msc' -> '/build/deps/install/stow/osmo-gsm-manuals/share/osmo-gsm-manuals/common/chapters/msc_mncc_mo_sip_mgcp.msc' 'common/chapters/glossary.adoc' -> '/build/deps/install/stow/osmo-gsm-manuals/share/osmo-gsm-manuals/common/chapters/glossary.adoc' 'common/chapters/bibliography.adoc' -> '/build/deps/install/stow/osmo-gsm-manuals/share/osmo-gsm-manuals/common/chapters/bibliography.adoc' 'common/chapters/msc_mncc_mo_sip_rel18x_mgcp.msc' -> '/build/deps/install/stow/osmo-gsm-manuals/share/osmo-gsm-manuals/common/chapters/msc_mncc_mo_sip_rel18x_mgcp.msc' 'common/chapters/vty.xml' -> '/build/deps/install/stow/osmo-gsm-manuals/share/osmo-gsm-manuals/common/chapters/vty.xml' 'common/chapters/cs7-config.adoc' -> '/build/deps/install/stow/osmo-gsm-manuals/share/osmo-gsm-manuals/common/chapters/cs7-config.adoc' 'common/chapters/gfdl.adoc' -> '/build/deps/install/stow/osmo-gsm-manuals/share/osmo-gsm-manuals/common/chapters/gfdl.adoc' 'common/chapters/control_if.adoc' -> '/build/deps/install/stow/osmo-gsm-manuals/share/osmo-gsm-manuals/common/chapters/control_if.adoc' 'common/chapters/sigtran-osmocom.adoc' -> '/build/deps/install/stow/osmo-gsm-manuals/share/osmo-gsm-manuals/common/chapters/sigtran-osmocom.adoc' 'common/chapters/abis.adoc' -> '/build/deps/install/stow/osmo-gsm-manuals/share/osmo-gsm-manuals/common/chapters/abis.adoc' 'common/chapters/counters-overview.adoc' -> '/build/deps/install/stow/osmo-gsm-manuals/share/osmo-gsm-manuals/common/chapters/counters-overview.adoc' 'common/chapters/trx_if.adoc' -> '/build/deps/install/stow/osmo-gsm-manuals/share/osmo-gsm-manuals/common/chapters/trx_if.adoc' 'common/chapters/mncc.adoc' -> '/build/deps/install/stow/osmo-gsm-manuals/share/osmo-gsm-manuals/common/chapters/mncc.adoc' 'common/chapters/gb-pool.adoc' -> '/build/deps/install/stow/osmo-gsm-manuals/share/osmo-gsm-manuals/common/chapters/gb-pool.adoc' 'common/chapters/sigtran-simple-3g.dot' -> '/build/deps/install/stow/osmo-gsm-manuals/share/osmo-gsm-manuals/common/chapters/sigtran-simple-3g.dot' 'common/chapters/nitb_mncc_mo_rtp.msc' -> '/build/deps/install/stow/osmo-gsm-manuals/share/osmo-gsm-manuals/common/chapters/nitb_mncc_mo_rtp.msc' 'common/chapters/gb.adoc' -> '/build/deps/install/stow/osmo-gsm-manuals/share/osmo-gsm-manuals/common/chapters/gb.adoc' 'common/chapters/oap.adoc' -> '/build/deps/install/stow/osmo-gsm-manuals/share/osmo-gsm-manuals/common/chapters/oap.adoc' 'common/chapters/cell-broadcast.adoc' -> '/build/deps/install/stow/osmo-gsm-manuals/share/osmo-gsm-manuals/common/chapters/cell-broadcast.adoc' 'common/chapters/spectrum.adoc' -> '/build/deps/install/stow/osmo-gsm-manuals/share/osmo-gsm-manuals/common/chapters/spectrum.adoc' 'common/chapters/gsup_mo_sms.msc' -> '/build/deps/install/stow/osmo-gsm-manuals/share/osmo-gsm-manuals/common/chapters/gsup_mo_sms.msc' 'common/chapters/osmocom-cbs.msc' -> '/build/deps/install/stow/osmo-gsm-manuals/share/osmo-gsm-manuals/common/chapters/osmocom-cbs.msc' 'common/chapters/sigtran.adoc' -> '/build/deps/install/stow/osmo-gsm-manuals/share/osmo-gsm-manuals/common/chapters/sigtran.adoc' 'common/chapters/logging.adoc' -> '/build/deps/install/stow/osmo-gsm-manuals/share/osmo-gsm-manuals/common/chapters/logging.adoc' 'common/chapters/gsup_mt_sms.msc' -> '/build/deps/install/stow/osmo-gsm-manuals/share/osmo-gsm-manuals/common/chapters/gsup_mt_sms.msc' 'common/chapters/vty_cpu_sched.adoc' -> '/build/deps/install/stow/osmo-gsm-manuals/share/osmo-gsm-manuals/common/chapters/vty_cpu_sched.adoc' 'common/chapters/port_numbers.adoc' -> '/build/deps/install/stow/osmo-gsm-manuals/share/osmo-gsm-manuals/common/chapters/port_numbers.adoc' 'common/chapters/smpp.adoc' -> '/build/deps/install/stow/osmo-gsm-manuals/share/osmo-gsm-manuals/common/chapters/smpp.adoc' 'common/chapters/gsup_mo_smma.msc' -> '/build/deps/install/stow/osmo-gsm-manuals/share/osmo-gsm-manuals/common/chapters/gsup_mo_smma.msc' 'common/chapters/msc_mncc_mo_rtp.msc' -> '/build/deps/install/stow/osmo-gsm-manuals/share/osmo-gsm-manuals/common/chapters/msc_mncc_mo_rtp.msc' 'common/chapters/sigtran-simple-2g.dot' -> '/build/deps/install/stow/osmo-gsm-manuals/share/osmo-gsm-manuals/common/chapters/sigtran-simple-2g.dot' 'common/chapters/gsup.adoc' -> '/build/deps/install/stow/osmo-gsm-manuals/share/osmo-gsm-manuals/common/chapters/gsup.adoc' 'common/chapters/vty.adoc' -> '/build/deps/install/stow/osmo-gsm-manuals/share/osmo-gsm-manuals/common/chapters/vty.adoc' 'common/chapters/rf.adoc' -> '/build/deps/install/stow/osmo-gsm-manuals/share/osmo-gsm-manuals/common/chapters/rf.adoc' 'common/chapters/gb-ip-sns.msc' -> '/build/deps/install/stow/osmo-gsm-manuals/share/osmo-gsm-manuals/common/chapters/gb-ip-sns.msc' 'common/chapters/nitb_mncc_mo_tch.msc' -> '/build/deps/install/stow/osmo-gsm-manuals/share/osmo-gsm-manuals/common/chapters/nitb_mncc_mo_tch.msc' 'common/chapters/gb-variants.adoc' -> '/build/deps/install/stow/osmo-gsm-manuals/share/osmo-gsm-manuals/common/chapters/gb-variants.adoc' 'merge_doc.xsl' -> '/build/deps/install/stow/osmo-gsm-manuals/share/osmo-gsm-manuals/merge_doc.xsl' 'vty_reference.xsl' -> '/build/deps/install/stow/osmo-gsm-manuals/share/osmo-gsm-manuals/vty_reference.xsl' install -Dm755 "./check-depends.sh" "/build/deps/install/stow/osmo-gsm-manuals/bin/osmo-gsm-manuals-check-depends" make[4]: Leaving directory '/build/deps/osmo-gsm-manuals' make[3]: Leaving directory '/build/deps/osmo-gsm-manuals' make[2]: Leaving directory '/build/deps/osmo-gsm-manuals' make[1]: Leaving directory '/build/deps/osmo-gsm-manuals' + STOW_DIR=/build/deps/install/stow stow --restow osmo-gsm-manuals make: Entering directory '/build/doc/manuals' Package osmo-gsm-manuals was not found in the pkg-config search path. Perhaps you should add the directory containing `osmo-gsm-manuals.pc' to the PKG_CONFIG_PATH environment variable No package 'osmo-gsm-manuals' found make: Leaving directory '/build/doc/manuals' Makefile:9: /build/Makefile.common.inc: No such file or directory make: *** No rule to make target '/build/Makefile.common.inc'. Stop. Build step 'Execute shell' marked build as failure [WARNINGS] Skipping publisher since build result is FAILURE
Changes:
------------------------------------------ [...truncated 51.16 KB...] asciidoc: rf.adoc: line 673: evaluating: {set2:target:test-usermanual__55.png} asciidoc: rf.adoc: line 679: filtering: "/usr/bin/python2" "/etc/asciidoc/filters/graphviz/graphviz2png.py" -v -o "/build/deps/osmo-gsm-manuals/tests/test-usermanual__55.png" -L dot -F png - Execute: dot -Tpng "/build/deps/osmo-gsm-manuals/tests/test-usermanual__55.txt" > "/build/deps/osmo-gsm-manuals/tests/test-usermanual__55.png" asciidoc: include: /build/deps/osmo-gsm-manuals/common/chapters/gb-variants.adoc asciidoc: test-usermanual.adoc: line 33: reading: /build/deps/osmo-gsm-manuals/common/chapters/gb-variants.adoc asciidoc: include: /build/deps/osmo-gsm-manuals/common/chapters/gb-ip-sns.msc asciidoc: gb-variants.adoc: line 163: reading: /build/deps/osmo-gsm-manuals/common/chapters/gb-ip-sns.msc asciidoc: gb-variants.adoc: line 162: evaluating: {counter2:target-number} asciidoc: gb-variants.adoc: line 162: evaluating: {set2:target:test-usermanual__56.png} asciidoc: gb-ip-sns.msc: line 38: filtering: "/usr/bin/python2" "./build/filter-wrapper.py" mscgen -o "/build/deps/osmo-gsm-manuals/tests/test-usermanual__56.png" -Tpng - asciidoc: include: /build/deps/osmo-gsm-manuals/common/chapters/glossary.adoc asciidoc: test-usermanual.adoc: line 34: reading: /build/deps/osmo-gsm-manuals/common/chapters/glossary.adoc
a2x: executing: "dblatex" -t pdf -p "/etc/asciidoc/dblatex/asciidoc-dblatex.xsl" -s "/etc/asciidoc/dblatex/asciidoc-dblatex.sty" -s ../build/custom-dblatex.sty -P draft.mode=yes -P draft.watermark=0 -V "/build/deps/osmo-gsm-manuals/tests/test-usermanual.xml"
Build the book set list... xsltproc -o doclist.txt --xinclude --xincludestyle doclist.xsl /build/deps/osmo-gsm-manuals/tests/test-usermanual.xml /build/deps/osmo-gsm-manuals/tests/test-usermanual.xml:643: element section: validity error : ID mgcp-extension-osmux already defined <section id="mgcp-extension-osmux"> ^ Build the listings... xsltproc -o listings.xml --xinclude --xincludestyle --param current.dir '/build/deps/osmo-gsm-manuals/tests' /usr/share/dblatex/xsl/common/mklistings.xsl /build/deps/osmo-gsm-manuals/tests/test-usermanual.xml /build/deps/osmo-gsm-manuals/tests/test-usermanual.xml:643: element section: validity error : ID mgcp-extension-osmux already defined <section id="mgcp-extension-osmux"> ^ xsltproc -o test-usermanual.rtex --xinclude --xincludestyle --param current.dir '/build/deps/osmo-gsm-manuals/tests' --param listings.xml '/tmp/tmp9SJaJE/listings.xml' /tmp/tmp9SJaJE/custom.xsl /build/deps/osmo-gsm-manuals/tests/test-usermanual.xml /build/deps/osmo-gsm-manuals/tests/test-usermanual.xml:643: element section: validity error : ID mgcp-extension-osmux already defined <section id="mgcp-extension-osmux"> ^ XSLT stylesheets DocBook - LaTeX 2e (0.3.10) =================================================== Error: no ID for constraint linkend: ctrl_common_var. XRef to nonexistent id: ctrl_common_var Error: no ID for constraint linkend: 3gpp-ts-23-041. XRef to nonexistent id: 3gpp-ts-23-041 Error: no ID for constraint linkend: gsm-bands. XRef to nonexistent id: gsm-bands Error: no ID for constraint linkend: ietf-rfc791. XRef to nonexistent id: ietf-rfc791 Section level > 6 not well supported for bibliodiv Error: no ID for constraint linkend: modified-vesion. XRef to nonexistent id: modified-vesion Image 'dblatex' not found Cannot convert 'test-usermanual__1.png' to pdf Cannot convert 'test-usermanual__2.png' to pdf Cannot convert 'test-usermanual__3.png' to pdf Cannot convert 'test-usermanual__4.png' to pdf Cannot convert 'test-usermanual__5.png' to pdf Cannot convert 'test-usermanual__6.png' to pdf Cannot convert 'test-usermanual__7.png' to pdf Cannot convert 'test-usermanual__8.png' to pdf Cannot convert 'test-usermanual__9.png' to pdf Cannot convert 'test-usermanual__10.png' to pdf Cannot convert 'test-usermanual__11.png' to pdf Cannot convert 'test-usermanual__12.png' to pdf Cannot convert 'test-usermanual__13.png' to pdf Cannot convert 'test-usermanual__14.png' to pdf Cannot convert 'test-usermanual__15.png' to pdf Cannot convert 'test-usermanual__16.png' to pdf Cannot convert 'test-usermanual__17.png' to pdf Cannot convert 'test-usermanual__18.png' to pdf Cannot convert 'test-usermanual__19.png' to pdf Cannot convert 'test-usermanual__20.png' to pdf Cannot convert 'test-usermanual__21.png' to pdf Cannot convert 'test-usermanual__22.png' to pdf Cannot convert 'test-usermanual__23.png' to pdf Cannot convert './common/images/wireshark-gsmtap-log.png' to pdf Cannot convert 'test-usermanual__24.png' to pdf Cannot convert 'test-usermanual__25.png' to pdf Cannot convert 'test-usermanual__26.png' to pdf Cannot convert 'test-usermanual__27.png' to pdf Cannot convert 'test-usermanual__28.png' to pdf Cannot convert 'test-usermanual__29.png' to pdf Cannot convert 'test-usermanual__30.png' to pdf Cannot convert 'test-usermanual__31.png' to pdf Cannot convert 'test-usermanual__32.png' to pdf Cannot convert 'test-usermanual__33.png' to pdf Cannot convert 'test-usermanual__34.png' to pdf Cannot convert 'test-usermanual__35.png' to pdf Cannot convert 'test-usermanual__36.png' to pdf Cannot convert 'test-usermanual__37.png' to pdf Cannot convert 'test-usermanual__38.png' to pdf Cannot convert 'test-usermanual__39.png' to pdf Cannot convert 'test-usermanual__40.png' to pdf Cannot convert 'test-usermanual__41.png' to pdf Cannot convert 'test-usermanual__42.png' to pdf Cannot convert 'test-usermanual__43.png' to pdf Cannot convert 'test-usermanual__44.png' to pdf Cannot convert 'test-usermanual__45.png' to pdf Cannot convert 'test-usermanual__46.png' to pdf Cannot convert 'test-usermanual__47.png' to pdf Cannot convert 'test-usermanual__48.png' to pdf Cannot convert 'test-usermanual__49.png' to pdf Cannot convert 'test-usermanual__50.png' to pdf Cannot convert 'test-usermanual__51.png' to pdf Cannot convert 'test-usermanual__52.png' to pdf Cannot convert 'test-usermanual__53.png' to pdf Cannot convert 'test-usermanual__54.png' to pdf Cannot convert 'test-usermanual__55.png' to pdf Cannot convert 'test-usermanual__56.png' to pdf Build test-usermanual.pdf built-in module pdftex registered no support found for ifthen no support found for ifxetex no support found for fontspec no support found for xltxtra no support found for fontenc no support found for inputenc no support found for fancybox built-in module makeidx registered no support found for custom-dblatex built-in module bibtopic registered building additional files... checking if compiling is necessary... the output file doesn't exist pdflatex -interaction=batchmode test-usermanual.tex running post-compilation scripts... [index] the index file /tmp/tmp9SJaJE/test-usermanual.idx is empty test-usermanual.toc MD5 checksum changed test-usermanual.aux MD5 checksum changed the /tmp/tmp9SJaJE/test-usermanual.toc file has changed pdflatex -interaction=batchmode test-usermanual.tex running post-compilation scripts... [index] the index file /tmp/tmp9SJaJE/test-usermanual.idx is empty no new compilation is needed running last-compilation scripts... 'test-usermanual.pdf' successfully built
a2x: deleting /build/deps/osmo-gsm-manuals/tests/test-usermanual.xml if [ "1" != "1" ]; then \ for i in test-usermanual.pdf test-vty-reference.pdf test2-vty-reference.pdf; do \ install -vDm644 "$i" "/build/deps/install/stow/osmo-gsm-manuals/share/doc/osmo-gsm-manuals-doc/$i" || exit 1; \ done; \ fi rm generated/docbook_test2-vty-reference.xml make[2]: Leaving directory '/build/deps/osmo-gsm-manuals/tests' make[2]: Entering directory '/build/deps/osmo-gsm-manuals' make[3]: Entering directory '/build/deps/osmo-gsm-manuals' make[3]: Nothing to be done for 'install-exec-am'. /bin/mkdir -p '/build/deps/install/stow/osmo-gsm-manuals/lib/pkgconfig' /usr/bin/install -c -m 644 osmo-gsm-manuals.pc '/build/deps/install/stow/osmo-gsm-manuals/lib/pkgconfig' make install-data-hook make[4]: Entering directory '/build/deps/osmo-gsm-manuals' cd "." && \ files="$(find build common *.xsl -not -type d)" && \ for i in $files; do \ if [ -x "$i" ]; then \ mode=755; \ else \ mode=644; \ fi; \ install -vDm$mode "$i" ""/build/deps/install/stow/osmo-gsm-manuals/share/osmo-gsm-manuals"/$i" || exit 1; \ done; install: creating directory '/build/deps/install/stow/osmo-gsm-manuals/share' install: creating directory '/build/deps/install/stow/osmo-gsm-manuals/share/osmo-gsm-manuals' install: creating directory '/build/deps/install/stow/osmo-gsm-manuals/share/osmo-gsm-manuals/build' 'build/Makefile.common.inc' -> '/build/deps/install/stow/osmo-gsm-manuals/share/osmo-gsm-manuals/build/Makefile.common.inc' 'build/unix-time-to-fmt.py' -> '/build/deps/install/stow/osmo-gsm-manuals/share/osmo-gsm-manuals/build/unix-time-to-fmt.py' 'build/docinfo-releaseinfo.conf' -> '/build/deps/install/stow/osmo-gsm-manuals/share/osmo-gsm-manuals/build/docinfo-releaseinfo.conf' 'build/mscgen-filter.conf' -> '/build/deps/install/stow/osmo-gsm-manuals/share/osmo-gsm-manuals/build/mscgen-filter.conf' 'build/filter-wrapper.py' -> '/build/deps/install/stow/osmo-gsm-manuals/share/osmo-gsm-manuals/build/filter-wrapper.py' 'build/Makefile.docbook.inc' -> '/build/deps/install/stow/osmo-gsm-manuals/share/osmo-gsm-manuals/build/Makefile.docbook.inc' 'build/custom-dblatex.sty' -> '/build/deps/install/stow/osmo-gsm-manuals/share/osmo-gsm-manuals/build/custom-dblatex.sty' 'build/Makefile.vty-reference.inc' -> '/build/deps/install/stow/osmo-gsm-manuals/share/osmo-gsm-manuals/build/Makefile.vty-reference.inc' 'build/find_existing_path.sh' -> '/build/deps/install/stow/osmo-gsm-manuals/share/osmo-gsm-manuals/build/find_existing_path.sh' 'build/diag-filter.conf' -> '/build/deps/install/stow/osmo-gsm-manuals/share/osmo-gsm-manuals/build/diag-filter.conf' 'build/known_hosts' -> '/build/deps/install/stow/osmo-gsm-manuals/share/osmo-gsm-manuals/build/known_hosts' 'build/vty_reference_combine.sh' -> '/build/deps/install/stow/osmo-gsm-manuals/share/osmo-gsm-manuals/build/vty_reference_combine.sh' 'build/Makefile.asciidoc.inc' -> '/build/deps/install/stow/osmo-gsm-manuals/share/osmo-gsm-manuals/build/Makefile.asciidoc.inc' install: creating directory '/build/deps/install/stow/osmo-gsm-manuals/share/osmo-gsm-manuals/common' install: creating directory '/build/deps/install/stow/osmo-gsm-manuals/share/osmo-gsm-manuals/common/snippets' 'common/snippets/dynamic_channel_type_bullets.adoc' -> '/build/deps/install/stow/osmo-gsm-manuals/share/osmo-gsm-manuals/common/snippets/dynamic_channel_type_bullets.adoc' 'common/vty_additions.xml' -> '/build/deps/install/stow/osmo-gsm-manuals/share/osmo-gsm-manuals/common/vty_additions.xml' 'common/ns_vty_additions.xml' -> '/build/deps/install/stow/osmo-gsm-manuals/share/osmo-gsm-manuals/common/ns_vty_additions.xml' install: creating directory '/build/deps/install/stow/osmo-gsm-manuals/share/osmo-gsm-manuals/common/images' 'common/images/sysmocom.pdf' -> '/build/deps/install/stow/osmo-gsm-manuals/share/osmo-gsm-manuals/common/images/sysmocom.pdf' 'common/images/wireshark-gsmtap-log.png' -> '/build/deps/install/stow/osmo-gsm-manuals/share/osmo-gsm-manuals/common/images/wireshark-gsmtap-log.png' 'common/images/gb-ip-nsvc.pdf' -> '/build/deps/install/stow/osmo-gsm-manuals/share/osmo-gsm-manuals/common/images/gb-ip-nsvc.pdf' 'common/images/osmocom.pdf' -> '/build/deps/install/stow/osmo-gsm-manuals/share/osmo-gsm-manuals/common/images/osmocom.pdf' 'common/images/lte-eps.dot' -> '/build/deps/install/stow/osmo-gsm-manuals/share/osmo-gsm-manuals/common/images/lte-eps.dot' 'common/images/gb-concepts-pool.pdf' -> '/build/deps/install/stow/osmo-gsm-manuals/share/osmo-gsm-manuals/common/images/gb-concepts-pool.pdf' 'common/images/lte-eps-sgs.dot' -> '/build/deps/install/stow/osmo-gsm-manuals/share/osmo-gsm-manuals/common/images/lte-eps-sgs.dot' install: creating directory '/build/deps/install/stow/osmo-gsm-manuals/share/osmo-gsm-manuals/common/chapters' 'common/chapters/msc_mncc_mt_sip_mgcp.msc' -> '/build/deps/install/stow/osmo-gsm-manuals/share/osmo-gsm-manuals/common/chapters/msc_mncc_mt_sip_mgcp.msc' 'common/chapters/preface.adoc' -> '/build/deps/install/stow/osmo-gsm-manuals/share/osmo-gsm-manuals/common/chapters/preface.adoc' install: creating directory '/build/deps/install/stow/osmo-gsm-manuals/share/osmo-gsm-manuals/common/chapters/osmux' 'common/chapters/osmux/osmux.adoc' -> '/build/deps/install/stow/osmo-gsm-manuals/share/osmo-gsm-manuals/common/chapters/osmux/osmux.adoc' 'common/chapters/osmux/network_osmux_sccplite.dot' -> '/build/deps/install/stow/osmo-gsm-manuals/share/osmo-gsm-manuals/common/chapters/osmux/network_osmux_sccplite.dot' 'common/chapters/osmux/network_osmux_aoip.dot' -> '/build/deps/install/stow/osmo-gsm-manuals/share/osmo-gsm-manuals/common/chapters/osmux/network_osmux_aoip.dot' 'common/chapters/osmux/mo_call_osmux_sccplite_nat.msc' -> '/build/deps/install/stow/osmo-gsm-manuals/share/osmo-gsm-manuals/common/chapters/osmux/mo_call_osmux_sccplite_nat.msc' 'common/chapters/osmux/mo_call_osmux_sccplite.msc' -> '/build/deps/install/stow/osmo-gsm-manuals/share/osmo-gsm-manuals/common/chapters/osmux/mo_call_osmux_sccplite.msc' 'common/chapters/osmux/mo_call_osmux_aoip.msc' -> '/build/deps/install/stow/osmo-gsm-manuals/share/osmo-gsm-manuals/common/chapters/osmux/mo_call_osmux_aoip.msc' 'common/chapters/osmux/network_osmux_sccplite_nat.dot' -> '/build/deps/install/stow/osmo-gsm-manuals/share/osmo-gsm-manuals/common/chapters/osmux/network_osmux_sccplite_nat.dot' 'common/chapters/osmux/mgcp_extension_osmux.adoc' -> '/build/deps/install/stow/osmo-gsm-manuals/share/osmo-gsm-manuals/common/chapters/osmux/mgcp_extension_osmux.adoc' 'common/chapters/msc_mncc_mo_sip_mgcp.msc' -> '/build/deps/install/stow/osmo-gsm-manuals/share/osmo-gsm-manuals/common/chapters/msc_mncc_mo_sip_mgcp.msc' 'common/chapters/glossary.adoc' -> '/build/deps/install/stow/osmo-gsm-manuals/share/osmo-gsm-manuals/common/chapters/glossary.adoc' 'common/chapters/bibliography.adoc' -> '/build/deps/install/stow/osmo-gsm-manuals/share/osmo-gsm-manuals/common/chapters/bibliography.adoc' 'common/chapters/msc_mncc_mo_sip_rel18x_mgcp.msc' -> '/build/deps/install/stow/osmo-gsm-manuals/share/osmo-gsm-manuals/common/chapters/msc_mncc_mo_sip_rel18x_mgcp.msc' 'common/chapters/vty.xml' -> '/build/deps/install/stow/osmo-gsm-manuals/share/osmo-gsm-manuals/common/chapters/vty.xml' 'common/chapters/cs7-config.adoc' -> '/build/deps/install/stow/osmo-gsm-manuals/share/osmo-gsm-manuals/common/chapters/cs7-config.adoc' 'common/chapters/gfdl.adoc' -> '/build/deps/install/stow/osmo-gsm-manuals/share/osmo-gsm-manuals/common/chapters/gfdl.adoc' 'common/chapters/control_if.adoc' -> '/build/deps/install/stow/osmo-gsm-manuals/share/osmo-gsm-manuals/common/chapters/control_if.adoc' 'common/chapters/sigtran-osmocom.adoc' -> '/build/deps/install/stow/osmo-gsm-manuals/share/osmo-gsm-manuals/common/chapters/sigtran-osmocom.adoc' 'common/chapters/abis.adoc' -> '/build/deps/install/stow/osmo-gsm-manuals/share/osmo-gsm-manuals/common/chapters/abis.adoc' 'common/chapters/counters-overview.adoc' -> '/build/deps/install/stow/osmo-gsm-manuals/share/osmo-gsm-manuals/common/chapters/counters-overview.adoc' 'common/chapters/trx_if.adoc' -> '/build/deps/install/stow/osmo-gsm-manuals/share/osmo-gsm-manuals/common/chapters/trx_if.adoc' 'common/chapters/mncc.adoc' -> '/build/deps/install/stow/osmo-gsm-manuals/share/osmo-gsm-manuals/common/chapters/mncc.adoc' 'common/chapters/gb-pool.adoc' -> '/build/deps/install/stow/osmo-gsm-manuals/share/osmo-gsm-manuals/common/chapters/gb-pool.adoc' 'common/chapters/sigtran-simple-3g.dot' -> '/build/deps/install/stow/osmo-gsm-manuals/share/osmo-gsm-manuals/common/chapters/sigtran-simple-3g.dot' 'common/chapters/nitb_mncc_mo_rtp.msc' -> '/build/deps/install/stow/osmo-gsm-manuals/share/osmo-gsm-manuals/common/chapters/nitb_mncc_mo_rtp.msc' 'common/chapters/gb.adoc' -> '/build/deps/install/stow/osmo-gsm-manuals/share/osmo-gsm-manuals/common/chapters/gb.adoc' 'common/chapters/oap.adoc' -> '/build/deps/install/stow/osmo-gsm-manuals/share/osmo-gsm-manuals/common/chapters/oap.adoc' 'common/chapters/cell-broadcast.adoc' -> '/build/deps/install/stow/osmo-gsm-manuals/share/osmo-gsm-manuals/common/chapters/cell-broadcast.adoc' 'common/chapters/spectrum.adoc' -> '/build/deps/install/stow/osmo-gsm-manuals/share/osmo-gsm-manuals/common/chapters/spectrum.adoc' 'common/chapters/gsup_mo_sms.msc' -> '/build/deps/install/stow/osmo-gsm-manuals/share/osmo-gsm-manuals/common/chapters/gsup_mo_sms.msc' 'common/chapters/osmocom-cbs.msc' -> '/build/deps/install/stow/osmo-gsm-manuals/share/osmo-gsm-manuals/common/chapters/osmocom-cbs.msc' 'common/chapters/sigtran.adoc' -> '/build/deps/install/stow/osmo-gsm-manuals/share/osmo-gsm-manuals/common/chapters/sigtran.adoc' 'common/chapters/logging.adoc' -> '/build/deps/install/stow/osmo-gsm-manuals/share/osmo-gsm-manuals/common/chapters/logging.adoc' 'common/chapters/gsup_mt_sms.msc' -> '/build/deps/install/stow/osmo-gsm-manuals/share/osmo-gsm-manuals/common/chapters/gsup_mt_sms.msc' 'common/chapters/vty_cpu_sched.adoc' -> '/build/deps/install/stow/osmo-gsm-manuals/share/osmo-gsm-manuals/common/chapters/vty_cpu_sched.adoc' 'common/chapters/port_numbers.adoc' -> '/build/deps/install/stow/osmo-gsm-manuals/share/osmo-gsm-manuals/common/chapters/port_numbers.adoc' 'common/chapters/smpp.adoc' -> '/build/deps/install/stow/osmo-gsm-manuals/share/osmo-gsm-manuals/common/chapters/smpp.adoc' 'common/chapters/gsup_mo_smma.msc' -> '/build/deps/install/stow/osmo-gsm-manuals/share/osmo-gsm-manuals/common/chapters/gsup_mo_smma.msc' 'common/chapters/msc_mncc_mo_rtp.msc' -> '/build/deps/install/stow/osmo-gsm-manuals/share/osmo-gsm-manuals/common/chapters/msc_mncc_mo_rtp.msc' 'common/chapters/sigtran-simple-2g.dot' -> '/build/deps/install/stow/osmo-gsm-manuals/share/osmo-gsm-manuals/common/chapters/sigtran-simple-2g.dot' 'common/chapters/gsup.adoc' -> '/build/deps/install/stow/osmo-gsm-manuals/share/osmo-gsm-manuals/common/chapters/gsup.adoc' 'common/chapters/vty.adoc' -> '/build/deps/install/stow/osmo-gsm-manuals/share/osmo-gsm-manuals/common/chapters/vty.adoc' 'common/chapters/rf.adoc' -> '/build/deps/install/stow/osmo-gsm-manuals/share/osmo-gsm-manuals/common/chapters/rf.adoc' 'common/chapters/gb-ip-sns.msc' -> '/build/deps/install/stow/osmo-gsm-manuals/share/osmo-gsm-manuals/common/chapters/gb-ip-sns.msc' 'common/chapters/nitb_mncc_mo_tch.msc' -> '/build/deps/install/stow/osmo-gsm-manuals/share/osmo-gsm-manuals/common/chapters/nitb_mncc_mo_tch.msc' 'common/chapters/gb-variants.adoc' -> '/build/deps/install/stow/osmo-gsm-manuals/share/osmo-gsm-manuals/common/chapters/gb-variants.adoc' 'merge_doc.xsl' -> '/build/deps/install/stow/osmo-gsm-manuals/share/osmo-gsm-manuals/merge_doc.xsl' 'vty_reference.xsl' -> '/build/deps/install/stow/osmo-gsm-manuals/share/osmo-gsm-manuals/vty_reference.xsl' install -Dm755 "./check-depends.sh" "/build/deps/install/stow/osmo-gsm-manuals/bin/osmo-gsm-manuals-check-depends" make[4]: Leaving directory '/build/deps/osmo-gsm-manuals' make[3]: Leaving directory '/build/deps/osmo-gsm-manuals' make[2]: Leaving directory '/build/deps/osmo-gsm-manuals' make[1]: Leaving directory '/build/deps/osmo-gsm-manuals' + STOW_DIR=/build/deps/install/stow stow --restow osmo-gsm-manuals make: Entering directory '/build/doc/manuals' Package osmo-gsm-manuals was not found in the pkg-config search path. Perhaps you should add the directory containing `osmo-gsm-manuals.pc' to the PKG_CONFIG_PATH environment variable No package 'osmo-gsm-manuals' found make: Leaving directory '/build/doc/manuals' Makefile:9: /build/Makefile.common.inc: No such file or directory make: *** No rule to make target '/build/Makefile.common.inc'. Stop. Build step 'Execute shell' marked build as failure [WARNINGS] Skipping publisher since build result is FAILURE
jenkins-notifications@lists.osmocom.org