Changes:
------------------------------------------ [...truncated 413.44 KB...] !! ! log stderr logging filter all 1 logging color 1 logging print category-hex 1 logging print category 0 logging timestamp 0 logging print file 1 logging level gprs debug logging level ns info logging level obj notice logging level lglobal notice logging level llapd notice logging level linp notice logging level lmux notice logging level lmi notice logging level lmib notice logging level lsms notice logging level lctrl notice logging level lgtp notice logging level lstats notice logging level lgsup notice logging level loap notice logging level lss7 notice logging level lsccp notice logging level lsua notice logging level lm3ua notice logging level lmgcp notice logging level ljibuf notice logging level lrspro notice logging level lns notice logging level lbssgp notice ! stats interval 5 ! line vty no login ! ns encapsulation framerelay-gre enabled 0 encapsulation udp local-ip 127.0.0.100 encapsulation udp local-port 23000 encapsulation udp use-reset-block-unblock enabled nse 101 nsvci 101 nse 101 remote-role sgsn nse 101 encapsulation udp nse 101 remote-ip 192.168.100.239 nse 101 remote-port 7777 timer tns-block 3 timer tns-block-retries 3 timer tns-reset 3 timer tns-reset-retries 3 timer tns-test 30 timer tns-alive 3 timer tns-alive-retries 10 timer tsns-prov 3 timer unknown 0x8 3 timer unknown 0x9 3 gbproxy sgsn nsei 101
ss -tn
State Recv-Q Send-Q Local Address:Port Peer Address:Port
ss -tln
State Recv-Q Send-Q Local Address:Port Peer Address:Port
ps xua | grep osmo
build 12231 2.1 0.0 53868 21060 ? S 12:14 0:00 /usr/bin/python3 /usr/local/bin/osmotestconfig.py -p /build -w /build -v build 12265 0.0 0.0 21475044960 33416 ? R 12:14 0:00 src/sgsn/osmo-sgsn -c /build/doc/examples/osmo-sgsn/osmo-sgsn.cfg build 12272 0.0 0.0 4280 704 ? S 12:14 0:00 /bin/sh -c ps xua | grep osmo build 12274 0.0 0.0 12784 988 ? S 12:14 0:00 grep osmo
Socket: in 1 tries, connected to 127.0.0.1:4245 <socket.socket fd=4, family=AddressFamily.AF_INET, type=SocketKind.SOCK_STREAM, proto=0, laddr=('127.0.0.1', 44990), raddr=('127.0.0.1', 4245)> (1 sockets open) Terminating took 0.897s Socket: closing 127.0.0.1:4245 <socket.socket fd=4, family=AddressFamily.AF_INET, type=SocketKind.SOCK_STREAM, proto=0, laddr=('127.0.0.1', 44990), raddr=('127.0.0.1', 4245)> (0 sockets open) Verifying src/sgsn/osmo-sgsn -c /build/writtenconfig/osmo-sgsn.cfg01qhnzyi, test write_config Launching: PWD=/build 'src/sgsn/osmo-sgsn' '-c' '/build/writtenconfig/osmo-sgsn.cfg01qhnzyi'
ls -l /proc/12231/fd
total 0 lr-x------ 1 build build 64 Dec 15 12:14 0 -> pipe:[2416204161] l-wx------ 1 build build 64 Dec 15 12:14 1 -> pipe:[2416204162] l-wx------ 1 build build 64 Dec 15 12:14 2 -> pipe:[2416204163] l-wx------ 1 build build 64 Dec 15 12:14 3 -> /dev/null
ss -tn
State Recv-Q Send-Q Local Address:Port Peer Address:Port
ss -tln
State Recv-Q Send-Q Local Address:Port Peer Address:Port
ps xua | grep osmo
build 12231 1.8 0.0 54000 21152 ? S 12:14 0:00 /usr/bin/python3 /usr/local/bin/osmotestconfig.py -p /build -w /build -v build 12276 0.0 0.0 21475111140 31020 ? R 12:14 0:00 src/sgsn/osmo-sgsn -c /build/writtenconfig/osmo-sgsn.cfg01qhnzyi build 12283 0.0 0.0 4280 748 ? S 12:14 0:00 /bin/sh -c ps xua | grep osmo build 12285 0.0 0.0 12784 972 ? S 12:14 0:00 grep osmo
Socket: in 1 tries, connected to 127.0.0.1:4245 <socket.socket fd=4, family=AddressFamily.AF_INET, type=SocketKind.SOCK_STREAM, proto=0, laddr=('127.0.0.1', 45030), raddr=('127.0.0.1', 4245)> (1 sockets open) Terminating took 0.897s Socket: closing 127.0.0.1:4245 <socket.socket fd=4, family=AddressFamily.AF_INET, type=SocketKind.SOCK_STREAM, proto=0, laddr=('127.0.0.1', 45030), raddr=('127.0.0.1', 4245)> (0 sockets open) Verifying src/sgsn/osmo-sgsn -c /build/writtenconfig/osmo-sgsn.cfg01qhnzyi, test token_vty_command Launching: PWD=/build 'src/sgsn/osmo-sgsn' '-c' '/build/writtenconfig/osmo-sgsn.cfg01qhnzyi'
ls -l /proc/12231/fd
total 0 lr-x------ 1 build build 64 Dec 15 12:14 0 -> pipe:[2416204161] l-wx------ 1 build build 64 Dec 15 12:14 1 -> pipe:[2416204162] l-wx------ 1 build build 64 Dec 15 12:14 2 -> pipe:[2416204163] l-wx------ 1 build build 64 Dec 15 12:14 3 -> /dev/null
ss -tn
State Recv-Q Send-Q Local Address:Port Peer Address:Port
ss -tln
State Recv-Q Send-Q Local Address:Port Peer Address:Port
ps xua | grep osmo
build 12231 1.4 0.0 54000 21152 ? S 12:14 0:00 /usr/bin/python3 /usr/local/bin/osmotestconfig.py -p /build -w /build -v build 12287 0.0 0.0 21475111140 25608 ? S 12:14 0:00 src/sgsn/osmo-sgsn -c /build/writtenconfig/osmo-sgsn.cfg01qhnzyi build 12294 0.0 0.0 4280 744 ? S 12:14 0:00 /bin/sh -c ps xua | grep osmo build 12296 0.0 0.0 12784 964 ? S 12:14 0:00 grep osmo
Socket: in 1 tries, connected to 127.0.0.1:4245 <socket.socket fd=4, family=AddressFamily.AF_INET, type=SocketKind.SOCK_STREAM, proto=0, laddr=('127.0.0.1', 45084), raddr=('127.0.0.1', 4245)> (1 sockets open) Terminating took 0.897s Socket: closing 127.0.0.1:4245 <socket.socket fd=4, family=AddressFamily.AF_INET, type=SocketKind.SOCK_STREAM, proto=0, laddr=('127.0.0.1', 45084), raddr=('127.0.0.1', 4245)> (0 sockets open) Verifying src/gtphub/osmo-gtphub -c /build/doc/examples/osmo-gtphub/osmo-gtphub-1iface.cfg, test verify_doc Launching: PWD=/build 'src/gtphub/osmo-gtphub' '-c' '/build/doc/examples/osmo-gtphub/osmo-gtphub-1iface.cfg'
ls -l /proc/12231/fd
total 0 lr-x------ 1 build build 64 Dec 15 12:14 0 -> pipe:[2416204161] l-wx------ 1 build build 64 Dec 15 12:14 1 -> pipe:[2416204162] l-wx------ 1 build build 64 Dec 15 12:14 2 -> pipe:[2416204163] l-wx------ 1 build build 64 Dec 15 12:14 3 -> /dev/null
ss -tn
State Recv-Q Send-Q Local Address:Port Peer Address:Port
ss -tln
State Recv-Q Send-Q Local Address:Port Peer Address:Port LISTEN 0 10 127.0.0.1:4253 *:*
ps xua | grep osmo
build 12231 1.4 0.0 54000 21152 ? S 12:14 0:00 /usr/bin/python3 /usr/local/bin/osmotestconfig.py -p /build -w /build -v build 12298 0.0 0.0 21474963656 20900 ? S 12:14 0:00 src/gtphub/osmo-gtphub -c /build/doc/examples/osmo-gtphub/osmo-gtphub-1iface.cfg build 12305 0.0 0.0 4280 752 ? S 12:14 0:00 /bin/sh -c ps xua | grep osmo build 12307 0.0 0.0 12784 976 ? S 12:14 0:00 grep osmo
Socket: in 1 tries, connected to 127.0.0.1:4253 <socket.socket fd=4, family=AddressFamily.AF_INET, type=SocketKind.SOCK_STREAM, proto=0, laddr=('127.0.0.1', 42820), raddr=('127.0.0.1', 4253)> (1 sockets open) Terminating took 0.897s Socket: closing 127.0.0.1:4253 <socket.socket fd=4, family=AddressFamily.AF_INET, type=SocketKind.SOCK_STREAM, proto=0, laddr=('127.0.0.1', 42820), raddr=('127.0.0.1', 4253)> (0 sockets open) Verifying src/gtphub/osmo-gtphub -c /build/writtenconfig/osmo-gtphub-1iface.cfgipm14qz6, test write_config Launching: PWD=/build 'src/gtphub/osmo-gtphub' '-c' '/build/writtenconfig/osmo-gtphub-1iface.cfgipm14qz6'
ls -l /proc/12231/fd
total 0 lr-x------ 1 build build 64 Dec 15 12:14 0 -> pipe:[2416204161] l-wx------ 1 build build 64 Dec 15 12:14 1 -> pipe:[2416204162] l-wx------ 1 build build 64 Dec 15 12:14 2 -> pipe:[2416204163] l-wx------ 1 build build 64 Dec 15 12:14 3 -> /dev/null
ss -tn
State Recv-Q Send-Q Local Address:Port Peer Address:Port
ss -tln
State Recv-Q Send-Q Local Address:Port Peer Address:Port
ps xua | grep osmo
build 12231 1.2 0.0 54000 21152 ? S 12:14 0:00 /usr/bin/python3 /usr/local/bin/osmotestconfig.py -p /build -w /build -v build 12309 0.0 0.0 21474963656 20008 ? S 12:14 0:00 src/gtphub/osmo-gtphub -c /build/writtenconfig/osmo-gtphub-1iface.cfgipm14qz6 build 12316 0.0 0.0 4280 712 ? S 12:14 0:00 /bin/sh -c ps xua | grep osmo build 12318 0.0 0.0 12784 976 ? S 12:14 0:00 grep osmo
Socket: in 1 tries, connected to 127.0.0.1:4253 <socket.socket fd=4, family=AddressFamily.AF_INET, type=SocketKind.SOCK_STREAM, proto=0, laddr=('127.0.0.1', 42880), raddr=('127.0.0.1', 4253)> (1 sockets open) Terminating took 0.897s Socket: closing 127.0.0.1:4253 <socket.socket fd=4, family=AddressFamily.AF_INET, type=SocketKind.SOCK_STREAM, proto=0, laddr=('127.0.0.1', 42880), raddr=('127.0.0.1', 4253)> (0 sockets open) Verifying src/gtphub/osmo-gtphub -c /build/writtenconfig/osmo-gtphub-1iface.cfgipm14qz6, test token_vty_command Launching: PWD=/build 'src/gtphub/osmo-gtphub' '-c' '/build/writtenconfig/osmo-gtphub-1iface.cfgipm14qz6'
ls -l /proc/12231/fd
total 0 lr-x------ 1 build build 64 Dec 15 12:14 0 -> pipe:[2416204161] l-wx------ 1 build build 64 Dec 15 12:14 1 -> pipe:[2416204162] l-wx------ 1 build build 64 Dec 15 12:14 2 -> pipe:[2416204163] l-wx------ 1 build build 64 Dec 15 12:14 3 -> /dev/null
ss -tn
State Recv-Q Send-Q Local Address:Port Peer Address:Port
ss -tln
State Recv-Q Send-Q Local Address:Port Peer Address:Port
ps xua | grep osmo
build 12231 1.1 0.0 54000 21152 ? S 12:14 0:00 /usr/bin/python3 /usr/local/bin/osmotestconfig.py -p /build -w /build -v build 12320 0.0 0.0 21474963656 20140 ? S 12:14 0:00 src/gtphub/osmo-gtphub -c /build/writtenconfig/osmo-gtphub-1iface.cfgipm14qz6 build 12327 0.0 0.0 4280 716 ? S 12:14 0:00 /bin/sh -c ps xua | grep osmo build 12329 0.0 0.0 12784 968 ? S 12:14 0:00 grep osmo
ERRORS: 1 Socket: in 1 tries, connected to 127.0.0.1:4253 <socket.socket fd=4, family=AddressFamily.AF_INET, type=SocketKind.SOCK_STREAM, proto=0, laddr=('127.0.0.1', 42924), raddr=('127.0.0.1', 4253)> (1 sockets open) Terminating took 0.897s Socket: closing 127.0.0.1:4253 <socket.socket fd=4, family=AddressFamily.AF_INET, type=SocketKind.SOCK_STREAM, proto=0, laddr=('127.0.0.1', 42924), raddr=('127.0.0.1', 4253)> (0 sockets open) Makefile:710: recipe for target 'vty-python-test' failed make[7]: Leaving directory '/build/tests' make[7]: *** [vty-python-test] Error 1 Makefile:727: recipe for target 'vty-test' failed make[6]: Leaving directory '/build/tests' make[6]: *** [vty-test] Error 2 Makefile:704: recipe for target 'python-tests' failed make[5]: Leaving directory '/build/tests' make[5]: *** [python-tests] Error 2 make[4]: *** [check-local] Error 2 Makefile:735: recipe for target 'check-local' failed make[4]: Leaving directory '/build/tests' make[3]: *** [check-am] Error 2 Makefile:564: recipe for target 'check-am' failed make[3]: Leaving directory '/build/tests' make[2]: *** [check-recursive] Error 1 Makefile:416: recipe for target 'check-recursive' failed make[2]: Leaving directory '/build/tests' Makefile:461: recipe for target 'check-recursive' failed make[1]: Leaving directory '/build' make[1]: *** [check-recursive] Error 1 Makefile:752: recipe for target 'check' failed make: *** [check] Error 2 + cat-testlogs.sh Build step 'Execute shell' marked build as failure [WARNINGS]Skipping publisher since build result is FAILURE
Changes:
------------------------------------------ [...truncated 375.36 KB...] logging filter all 1 logging color 1 logging print category-hex 1 logging print category 0 logging timestamp 0 logging print file 1 logging level gprs debug logging level ns info logging level obj notice logging level lglobal notice logging level llapd notice logging level linp notice logging level lmux notice logging level lmi notice logging level lmib notice logging level lsms notice logging level lctrl notice logging level lgtp notice logging level lstats notice logging level lgsup notice logging level loap notice logging level lss7 notice logging level lsccp notice logging level lsua notice logging level lm3ua notice logging level lmgcp notice logging level ljibuf notice logging level lrspro notice logging level lns notice logging level lbssgp notice ! stats interval 5 ! line vty no login ! ns encapsulation framerelay-gre enabled 0 encapsulation udp local-ip 127.0.0.100 encapsulation udp local-port 23000 encapsulation udp use-reset-block-unblock enabled nse 101 nsvci 101 nse 101 remote-role sgsn nse 101 encapsulation udp nse 101 remote-ip 192.168.100.239 nse 101 remote-port 7777 timer tns-block 3 timer tns-block-retries 3 timer tns-reset 3 timer tns-reset-retries 3 timer tns-test 30 timer tns-alive 3 timer tns-alive-retries 10 timer tsns-prov 3 timer unknown 0x8 3 timer unknown 0x9 3 gbproxy sgsn nsei 101
ss -tn
State Recv-Q Send-Q Local Address:Port Peer Address:Port
ss -tln
State Recv-Q Send-Q Local Address:Port Peer Address:Port
ps xua | grep osmo
build 12030 1.8 0.0 53916 21084 ? S 12:19 0:00 /usr/bin/python3 /usr/local/bin/osmotestconfig.py -p /build -w /build -v build 12064 0.0 0.0 21475044960 19436 ? R 12:19 0:00 src/sgsn/osmo-sgsn -c /build/doc/examples/osmo-sgsn/osmo-sgsn.cfg build 12071 0.0 0.0 4280 712 ? S 12:19 0:00 /bin/sh -c ps xua | grep osmo build 12073 0.0 0.0 12784 968 ? S 12:19 0:00 grep osmo
Socket: in 1 tries, connected to 127.0.0.1:4245 <socket.socket fd=4, family=AddressFamily.AF_INET, type=SocketKind.SOCK_STREAM, proto=0, laddr=('127.0.0.1', 54636), raddr=('127.0.0.1', 4245)> (1 sockets open) Terminating took 0.897s Socket: closing 127.0.0.1:4245 <socket.socket fd=4, family=AddressFamily.AF_INET, type=SocketKind.SOCK_STREAM, proto=0, laddr=('127.0.0.1', 54636), raddr=('127.0.0.1', 4245)> (0 sockets open) Verifying src/sgsn/osmo-sgsn -c /build/writtenconfig/osmo-sgsn.cfgo11jabnf, test write_config Launching: PWD=/build 'src/sgsn/osmo-sgsn' '-c' '/build/writtenconfig/osmo-sgsn.cfgo11jabnf'
ls -l /proc/12030/fd
total 0 lr-x------ 1 build build 64 Dec 15 12:19 0 -> pipe:[31680093] l-wx------ 1 build build 64 Dec 15 12:19 1 -> pipe:[31680094] l-wx------ 1 build build 64 Dec 15 12:19 2 -> pipe:[31680095] l-wx------ 1 build build 64 Dec 15 12:19 3 -> /dev/null
ss -tn
State Recv-Q Send-Q Local Address:Port Peer Address:Port
ss -tln
State Recv-Q Send-Q Local Address:Port Peer Address:Port
ps xua | grep osmo
build 12030 1.7 0.0 54048 21172 ? S 12:19 0:00 /usr/bin/python3 /usr/local/bin/osmotestconfig.py -p /build -w /build -v build 12075 0.0 0.0 21475044960 23192 ? R 12:19 0:00 src/sgsn/osmo-sgsn -c /build/writtenconfig/osmo-sgsn.cfgo11jabnf build 12082 0.0 0.0 4280 712 ? S 12:19 0:00 /bin/sh -c ps xua | grep osmo build 12084 0.0 0.0 12784 920 ? S 12:19 0:00 grep osmo
Socket: in 1 tries, connected to 127.0.0.1:4245 <socket.socket fd=4, family=AddressFamily.AF_INET, type=SocketKind.SOCK_STREAM, proto=0, laddr=('127.0.0.1', 54638), raddr=('127.0.0.1', 4245)> (1 sockets open) Terminating took 0.897s Socket: closing 127.0.0.1:4245 <socket.socket fd=4, family=AddressFamily.AF_INET, type=SocketKind.SOCK_STREAM, proto=0, laddr=('127.0.0.1', 54638), raddr=('127.0.0.1', 4245)> (0 sockets open) Verifying src/sgsn/osmo-sgsn -c /build/writtenconfig/osmo-sgsn.cfgo11jabnf, test token_vty_command Launching: PWD=/build 'src/sgsn/osmo-sgsn' '-c' '/build/writtenconfig/osmo-sgsn.cfgo11jabnf'
ls -l /proc/12030/fd
total 0 lr-x------ 1 build build 64 Dec 15 12:19 0 -> pipe:[31680093] l-wx------ 1 build build 64 Dec 15 12:19 1 -> pipe:[31680094] l-wx------ 1 build build 64 Dec 15 12:19 2 -> pipe:[31680095] l-wx------ 1 build build 64 Dec 15 12:19 3 -> /dev/null
ss -tn
State Recv-Q Send-Q Local Address:Port Peer Address:Port
ss -tln
State Recv-Q Send-Q Local Address:Port Peer Address:Port LISTEN 0 10 127.0.0.1:4251 *:* LISTEN 0 10 127.0.0.1:4245 *:*
ps xua | grep osmo
build 12030 1.2 0.0 54048 21172 ? S 12:19 0:00 /usr/bin/python3 /usr/local/bin/osmotestconfig.py -p /build -w /build -v build 12086 0.0 0.0 21475111140 18004 ? S 12:19 0:00 src/sgsn/osmo-sgsn -c /build/writtenconfig/osmo-sgsn.cfgo11jabnf build 12093 0.0 0.0 4280 712 ? S 12:19 0:00 /bin/sh -c ps xua | grep osmo build 12095 0.0 0.0 12784 936 ? S 12:19 0:00 grep osmo
Socket: in 1 tries, connected to 127.0.0.1:4245 <socket.socket fd=4, family=AddressFamily.AF_INET, type=SocketKind.SOCK_STREAM, proto=0, laddr=('127.0.0.1', 54644), raddr=('127.0.0.1', 4245)> (1 sockets open) Terminating took 0.897s Socket: closing 127.0.0.1:4245 <socket.socket fd=4, family=AddressFamily.AF_INET, type=SocketKind.SOCK_STREAM, proto=0, laddr=('127.0.0.1', 54644), raddr=('127.0.0.1', 4245)> (0 sockets open) Verifying src/gtphub/osmo-gtphub -c /build/doc/examples/osmo-gtphub/osmo-gtphub-1iface.cfg, test verify_doc Launching: PWD=/build 'src/gtphub/osmo-gtphub' '-c' '/build/doc/examples/osmo-gtphub/osmo-gtphub-1iface.cfg'
ls -l /proc/12030/fd
total 0 lr-x------ 1 build build 64 Dec 15 12:19 0 -> pipe:[31680093] l-wx------ 1 build build 64 Dec 15 12:19 1 -> pipe:[31680094] l-wx------ 1 build build 64 Dec 15 12:19 2 -> pipe:[31680095] l-wx------ 1 build build 64 Dec 15 12:19 3 -> /dev/null
ss -tn
State Recv-Q Send-Q Local Address:Port Peer Address:Port
ss -tln
State Recv-Q Send-Q Local Address:Port Peer Address:Port LISTEN 0 10 127.0.0.1:4253 *:*
ps xua | grep osmo
build 12030 1.2 0.0 54048 21172 ? S 12:19 0:00 /usr/bin/python3 /usr/local/bin/osmotestconfig.py -p /build -w /build -v build 12097 0.0 0.0 21474963656 13772 ? S 12:19 0:00 src/gtphub/osmo-gtphub -c /build/doc/examples/osmo-gtphub/osmo-gtphub-1iface.cfg build 12104 0.0 0.0 4280 712 ? S 12:19 0:00 /bin/sh -c ps xua | grep osmo build 12106 0.0 0.0 12784 956 ? S 12:19 0:00 grep osmo
Socket: in 1 tries, connected to 127.0.0.1:4253 <socket.socket fd=4, family=AddressFamily.AF_INET, type=SocketKind.SOCK_STREAM, proto=0, laddr=('127.0.0.1', 45556), raddr=('127.0.0.1', 4253)> (1 sockets open) Terminating took 0.897s Socket: closing 127.0.0.1:4253 <socket.socket fd=4, family=AddressFamily.AF_INET, type=SocketKind.SOCK_STREAM, proto=0, laddr=('127.0.0.1', 45556), raddr=('127.0.0.1', 4253)> (0 sockets open) Verifying src/gtphub/osmo-gtphub -c /build/writtenconfig/osmo-gtphub-1iface.cfgroqzqlwb, test write_config Launching: PWD=/build 'src/gtphub/osmo-gtphub' '-c' '/build/writtenconfig/osmo-gtphub-1iface.cfgroqzqlwb'
ls -l /proc/12030/fd
total 0 lr-x------ 1 build build 64 Dec 15 12:19 0 -> pipe:[31680093] l-wx------ 1 build build 64 Dec 15 12:19 1 -> pipe:[31680094] l-wx------ 1 build build 64 Dec 15 12:19 2 -> pipe:[31680095] l-wx------ 1 build build 64 Dec 15 12:19 3 -> /dev/null
ss -tn
State Recv-Q Send-Q Local Address:Port Peer Address:Port
ss -tln
State Recv-Q Send-Q Local Address:Port Peer Address:Port LISTEN 0 10 127.0.0.1:4253 *:*
ps xua | grep osmo
build 12030 1.1 0.0 54048 21172 ? S 12:19 0:00 /usr/bin/python3 /usr/local/bin/osmotestconfig.py -p /build -w /build -v build 12108 0.0 0.0 21474963656 14292 ? S 12:19 0:00 src/gtphub/osmo-gtphub -c /build/writtenconfig/osmo-gtphub-1iface.cfgroqzqlwb build 12115 0.0 0.0 4280 772 ? S 12:19 0:00 /bin/sh -c ps xua | grep osmo build 12117 0.0 0.0 12784 976 ? S 12:19 0:00 grep osmo
Socket: in 1 tries, connected to 127.0.0.1:4253 <socket.socket fd=4, family=AddressFamily.AF_INET, type=SocketKind.SOCK_STREAM, proto=0, laddr=('127.0.0.1', 45558), raddr=('127.0.0.1', 4253)> (1 sockets open) Terminating took 0.897s Socket: closing 127.0.0.1:4253 <socket.socket fd=4, family=AddressFamily.AF_INET, type=SocketKind.SOCK_STREAM, proto=0, laddr=('127.0.0.1', 45558), raddr=('127.0.0.1', 4253)> (0 sockets open) Verifying src/gtphub/osmo-gtphub -c /build/writtenconfig/osmo-gtphub-1iface.cfgroqzqlwb, test token_vty_command Launching: PWD=/build 'src/gtphub/osmo-gtphub' '-c' '/build/writtenconfig/osmo-gtphub-1iface.cfgroqzqlwb'
ls -l /proc/12030/fd
total 0 lr-x------ 1 build build 64 Dec 15 12:19 0 -> pipe:[31680093] l-wx------ 1 build build 64 Dec 15 12:19 1 -> pipe:[31680094] l-wx------ 1 build build 64 Dec 15 12:19 2 -> pipe:[31680095] l-wx------ 1 build build 64 Dec 15 12:19 3 -> /dev/null
ss -tn
State Recv-Q Send-Q Local Address:Port Peer Address:Port
ss -tln
State Recv-Q Send-Q Local Address:Port Peer Address:Port
ps xua | grep osmo
build 12030 0.9 0.0 54048 21172 ? S 12:19 0:00 /usr/bin/python3 /usr/local/bin/osmotestconfig.py -p /build -w /build -v build 12119 0.0 0.0 21474963656 14128 ? S 12:19 0:00 src/gtphub/osmo-gtphub -c /build/writtenconfig/osmo-gtphub-1iface.cfgroqzqlwb build 12126 0.0 0.0 4280 744 ? S 12:19 0:00 /bin/sh -c ps xua | grep osmo build 12128 0.0 0.0 12784 932 ? S 12:19 0:00 grep osmo
ERRORS: 1 Socket: in 1 tries, connected to 127.0.0.1:4253 <socket.socket fd=4, family=AddressFamily.AF_INET, type=SocketKind.SOCK_STREAM, proto=0, laddr=('127.0.0.1', 45564), raddr=('127.0.0.1', 4253)> (1 sockets open) Terminating took 0.897s Socket: closing 127.0.0.1:4253 <socket.socket fd=4, family=AddressFamily.AF_INET, type=SocketKind.SOCK_STREAM, proto=0, laddr=('127.0.0.1', 45564), raddr=('127.0.0.1', 4253)> (0 sockets open) Makefile:710: recipe for target 'vty-python-test' failed make[7]: Leaving directory '/build/tests' make[7]: *** [vty-python-test] Error 1 Makefile:727: recipe for target 'vty-test' failed make[6]: Leaving directory '/build/tests' make[6]: *** [vty-test] Error 2 Makefile:704: recipe for target 'python-tests' failed make[5]: Leaving directory '/build/tests' make[5]: *** [python-tests] Error 2 Makefile:735: recipe for target 'check-local' failed make[4]: *** [check-local] Error 2 make[4]: Leaving directory '/build/tests' make[3]: *** [check-am] Error 2 Makefile:564: recipe for target 'check-am' failed make[3]: Leaving directory '/build/tests' Makefile:416: recipe for target 'check-recursive' failed make[2]: Leaving directory '/build/tests' make[2]: *** [check-recursive] Error 1 Makefile:461: recipe for target 'check-recursive' failed make[1]: Leaving directory '/build' make[1]: *** [check-recursive] Error 1 Makefile:752: recipe for target 'check' failed make: *** [check] Error 2 + cat-testlogs.sh Build step 'Execute shell' marked build as failure [WARNINGS]Skipping publisher since build result is FAILURE
Changes:
------------------------------------------ [...truncated 414.45 KB...] logging print file 1 logging level gprs debug logging level ns info logging level obj notice logging level lglobal notice logging level llapd notice logging level linp notice logging level lmux notice logging level lmi notice logging level lmib notice logging level lsms notice logging level lctrl notice logging level lgtp notice logging level lstats notice logging level lgsup notice logging level loap notice logging level lss7 notice logging level lsccp notice logging level lsua notice logging level lm3ua notice logging level lmgcp notice logging level ljibuf notice logging level lrspro notice logging level lns notice logging level lbssgp notice ! stats interval 5 ! line vty no login ! ns encapsulation framerelay-gre enabled 0 encapsulation udp local-ip 127.0.0.100 encapsulation udp local-port 23000 encapsulation udp use-reset-block-unblock enabled nse 101 nsvci 101 nse 101 remote-role sgsn nse 101 encapsulation udp nse 101 remote-ip 192.168.100.239 nse 101 remote-port 7777 timer tns-block 3 timer tns-block-retries 3 timer tns-reset 3 timer tns-reset-retries 3 timer tns-test 30 timer tns-alive 3 timer tns-alive-retries 10 timer tsns-prov 3 timer unknown 0x8 3 timer unknown 0x9 3 gbproxy sgsn nsei 101
ss -tn
State Recv-Q Send-Q Local Address:Port Peer Address:Port
ss -tln
State Recv-Q Send-Q Local Address:Port Peer Address:Port LISTEN 0 10 127.0.0.1:4245 *:* LISTEN 0 10 127.0.0.1:4251 *:*
ps xua | grep osmo
build 11999 2.2 0.0 53908 20936 ? S 12:25 0:00 /usr/bin/python3 /usr/local/bin/osmotestconfig.py -p /build -w /build -v build 12033 0.0 0.0 21475111140 18496 ? S 12:25 0:00 src/sgsn/osmo-sgsn -c /build/doc/examples/osmo-sgsn/osmo-sgsn.cfg build 12040 0.0 0.0 4280 736 ? S 12:25 0:00 /bin/sh -c ps xua | grep osmo build 12042 0.0 0.0 12784 1028 ? R 12:25 0:00 grep osmo
Socket: in 1 tries, connected to 127.0.0.1:4245 <socket.socket fd=4, family=AddressFamily.AF_INET, type=SocketKind.SOCK_STREAM, proto=0, laddr=('127.0.0.1', 55268), raddr=('127.0.0.1', 4245)> (1 sockets open) Terminating took 0.897s Socket: closing 127.0.0.1:4245 <socket.socket fd=4, family=AddressFamily.AF_INET, type=SocketKind.SOCK_STREAM, proto=0, laddr=('127.0.0.1', 55268), raddr=('127.0.0.1', 4245)> (0 sockets open) Verifying src/sgsn/osmo-sgsn -c /build/writtenconfig/osmo-sgsn.cfg9_99n_bx, test write_config Launching: PWD=/build 'src/sgsn/osmo-sgsn' '-c' '/build/writtenconfig/osmo-sgsn.cfg9_99n_bx'
ls -l /proc/11999/fd
total 0 lr-x------ 1 build build 64 Dec 15 12:25 0 -> pipe:[32380196] l-wx------ 1 build build 64 Dec 15 12:25 1 -> pipe:[32380197] l-wx------ 1 build build 64 Dec 15 12:25 2 -> pipe:[32380198] l-wx------ 1 build build 64 Dec 15 12:25 3 -> /dev/null
ss -tn
State Recv-Q Send-Q Local Address:Port Peer Address:Port
ss -tln
State Recv-Q Send-Q Local Address:Port Peer Address:Port LISTEN 0 10 127.0.0.1:4245 *:* LISTEN 0 10 127.0.0.1:4251 *:*
ps xua | grep osmo
build 11999 1.9 0.0 54044 21024 ? S 12:25 0:00 /usr/bin/python3 /usr/local/bin/osmotestconfig.py -p /build -w /build -v build 12044 1.0 0.0 21475111140 17940 ? S 12:25 0:00 src/sgsn/osmo-sgsn -c /build/writtenconfig/osmo-sgsn.cfg9_99n_bx build 12051 0.0 0.0 4280 740 ? S 12:25 0:00 /bin/sh -c ps xua | grep osmo build 12053 0.0 0.0 4280 84 ? R 12:25 0:00 /bin/sh -c ps xua | grep osmo
Socket: in 1 tries, connected to 127.0.0.1:4245 <socket.socket fd=4, family=AddressFamily.AF_INET, type=SocketKind.SOCK_STREAM, proto=0, laddr=('127.0.0.1', 55270), raddr=('127.0.0.1', 4245)> (1 sockets open) Terminating took 0.897s Socket: closing 127.0.0.1:4245 <socket.socket fd=4, family=AddressFamily.AF_INET, type=SocketKind.SOCK_STREAM, proto=0, laddr=('127.0.0.1', 55270), raddr=('127.0.0.1', 4245)> (0 sockets open) Verifying src/sgsn/osmo-sgsn -c /build/writtenconfig/osmo-sgsn.cfg9_99n_bx, test token_vty_command Launching: PWD=/build 'src/sgsn/osmo-sgsn' '-c' '/build/writtenconfig/osmo-sgsn.cfg9_99n_bx'
ls -l /proc/11999/fd
total 0 lr-x------ 1 build build 64 Dec 15 12:25 0 -> pipe:[32380196] l-wx------ 1 build build 64 Dec 15 12:25 1 -> pipe:[32380197] l-wx------ 1 build build 64 Dec 15 12:25 2 -> pipe:[32380198] l-wx------ 1 build build 64 Dec 15 12:25 3 -> /dev/null
ss -tn
State Recv-Q Send-Q Local Address:Port Peer Address:Port
ss -tln
State Recv-Q Send-Q Local Address:Port Peer Address:Port LISTEN 0 10 127.0.0.1:4245 *:* LISTEN 0 10 127.0.0.1:4251 *:*
ps xua | grep osmo
build 11999 1.4 0.0 54044 21024 ? S 12:25 0:00 /usr/bin/python3 /usr/local/bin/osmotestconfig.py -p /build -w /build -v build 12055 0.0 0.0 21475111140 25560 ? S 12:25 0:00 src/sgsn/osmo-sgsn -c /build/writtenconfig/osmo-sgsn.cfg9_99n_bx build 12062 0.0 0.0 4280 740 ? S 12:25 0:00 /bin/sh -c ps xua | grep osmo build 12064 0.0 0.0 12784 936 ? R 12:25 0:00 grep osmo
Socket: in 1 tries, connected to 127.0.0.1:4245 <socket.socket fd=4, family=AddressFamily.AF_INET, type=SocketKind.SOCK_STREAM, proto=0, laddr=('127.0.0.1', 55272), raddr=('127.0.0.1', 4245)> (1 sockets open) Terminating took 0.897s Socket: closing 127.0.0.1:4245 <socket.socket fd=4, family=AddressFamily.AF_INET, type=SocketKind.SOCK_STREAM, proto=0, laddr=('127.0.0.1', 55272), raddr=('127.0.0.1', 4245)> (0 sockets open) Verifying src/gtphub/osmo-gtphub -c /build/doc/examples/osmo-gtphub/osmo-gtphub-1iface.cfg, test verify_doc Launching: PWD=/build 'src/gtphub/osmo-gtphub' '-c' '/build/doc/examples/osmo-gtphub/osmo-gtphub-1iface.cfg'
ls -l /proc/11999/fd
total 0 lr-x------ 1 build build 64 Dec 15 12:25 0 -> pipe:[32380196] l-wx------ 1 build build 64 Dec 15 12:25 1 -> pipe:[32380197] l-wx------ 1 build build 64 Dec 15 12:25 2 -> pipe:[32380198] l-wx------ 1 build build 64 Dec 15 12:25 3 -> /dev/null
ss -tn
State Recv-Q Send-Q Local Address:Port Peer Address:Port
ss -tln
State Recv-Q Send-Q Local Address:Port Peer Address:Port LISTEN 0 10 127.0.0.1:4253 *:*
ps xua | grep osmo
build 11999 1.4 0.0 54044 21024 ? S 12:25 0:00 /usr/bin/python3 /usr/local/bin/osmotestconfig.py -p /build -w /build -v build 12066 0.0 0.0 21474963656 21640 ? S 12:25 0:00 src/gtphub/osmo-gtphub -c /build/doc/examples/osmo-gtphub/osmo-gtphub-1iface.cfg build 12073 0.0 0.0 4280 736 ? S 12:25 0:00 /bin/sh -c ps xua | grep osmo build 12075 0.0 0.0 4280 88 ? R 12:25 0:00 /bin/sh -c ps xua | grep osmo
Socket: in 1 tries, connected to 127.0.0.1:4253 <socket.socket fd=4, family=AddressFamily.AF_INET, type=SocketKind.SOCK_STREAM, proto=0, laddr=('127.0.0.1', 46182), raddr=('127.0.0.1', 4253)> (1 sockets open) Terminating took 0.897s Socket: closing 127.0.0.1:4253 <socket.socket fd=4, family=AddressFamily.AF_INET, type=SocketKind.SOCK_STREAM, proto=0, laddr=('127.0.0.1', 46182), raddr=('127.0.0.1', 4253)> (0 sockets open) Verifying src/gtphub/osmo-gtphub -c /build/writtenconfig/osmo-gtphub-1iface.cfgs16yu1k_, test write_config Launching: PWD=/build 'src/gtphub/osmo-gtphub' '-c' '/build/writtenconfig/osmo-gtphub-1iface.cfgs16yu1k_'
ls -l /proc/11999/fd
total 0 lr-x------ 1 build build 64 Dec 15 12:25 0 -> pipe:[32380196] l-wx------ 1 build build 64 Dec 15 12:25 1 -> pipe:[32380197] l-wx------ 1 build build 64 Dec 15 12:25 2 -> pipe:[32380198] l-wx------ 1 build build 64 Dec 15 12:25 3 -> /dev/null
ss -tn
State Recv-Q Send-Q Local Address:Port Peer Address:Port
ss -tln
State Recv-Q Send-Q Local Address:Port Peer Address:Port LISTEN 0 10 127.0.0.1:4253 *:*
ps xua | grep osmo
build 11999 1.3 0.0 54044 21024 ? S 12:25 0:00 /usr/bin/python3 /usr/local/bin/osmotestconfig.py -p /build -w /build -v build 12077 0.0 0.0 21474963656 21064 ? S 12:25 0:00 src/gtphub/osmo-gtphub -c /build/writtenconfig/osmo-gtphub-1iface.cfgs16yu1k_ build 12084 0.0 0.0 4280 720 ? S 12:25 0:00 /bin/sh -c ps xua | grep osmo build 12086 0.0 0.0 4280 84 ? R 12:25 0:00 /bin/sh -c ps xua | grep osmo
Socket: in 1 tries, connected to 127.0.0.1:4253 <socket.socket fd=4, family=AddressFamily.AF_INET, type=SocketKind.SOCK_STREAM, proto=0, laddr=('127.0.0.1', 46184), raddr=('127.0.0.1', 4253)> (1 sockets open) Terminating took 0.897s Socket: closing 127.0.0.1:4253 <socket.socket fd=4, family=AddressFamily.AF_INET, type=SocketKind.SOCK_STREAM, proto=0, laddr=('127.0.0.1', 46184), raddr=('127.0.0.1', 4253)> (0 sockets open) Verifying src/gtphub/osmo-gtphub -c /build/writtenconfig/osmo-gtphub-1iface.cfgs16yu1k_, test token_vty_command Launching: PWD=/build 'src/gtphub/osmo-gtphub' '-c' '/build/writtenconfig/osmo-gtphub-1iface.cfgs16yu1k_'
ls -l /proc/11999/fd
total 0 lr-x------ 1 build build 64 Dec 15 12:25 0 -> pipe:[32380196] l-wx------ 1 build build 64 Dec 15 12:25 1 -> pipe:[32380197] l-wx------ 1 build build 64 Dec 15 12:25 2 -> pipe:[32380198] l-wx------ 1 build build 64 Dec 15 12:25 3 -> /dev/null
ss -tn
State Recv-Q Send-Q Local Address:Port Peer Address:Port
ss -tln
State Recv-Q Send-Q Local Address:Port Peer Address:Port LISTEN 0 10 127.0.0.1:4253 *:*
ps xua | grep osmo
build 11999 1.0 0.0 54044 21024 ? S 12:25 0:00 /usr/bin/python3 /usr/local/bin/osmotestconfig.py -p /build -w /build -v build 12088 0.0 0.0 21474963656 19488 ? S 12:25 0:00 src/gtphub/osmo-gtphub -c /build/writtenconfig/osmo-gtphub-1iface.cfgs16yu1k_ build 12095 0.0 0.0 4280 700 ? S 12:25 0:00 /bin/sh -c ps xua | grep osmo build 12097 0.0 0.0 12784 936 ? S 12:25 0:00 grep osmo
Socket: in 1 tries, connected to 127.0.0.1:4253 <socket.socket fd=4, family=AddressFamily.AF_INET, type=SocketKind.SOCK_STREAM, proto=0, laddr=('127.0.0.1', 46188), raddr=('127.0.0.1', 4253)> (1 sockets open) Terminating took 0.897s Socket: closing 127.0.0.1:4253 <socket.socket fd=4, family=AddressFamily.AF_INET, type=SocketKind.SOCK_STREAM, proto=0, laddr=('127.0.0.1', 46188), raddr=('127.0.0.1', 4253)> (0 sockets open) ERRORS: 1 make[7]: *** [vty-python-test] Error 1 Makefile:710: recipe for target 'vty-python-test' failed make[7]: Leaving directory '/build/tests' make[6]: *** [vty-test] Error 2 Makefile:727: recipe for target 'vty-test' failed make[6]: Leaving directory '/build/tests' make[5]: *** [python-tests] Error 2 Makefile:704: recipe for target 'python-tests' failed make[5]: Leaving directory '/build/tests' Makefile:735: recipe for target 'check-local' failed make[4]: Leaving directory '/build/tests' make[4]: *** [check-local] Error 2 Makefile:564: recipe for target 'check-am' failed make[3]: *** [check-am] Error 2 make[3]: Leaving directory '/build/tests' Makefile:416: recipe for target 'check-recursive' failed make[2]: *** [check-recursive] Error 1 make[2]: Leaving directory '/build/tests' make[1]: *** [check-recursive] Error 1 Makefile:461: recipe for target 'check-recursive' failed make[1]: Leaving directory '/build' make: *** [check] Error 2 Makefile:752: recipe for target 'check' failed + cat-testlogs.sh Build step 'Execute shell' marked build as failure [WARNINGS]Skipping publisher since build result is FAILURE
Changes:
------------------------------------------ [...truncated 412.64 KB...] ! ! OsmoGbProxy (1.6.0.108-3326) configuration saved from vty !! ! log stderr logging filter all 1 logging color 1 logging print category-hex 1 logging print category 0 logging timestamp 0 logging print file 1 logging level gprs debug logging level ns info logging level obj notice logging level lglobal notice logging level llapd notice logging level linp notice logging level lmux notice logging level lmi notice logging level lmib notice logging level lsms notice logging level lctrl notice logging level lgtp notice logging level lstats notice logging level lgsup notice logging level loap notice logging level lss7 notice logging level lsccp notice logging level lsua notice logging level lm3ua notice logging level lmgcp notice logging level ljibuf notice logging level lrspro notice logging level lns notice logging level lbssgp notice ! stats interval 5 ! line vty no login ! ns encapsulation framerelay-gre enabled 0 encapsulation udp local-ip 127.0.0.100 encapsulation udp local-port 23000 encapsulation udp use-reset-block-unblock enabled nse 101 nsvci 101 nse 101 remote-role sgsn nse 101 encapsulation udp nse 101 remote-ip 192.168.100.239 nse 101 remote-port 7777 timer tns-block 3 timer tns-block-retries 3 timer tns-reset 3 timer tns-reset-retries 3 timer tns-test 30 timer tns-alive 3 timer tns-alive-retries 10 timer tsns-prov 3 timer unknown 0x8 3 timer unknown 0x9 3 gbproxy sgsn nsei 101
State Recv-Q Send-Q Local Address:Port Peer Address:Port
ss -tln
State Recv-Q Send-Q Local Address:Port Peer Address:Port
ps xua | grep osmo
build 12227 1.8 0.0 53992 21080 ? S 16:09 0:00 /usr/bin/python3 /usr/local/bin/osmotestconfig.py -p /build -w /build -v build 12261 0.0 0.0 21475044960 25632 ? R 16:10 0:00 src/sgsn/osmo-sgsn -c /build/doc/examples/osmo-sgsn/osmo-sgsn.cfg build 12268 0.0 0.0 4280 700 ? S 16:10 0:00 /bin/sh -c ps xua | grep osmo build 12270 0.0 0.0 12784 932 ? S 16:10 0:00 grep osmo
Socket: in 1 tries, connected to 127.0.0.1:4245 <socket.socket fd=4, family=AddressFamily.AF_INET, type=SocketKind.SOCK_STREAM, proto=0, laddr=('127.0.0.1', 55810), raddr=('127.0.0.1', 4245)> (1 sockets open) Terminating took 0.897s Socket: closing 127.0.0.1:4245 <socket.socket fd=4, family=AddressFamily.AF_INET, type=SocketKind.SOCK_STREAM, proto=0, laddr=('127.0.0.1', 55810), raddr=('127.0.0.1', 4245)> (0 sockets open) Verifying src/sgsn/osmo-sgsn -c /build/writtenconfig/osmo-sgsn.cfg44r0rjpl, test write_config Launching: PWD=/build 'src/sgsn/osmo-sgsn' '-c' '/build/writtenconfig/osmo-sgsn.cfg44r0rjpl'
ls -l /proc/12227/fd
total 0 lr-x------ 1 build build 64 Dec 15 16:09 0 -> pipe:[33349181] l-wx------ 1 build build 64 Dec 15 16:09 1 -> pipe:[33349182] l-wx------ 1 build build 64 Dec 15 16:09 2 -> pipe:[33349183] l-wx------ 1 build build 64 Dec 15 16:09 3 -> /dev/null
ss -tn
State Recv-Q Send-Q Local Address:Port Peer Address:Port
ss -tln
State Recv-Q Send-Q Local Address:Port Peer Address:Port
ps xua | grep osmo
build 12227 1.6 0.0 53992 21168 ? S 16:09 0:00 /usr/bin/python3 /usr/local/bin/osmotestconfig.py -p /build -w /build -v build 12272 0.0 0.0 21475044960 22372 ? R 16:10 0:00 src/sgsn/osmo-sgsn -c /build/writtenconfig/osmo-sgsn.cfg44r0rjpl build 12279 0.0 0.0 4280 744 ? S 16:10 0:00 /bin/sh -c ps xua | grep osmo build 12281 0.0 0.0 12784 964 ? S 16:10 0:00 grep osmo
Socket: in 1 tries, connected to 127.0.0.1:4245 <socket.socket fd=4, family=AddressFamily.AF_INET, type=SocketKind.SOCK_STREAM, proto=0, laddr=('127.0.0.1', 55820), raddr=('127.0.0.1', 4245)> (1 sockets open) Terminating took 0.897s Socket: closing 127.0.0.1:4245 <socket.socket fd=4, family=AddressFamily.AF_INET, type=SocketKind.SOCK_STREAM, proto=0, laddr=('127.0.0.1', 55820), raddr=('127.0.0.1', 4245)> (0 sockets open) Verifying src/sgsn/osmo-sgsn -c /build/writtenconfig/osmo-sgsn.cfg44r0rjpl, test token_vty_command Launching: PWD=/build 'src/sgsn/osmo-sgsn' '-c' '/build/writtenconfig/osmo-sgsn.cfg44r0rjpl'
ls -l /proc/12227/fd
total 0 lr-x------ 1 build build 64 Dec 15 16:09 0 -> pipe:[33349181] l-wx------ 1 build build 64 Dec 15 16:09 1 -> pipe:[33349182] l-wx------ 1 build build 64 Dec 15 16:09 2 -> pipe:[33349183] l-wx------ 1 build build 64 Dec 15 16:09 3 -> /dev/null
ss -tn
State Recv-Q Send-Q Local Address:Port Peer Address:Port
ss -tln
State Recv-Q Send-Q Local Address:Port Peer Address:Port
ps xua | grep osmo
build 12227 1.2 0.0 53992 21168 ? S 16:09 0:00 /usr/bin/python3 /usr/local/bin/osmotestconfig.py -p /build -w /build -v build 12283 0.0 0.0 21474974552 17768 ? R 16:10 0:00 src/sgsn/osmo-sgsn -c /build/writtenconfig/osmo-sgsn.cfg44r0rjpl build 12290 0.0 0.0 4280 700 ? S 16:10 0:00 /bin/sh -c ps xua | grep osmo build 12292 0.0 0.0 12784 976 ? S 16:10 0:00 grep osmo
Connecting socket failed, retrying... Socket: in 2 tries, connected to 127.0.0.1:4245 <socket.socket fd=5, family=AddressFamily.AF_INET, type=SocketKind.SOCK_STREAM, proto=0, laddr=('127.0.0.1', 55830), raddr=('127.0.0.1', 4245)> (1 sockets open) Terminating took 0.897s Socket: closing 127.0.0.1:4245 <socket.socket fd=5, family=AddressFamily.AF_INET, type=SocketKind.SOCK_STREAM, proto=0, laddr=('127.0.0.1', 55830), raddr=('127.0.0.1', 4245)> (0 sockets open) Verifying src/gtphub/osmo-gtphub -c /build/doc/examples/osmo-gtphub/osmo-gtphub-1iface.cfg, test verify_doc Launching: PWD=/build 'src/gtphub/osmo-gtphub' '-c' '/build/doc/examples/osmo-gtphub/osmo-gtphub-1iface.cfg'
ls -l /proc/12227/fd
total 0 lr-x------ 1 build build 64 Dec 15 16:09 0 -> pipe:[33349181] l-wx------ 1 build build 64 Dec 15 16:09 1 -> pipe:[33349182] l-wx------ 1 build build 64 Dec 15 16:09 2 -> pipe:[33349183] l-wx------ 1 build build 64 Dec 15 16:09 3 -> /dev/null
ss -tn
State Recv-Q Send-Q Local Address:Port Peer Address:Port
ss -tln
State Recv-Q Send-Q Local Address:Port Peer Address:Port
ps xua | grep osmo
build 12227 1.2 0.0 53992 21168 ? S 16:09 0:00 /usr/bin/python3 /usr/local/bin/osmotestconfig.py -p /build -w /build -v build 12294 0.0 0.0 21474963656 13932 ? S 16:10 0:00 src/gtphub/osmo-gtphub -c /build/doc/examples/osmo-gtphub/osmo-gtphub-1iface.cfg build 12301 0.0 0.0 4280 752 ? S 16:10 0:00 /bin/sh -c ps xua | grep osmo build 12303 0.0 0.0 12784 972 ? S 16:10 0:00 grep osmo
Socket: in 1 tries, connected to 127.0.0.1:4253 <socket.socket fd=4, family=AddressFamily.AF_INET, type=SocketKind.SOCK_STREAM, proto=0, laddr=('127.0.0.1', 46744), raddr=('127.0.0.1', 4253)> (1 sockets open) Terminating took 0.897s Socket: closing 127.0.0.1:4253 <socket.socket fd=4, family=AddressFamily.AF_INET, type=SocketKind.SOCK_STREAM, proto=0, laddr=('127.0.0.1', 46744), raddr=('127.0.0.1', 4253)> (0 sockets open) Verifying src/gtphub/osmo-gtphub -c /build/writtenconfig/osmo-gtphub-1iface.cfgy6r0to55, test write_config Launching: PWD=/build 'src/gtphub/osmo-gtphub' '-c' '/build/writtenconfig/osmo-gtphub-1iface.cfgy6r0to55'
ls -l /proc/12227/fd
total 0 lr-x------ 1 build build 64 Dec 15 16:09 0 -> pipe:[33349181] l-wx------ 1 build build 64 Dec 15 16:09 1 -> pipe:[33349182] l-wx------ 1 build build 64 Dec 15 16:09 2 -> pipe:[33349183] l-wx------ 1 build build 64 Dec 15 16:09 3 -> /dev/null
ss -tn
State Recv-Q Send-Q Local Address:Port Peer Address:Port
ss -tln
State Recv-Q Send-Q Local Address:Port Peer Address:Port
ps xua | grep osmo
build 12227 1.1 0.0 53992 21168 ? S 16:09 0:00 /usr/bin/python3 /usr/local/bin/osmotestconfig.py -p /build -w /build -v build 12305 0.0 0.0 21474963656 14332 ? S 16:10 0:00 src/gtphub/osmo-gtphub -c /build/writtenconfig/osmo-gtphub-1iface.cfgy6r0to55 build 12312 0.0 0.0 4280 744 ? S 16:10 0:00 /bin/sh -c ps xua | grep osmo build 12314 0.0 0.0 12784 952 ? S 16:10 0:00 grep osmo
Socket: in 1 tries, connected to 127.0.0.1:4253 <socket.socket fd=4, family=AddressFamily.AF_INET, type=SocketKind.SOCK_STREAM, proto=0, laddr=('127.0.0.1', 46746), raddr=('127.0.0.1', 4253)> (1 sockets open) Terminating took 0.897s Socket: closing 127.0.0.1:4253 <socket.socket fd=4, family=AddressFamily.AF_INET, type=SocketKind.SOCK_STREAM, proto=0, laddr=('127.0.0.1', 46746), raddr=('127.0.0.1', 4253)> (0 sockets open) Verifying src/gtphub/osmo-gtphub -c /build/writtenconfig/osmo-gtphub-1iface.cfgy6r0to55, test token_vty_command Launching: PWD=/build 'src/gtphub/osmo-gtphub' '-c' '/build/writtenconfig/osmo-gtphub-1iface.cfgy6r0to55'
ls -l /proc/12227/fd
total 0 lr-x------ 1 build build 64 Dec 15 16:09 0 -> pipe:[33349181] l-wx------ 1 build build 64 Dec 15 16:09 1 -> pipe:[33349182] l-wx------ 1 build build 64 Dec 15 16:09 2 -> pipe:[33349183] l-wx------ 1 build build 64 Dec 15 16:09 3 -> /dev/null
ss -tn
State Recv-Q Send-Q Local Address:Port Peer Address:Port
ss -tln
State Recv-Q Send-Q Local Address:Port Peer Address:Port LISTEN 0 10 127.0.0.1:4253 *:*
ps xua | grep osmo
build 12227 1.0 0.0 53992 21168 ? S 16:09 0:00 /usr/bin/python3 /usr/local/bin/osmotestconfig.py -p /build -w /build -v build 12316 0.0 0.0 21474963656 14048 ? S 16:10 0:00 src/gtphub/osmo-gtphub -c /build/writtenconfig/osmo-gtphub-1iface.cfgy6r0to55 build 12323 0.0 0.0 4280 748 ? S 16:10 0:00 /bin/sh -c ps xua | grep osmo build 12325 0.0 0.0 12784 968 ? S 16:10 0:00 grep osmo
ERRORS: 1 Socket: in 1 tries, connected to 127.0.0.1:4253 <socket.socket fd=4, family=AddressFamily.AF_INET, type=SocketKind.SOCK_STREAM, proto=0, laddr=('127.0.0.1', 46748), raddr=('127.0.0.1', 4253)> (1 sockets open) Terminating took 0.897s Socket: closing 127.0.0.1:4253 <socket.socket fd=4, family=AddressFamily.AF_INET, type=SocketKind.SOCK_STREAM, proto=0, laddr=('127.0.0.1', 46748), raddr=('127.0.0.1', 4253)> (0 sockets open) make[7]: *** [vty-python-test] Error 1 Makefile:710: recipe for target 'vty-python-test' failed make[7]: Leaving directory '/build/tests' Makefile:727: recipe for target 'vty-test' failed make[6]: *** [vty-test] Error 2 make[6]: Leaving directory '/build/tests' Makefile:704: recipe for target 'python-tests' failed make[5]: Leaving directory '/build/tests' Makefile:735: recipe for target 'check-local' failed make[4]: Leaving directory '/build/tests' Makefile:564: recipe for target 'check-am' failed make[3]: Leaving directory '/build/tests' make[5]: *** [python-tests] Error 2 make[4]: *** [check-local] Error 2 make[3]: *** [check-am] Error 2 Makefile:416: recipe for target 'check-recursive' failed make[2]: Leaving directory '/build/tests' make[2]: *** [check-recursive] Error 1 Makefile:461: recipe for target 'check-recursive' failed make[1]: Leaving directory '/build' make[1]: *** [check-recursive] Error 1 Makefile:752: recipe for target 'check' failed make: *** [check] Error 2 + cat-testlogs.sh Build step 'Execute shell' marked build as failure [WARNINGS]Skipping publisher since build result is FAILURE
Changes:
------------------------------------------ [...truncated 381.01 KB...] ! ! OsmoGbProxy (1.6.0.108-3326) configuration saved from vty !! ! log stderr logging filter all 1 logging color 1 logging print category-hex 1 logging print category 0 logging timestamp 0 logging print file 1 logging level gprs debug logging level ns info logging level obj notice logging level lglobal notice logging level llapd notice logging level linp notice logging level lmux notice logging level lmi notice logging level lmib notice logging level lsms notice logging level lctrl notice logging level lgtp notice logging level lstats notice logging level lgsup notice logging level loap notice logging level lss7 notice logging level lsccp notice logging level lsua notice logging level lm3ua notice logging level lmgcp notice logging level ljibuf notice logging level lrspro notice logging level lns notice logging level lbssgp notice ! stats interval 5 ! line vty no login ! ns encapsulation framerelay-gre enabled 0 encapsulation udp local-ip 127.0.0.100 encapsulation udp local-port 23000 encapsulation udp use-reset-block-unblock enabled nse 101 nsvci 101 nse 101 remote-role sgsn nse 101 encapsulation udp nse 101 remote-ip 192.168.100.239 nse 101 remote-port 7777 timer tns-block 3 timer tns-block-retries 3 timer tns-reset 3 timer tns-reset-retries 3 timer tns-test 30 timer tns-alive 3 timer tns-alive-retries 10 timer tsns-prov 3 timer unknown 0x8 3 timer unknown 0x9 3 gbproxy sgsn nsei 101
State Recv-Q Send-Q Local Address:Port Peer Address:Port
ss -tln
State Recv-Q Send-Q Local Address:Port Peer Address:Port
ps xua | grep osmo
build 12007 2.2 0.0 53864 21024 ? S 16:13 0:00 /usr/bin/python3 /usr/local/bin/osmotestconfig.py -p /build -w /build -v build 12041 0.0 0.0 21475044960 23012 ? R 16:13 0:00 src/sgsn/osmo-sgsn -c /build/doc/examples/osmo-sgsn/osmo-sgsn.cfg build 12048 0.0 0.0 4280 740 ? S 16:13 0:00 /bin/sh -c ps xua | grep osmo build 12050 0.0 0.0 12784 928 ? S 16:13 0:00 grep osmo
Socket: in 1 tries, connected to 127.0.0.1:4245 <socket.socket fd=4, family=AddressFamily.AF_INET, type=SocketKind.SOCK_STREAM, proto=0, laddr=('127.0.0.1', 55994), raddr=('127.0.0.1', 4245)> (1 sockets open) Terminating took 0.897s Socket: closing 127.0.0.1:4245 <socket.socket fd=4, family=AddressFamily.AF_INET, type=SocketKind.SOCK_STREAM, proto=0, laddr=('127.0.0.1', 55994), raddr=('127.0.0.1', 4245)> (0 sockets open) Verifying src/sgsn/osmo-sgsn -c /build/writtenconfig/osmo-sgsn.cfg1lhis3p5, test write_config Launching: PWD=/build 'src/sgsn/osmo-sgsn' '-c' '/build/writtenconfig/osmo-sgsn.cfg1lhis3p5'
ls -l /proc/12007/fd
total 0 lr-x------ 1 build build 64 Dec 15 16:13 0 -> pipe:[33446178] l-wx------ 1 build build 64 Dec 15 16:13 1 -> pipe:[33446179] l-wx------ 1 build build 64 Dec 15 16:13 2 -> pipe:[33446180] l-wx------ 1 build build 64 Dec 15 16:13 3 -> /dev/null
ss -tn
State Recv-Q Send-Q Local Address:Port Peer Address:Port
ss -tln
State Recv-Q Send-Q Local Address:Port Peer Address:Port
ps xua | grep osmo
build 12007 1.8 0.0 54000 21112 ? S 16:13 0:00 /usr/bin/python3 /usr/local/bin/osmotestconfig.py -p /build -w /build -v build 12052 0.0 0.0 21474974552 16716 ? R 16:13 0:00 src/sgsn/osmo-sgsn -c /build/writtenconfig/osmo-sgsn.cfg1lhis3p5 build 12059 0.0 0.0 4280 708 ? S 16:13 0:00 /bin/sh -c ps xua | grep osmo build 12061 0.0 0.0 12784 920 ? S 16:13 0:00 grep osmo
Connecting socket failed, retrying... Socket: in 2 tries, connected to 127.0.0.1:4245 <socket.socket fd=5, family=AddressFamily.AF_INET, type=SocketKind.SOCK_STREAM, proto=0, laddr=('127.0.0.1', 55998), raddr=('127.0.0.1', 4245)> (1 sockets open) Terminating took 0.897s Socket: closing 127.0.0.1:4245 <socket.socket fd=5, family=AddressFamily.AF_INET, type=SocketKind.SOCK_STREAM, proto=0, laddr=('127.0.0.1', 55998), raddr=('127.0.0.1', 4245)> (0 sockets open) Verifying src/sgsn/osmo-sgsn -c /build/writtenconfig/osmo-sgsn.cfg1lhis3p5, test token_vty_command Launching: PWD=/build 'src/sgsn/osmo-sgsn' '-c' '/build/writtenconfig/osmo-sgsn.cfg1lhis3p5'
ls -l /proc/12007/fd
total 0 lr-x------ 1 build build 64 Dec 15 16:13 0 -> pipe:[33446178] l-wx------ 1 build build 64 Dec 15 16:13 1 -> pipe:[33446179] l-wx------ 1 build build 64 Dec 15 16:13 2 -> pipe:[33446180] l-wx------ 1 build build 64 Dec 15 16:13 3 -> /dev/null
ss -tn
State Recv-Q Send-Q Local Address:Port Peer Address:Port
ss -tln
State Recv-Q Send-Q Local Address:Port Peer Address:Port
ps xua | grep osmo
build 12007 1.4 0.0 54000 21112 ? S 16:13 0:00 /usr/bin/python3 /usr/local/bin/osmotestconfig.py -p /build -w /build -v build 12063 0.0 0.0 21474974552 16232 ? R 16:13 0:00 src/sgsn/osmo-sgsn -c /build/writtenconfig/osmo-sgsn.cfg1lhis3p5 build 12070 0.0 0.0 4280 752 ? S 16:13 0:00 /bin/sh -c ps xua | grep osmo build 12072 0.0 0.0 12784 972 ? S 16:13 0:00 grep osmo
Connecting socket failed, retrying... Socket: in 2 tries, connected to 127.0.0.1:4245 <socket.socket fd=5, family=AddressFamily.AF_INET, type=SocketKind.SOCK_STREAM, proto=0, laddr=('127.0.0.1', 56006), raddr=('127.0.0.1', 4245)> (1 sockets open) Terminating took 0.897s Socket: closing 127.0.0.1:4245 <socket.socket fd=5, family=AddressFamily.AF_INET, type=SocketKind.SOCK_STREAM, proto=0, laddr=('127.0.0.1', 56006), raddr=('127.0.0.1', 4245)> (0 sockets open) Verifying src/gtphub/osmo-gtphub -c /build/doc/examples/osmo-gtphub/osmo-gtphub-1iface.cfg, test verify_doc Launching: PWD=/build 'src/gtphub/osmo-gtphub' '-c' '/build/doc/examples/osmo-gtphub/osmo-gtphub-1iface.cfg'
ls -l /proc/12007/fd
total 0 lr-x------ 1 build build 64 Dec 15 16:13 0 -> pipe:[33446178] l-wx------ 1 build build 64 Dec 15 16:13 1 -> pipe:[33446179] l-wx------ 1 build build 64 Dec 15 16:13 2 -> pipe:[33446180] l-wx------ 1 build build 64 Dec 15 16:13 3 -> /dev/null
ss -tn
State Recv-Q Send-Q Local Address:Port Peer Address:Port
ss -tln
State Recv-Q Send-Q Local Address:Port Peer Address:Port
ps xua | grep osmo
build 12007 1.3 0.0 54000 21112 ? S 16:13 0:00 /usr/bin/python3 /usr/local/bin/osmotestconfig.py -p /build -w /build -v build 12074 0.0 0.0 21474963656 13808 ? S 16:13 0:00 src/gtphub/osmo-gtphub -c /build/doc/examples/osmo-gtphub/osmo-gtphub-1iface.cfg build 12081 0.0 0.0 4280 768 ? S 16:13 0:00 /bin/sh -c ps xua | grep osmo build 12083 0.0 0.0 12784 956 ? S 16:13 0:00 grep osmo
Socket: in 1 tries, connected to 127.0.0.1:4253 <socket.socket fd=4, family=AddressFamily.AF_INET, type=SocketKind.SOCK_STREAM, proto=0, laddr=('127.0.0.1', 46920), raddr=('127.0.0.1', 4253)> (1 sockets open) Terminating took 0.897s Socket: closing 127.0.0.1:4253 <socket.socket fd=4, family=AddressFamily.AF_INET, type=SocketKind.SOCK_STREAM, proto=0, laddr=('127.0.0.1', 46920), raddr=('127.0.0.1', 4253)> (0 sockets open) Verifying src/gtphub/osmo-gtphub -c /build/writtenconfig/osmo-gtphub-1iface.cfgjfmeupdg, test write_config Launching: PWD=/build 'src/gtphub/osmo-gtphub' '-c' '/build/writtenconfig/osmo-gtphub-1iface.cfgjfmeupdg'
ls -l /proc/12007/fd
total 0 lr-x------ 1 build build 64 Dec 15 16:13 0 -> pipe:[33446178] l-wx------ 1 build build 64 Dec 15 16:13 1 -> pipe:[33446179] l-wx------ 1 build build 64 Dec 15 16:13 2 -> pipe:[33446180] l-wx------ 1 build build 64 Dec 15 16:13 3 -> /dev/null
ss -tn
State Recv-Q Send-Q Local Address:Port Peer Address:Port
ss -tln
State Recv-Q Send-Q Local Address:Port Peer Address:Port
ps xua | grep osmo
build 12007 1.2 0.0 54000 21112 ? S 16:13 0:00 /usr/bin/python3 /usr/local/bin/osmotestconfig.py -p /build -w /build -v build 12085 0.0 0.0 21474963656 14004 ? S 16:13 0:00 src/gtphub/osmo-gtphub -c /build/writtenconfig/osmo-gtphub-1iface.cfgjfmeupdg build 12092 0.0 0.0 4280 700 ? S 16:13 0:00 /bin/sh -c ps xua | grep osmo build 12094 0.0 0.0 12784 948 ? S 16:13 0:00 grep osmo
Socket: in 1 tries, connected to 127.0.0.1:4253 <socket.socket fd=4, family=AddressFamily.AF_INET, type=SocketKind.SOCK_STREAM, proto=0, laddr=('127.0.0.1', 46922), raddr=('127.0.0.1', 4253)> (1 sockets open) Terminating took 0.897s Socket: closing 127.0.0.1:4253 <socket.socket fd=4, family=AddressFamily.AF_INET, type=SocketKind.SOCK_STREAM, proto=0, laddr=('127.0.0.1', 46922), raddr=('127.0.0.1', 4253)> (0 sockets open) Verifying src/gtphub/osmo-gtphub -c /build/writtenconfig/osmo-gtphub-1iface.cfgjfmeupdg, test token_vty_command Launching: PWD=/build 'src/gtphub/osmo-gtphub' '-c' '/build/writtenconfig/osmo-gtphub-1iface.cfgjfmeupdg'
ls -l /proc/12007/fd
total 0 lr-x------ 1 build build 64 Dec 15 16:13 0 -> pipe:[33446178] l-wx------ 1 build build 64 Dec 15 16:13 1 -> pipe:[33446179] l-wx------ 1 build build 64 Dec 15 16:13 2 -> pipe:[33446180] l-wx------ 1 build build 64 Dec 15 16:13 3 -> /dev/null
ss -tn
State Recv-Q Send-Q Local Address:Port Peer Address:Port
ss -tln
State Recv-Q Send-Q Local Address:Port Peer Address:Port
ps xua | grep osmo
build 12007 1.1 0.0 54000 21112 ? S 16:13 0:00 /usr/bin/python3 /usr/local/bin/osmotestconfig.py -p /build -w /build -v build 12096 0.0 0.0 21474963656 14216 ? S 16:13 0:00 src/gtphub/osmo-gtphub -c /build/writtenconfig/osmo-gtphub-1iface.cfgjfmeupdg build 12103 0.0 0.0 4280 772 ? S 16:13 0:00 /bin/sh -c ps xua | grep osmo build 12105 0.0 0.0 12784 1024 ? S 16:13 0:00 grep osmo
ERRORS: 1 Socket: in 1 tries, connected to 127.0.0.1:4253 <socket.socket fd=4, family=AddressFamily.AF_INET, type=SocketKind.SOCK_STREAM, proto=0, laddr=('127.0.0.1', 46928), raddr=('127.0.0.1', 4253)> (1 sockets open) Terminating took 0.897s Socket: closing 127.0.0.1:4253 <socket.socket fd=4, family=AddressFamily.AF_INET, type=SocketKind.SOCK_STREAM, proto=0, laddr=('127.0.0.1', 46928), raddr=('127.0.0.1', 4253)> (0 sockets open) Makefile:710: recipe for target 'vty-python-test' failed make[7]: Leaving directory '/build/tests' make[7]: *** [vty-python-test] Error 1 Makefile:727: recipe for target 'vty-test' failed make[6]: Leaving directory '/build/tests' make[6]: *** [vty-test] Error 2 Makefile:704: recipe for target 'python-tests' failed make[5]: Leaving directory '/build/tests' make[5]: *** [python-tests] Error 2 make[4]: *** [check-local] Error 2 Makefile:735: recipe for target 'check-local' failed make[4]: Leaving directory '/build/tests' make[3]: *** [check-am] Error 2 Makefile:564: recipe for target 'check-am' failed make[3]: Leaving directory '/build/tests' Makefile:416: recipe for target 'check-recursive' failed make[2]: Leaving directory '/build/tests' make[2]: *** [check-recursive] Error 1 make[1]: *** [check-recursive] Error 1 Makefile:461: recipe for target 'check-recursive' failed make[1]: Leaving directory '/build' Makefile:752: recipe for target 'check' failed make: *** [check] Error 2 + cat-testlogs.sh Build step 'Execute shell' marked build as failure [WARNINGS]Skipping publisher since build result is FAILURE
Changes:
------------------------------------------ [...truncated 413.32 KB...] ! OsmoGbProxy (1.6.0.108-3326) configuration saved from vty !! ! log stderr logging filter all 1 logging color 1 logging print category-hex 1 logging print category 0 logging timestamp 0 logging print file 1 logging level gprs debug logging level ns info logging level obj notice logging level lglobal notice logging level llapd notice logging level linp notice logging level lmux notice logging level lmi notice logging level lmib notice logging level lsms notice logging level lctrl notice logging level lgtp notice logging level lstats notice logging level lgsup notice logging level loap notice logging level lss7 notice logging level lsccp notice logging level lsua notice logging level lm3ua notice logging level lmgcp notice logging level ljibuf notice logging level lrspro notice logging level lns notice logging level lbssgp notice ! stats interval 5 ! line vty no login ! ns encapsulation framerelay-gre enabled 0 encapsulation udp local-ip 127.0.0.100 encapsulation udp local-port 23000 encapsulation udp use-reset-block-unblock enabled nse 101 nsvci 101 nse 101 remote-role sgsn nse 101 encapsulation udp nse 101 remote-ip 192.168.100.239 nse 101 remote-port 7777 timer tns-block 3 timer tns-block-retries 3 timer tns-reset 3 timer tns-reset-retries 3 timer tns-test 30 timer tns-alive 3 timer tns-alive-retries 10 timer tsns-prov 3 timer unknown 0x8 3 timer unknown 0x9 3 gbproxy sgsn nsei 101
ss -tn
State Recv-Q Send-Q Local Address:Port Peer Address:Port
ss -tln
State Recv-Q Send-Q Local Address:Port Peer Address:Port
ps xua | grep osmo
build 12000 2.0 0.0 53944 21168 ? S 16:20 0:00 /usr/bin/python3 /usr/local/bin/osmotestconfig.py -p /build -w /build -v build 12034 0.0 0.0 21475044960 25200 ? R 16:21 0:00 src/sgsn/osmo-sgsn -c /build/doc/examples/osmo-sgsn/osmo-sgsn.cfg build 12041 0.0 0.0 4280 724 ? S 16:21 0:00 /bin/sh -c ps xua | grep osmo build 12043 0.0 0.0 12784 932 ? S 16:21 0:00 grep osmo
Socket: in 1 tries, connected to 127.0.0.1:4245 <socket.socket fd=4, family=AddressFamily.AF_INET, type=SocketKind.SOCK_STREAM, proto=0, laddr=('127.0.0.1', 56484), raddr=('127.0.0.1', 4245)> (1 sockets open) Terminating took 0.897s Socket: closing 127.0.0.1:4245 <socket.socket fd=4, family=AddressFamily.AF_INET, type=SocketKind.SOCK_STREAM, proto=0, laddr=('127.0.0.1', 56484), raddr=('127.0.0.1', 4245)> (0 sockets open) Verifying src/sgsn/osmo-sgsn -c /build/writtenconfig/osmo-sgsn.cfgwpd9yjko, test write_config Launching: PWD=/build 'src/sgsn/osmo-sgsn' '-c' '/build/writtenconfig/osmo-sgsn.cfgwpd9yjko'
ls -l /proc/12000/fd
total 0 lr-x------ 1 build build 64 Dec 15 16:20 0 -> pipe:[33965675] l-wx------ 1 build build 64 Dec 15 16:20 1 -> pipe:[33965676] l-wx------ 1 build build 64 Dec 15 16:20 2 -> pipe:[33965677] l-wx------ 1 build build 64 Dec 15 16:20 3 -> /dev/null
ss -tn
State Recv-Q Send-Q Local Address:Port Peer Address:Port
ss -tln
State Recv-Q Send-Q Local Address:Port Peer Address:Port
ps xua | grep osmo
build 12000 1.9 0.0 54076 21252 ? S 16:20 0:00 /usr/bin/python3 /usr/local/bin/osmotestconfig.py -p /build -w /build -v build 12045 0.0 0.0 21475111140 22096 ? R 16:21 0:00 src/sgsn/osmo-sgsn -c /build/writtenconfig/osmo-sgsn.cfgwpd9yjko build 12052 0.0 0.0 4280 748 ? S 16:21 0:00 /bin/sh -c ps xua | grep osmo build 12054 0.0 0.0 12784 968 ? S 16:21 0:00 grep osmo
Socket: in 1 tries, connected to 127.0.0.1:4245 <socket.socket fd=4, family=AddressFamily.AF_INET, type=SocketKind.SOCK_STREAM, proto=0, laddr=('127.0.0.1', 56486), raddr=('127.0.0.1', 4245)> (1 sockets open) Terminating took 0.897s Socket: closing 127.0.0.1:4245 <socket.socket fd=4, family=AddressFamily.AF_INET, type=SocketKind.SOCK_STREAM, proto=0, laddr=('127.0.0.1', 56486), raddr=('127.0.0.1', 4245)> (0 sockets open) Verifying src/sgsn/osmo-sgsn -c /build/writtenconfig/osmo-sgsn.cfgwpd9yjko, test token_vty_command Launching: PWD=/build 'src/sgsn/osmo-sgsn' '-c' '/build/writtenconfig/osmo-sgsn.cfgwpd9yjko'
ls -l /proc/12000/fd
total 0 lr-x------ 1 build build 64 Dec 15 16:20 0 -> pipe:[33965675] l-wx------ 1 build build 64 Dec 15 16:20 1 -> pipe:[33965676] l-wx------ 1 build build 64 Dec 15 16:20 2 -> pipe:[33965677] l-wx------ 1 build build 64 Dec 15 16:20 3 -> /dev/null
ss -tn
State Recv-Q Send-Q Local Address:Port Peer Address:Port
ss -tln
State Recv-Q Send-Q Local Address:Port Peer Address:Port
ps xua | grep osmo
build 12000 1.4 0.0 54076 21252 ? S 16:20 0:00 /usr/bin/python3 /usr/local/bin/osmotestconfig.py -p /build -w /build -v build 12056 0.0 0.0 21475111140 21636 ? S 16:21 0:00 src/sgsn/osmo-sgsn -c /build/writtenconfig/osmo-sgsn.cfgwpd9yjko build 12063 0.0 0.0 4280 736 ? S 16:21 0:00 /bin/sh -c ps xua | grep osmo build 12065 0.0 0.0 12784 992 ? S 16:21 0:00 grep osmo
Socket: in 1 tries, connected to 127.0.0.1:4245 <socket.socket fd=4, family=AddressFamily.AF_INET, type=SocketKind.SOCK_STREAM, proto=0, laddr=('127.0.0.1', 56488), raddr=('127.0.0.1', 4245)> (1 sockets open) Terminating took 0.897s Socket: closing 127.0.0.1:4245 <socket.socket fd=4, family=AddressFamily.AF_INET, type=SocketKind.SOCK_STREAM, proto=0, laddr=('127.0.0.1', 56488), raddr=('127.0.0.1', 4245)> (0 sockets open) Verifying src/gtphub/osmo-gtphub -c /build/doc/examples/osmo-gtphub/osmo-gtphub-1iface.cfg, test verify_doc Launching: PWD=/build 'src/gtphub/osmo-gtphub' '-c' '/build/doc/examples/osmo-gtphub/osmo-gtphub-1iface.cfg'
ls -l /proc/12000/fd
total 0 lr-x------ 1 build build 64 Dec 15 16:20 0 -> pipe:[33965675] l-wx------ 1 build build 64 Dec 15 16:20 1 -> pipe:[33965676] l-wx------ 1 build build 64 Dec 15 16:20 2 -> pipe:[33965677] l-wx------ 1 build build 64 Dec 15 16:20 3 -> /dev/null
ss -tn
State Recv-Q Send-Q Local Address:Port Peer Address:Port
ss -tln
State Recv-Q Send-Q Local Address:Port Peer Address:Port
ps xua | grep osmo
build 12000 1.5 0.0 54076 21252 ? S 16:20 0:00 /usr/bin/python3 /usr/local/bin/osmotestconfig.py -p /build -w /build -v build 12067 0.0 0.0 21474963656 16968 ? S 16:21 0:00 src/gtphub/osmo-gtphub -c /build/doc/examples/osmo-gtphub/osmo-gtphub-1iface.cfg build 12074 0.0 0.0 4280 740 ? S 16:21 0:00 /bin/sh -c ps xua | grep osmo build 12076 0.0 0.0 12784 948 ? S 16:21 0:00 grep osmo
Socket: in 1 tries, connected to 127.0.0.1:4253 <socket.socket fd=4, family=AddressFamily.AF_INET, type=SocketKind.SOCK_STREAM, proto=0, laddr=('127.0.0.1', 47400), raddr=('127.0.0.1', 4253)> (1 sockets open) Terminating took 0.897s Socket: closing 127.0.0.1:4253 <socket.socket fd=4, family=AddressFamily.AF_INET, type=SocketKind.SOCK_STREAM, proto=0, laddr=('127.0.0.1', 47400), raddr=('127.0.0.1', 4253)> (0 sockets open) Verifying src/gtphub/osmo-gtphub -c /build/writtenconfig/osmo-gtphub-1iface.cfgdj0_yh5q, test write_config Launching: PWD=/build 'src/gtphub/osmo-gtphub' '-c' '/build/writtenconfig/osmo-gtphub-1iface.cfgdj0_yh5q'
ls -l /proc/12000/fd
total 0 lr-x------ 1 build build 64 Dec 15 16:20 0 -> pipe:[33965675] l-wx------ 1 build build 64 Dec 15 16:20 1 -> pipe:[33965676] l-wx------ 1 build build 64 Dec 15 16:20 2 -> pipe:[33965677] l-wx------ 1 build build 64 Dec 15 16:20 3 -> /dev/null
ss -tn
State Recv-Q Send-Q Local Address:Port Peer Address:Port
ss -tln
State Recv-Q Send-Q Local Address:Port Peer Address:Port
ps xua | grep osmo
build 12000 1.3 0.0 54076 21252 ? S 16:20 0:00 /usr/bin/python3 /usr/local/bin/osmotestconfig.py -p /build -w /build -v build 12078 0.0 0.0 21474963656 15916 ? S 16:21 0:00 src/gtphub/osmo-gtphub -c /build/writtenconfig/osmo-gtphub-1iface.cfgdj0_yh5q build 12085 0.0 0.0 4280 704 ? S 16:21 0:00 /bin/sh -c ps xua | grep osmo build 12087 0.0 0.0 12784 940 ? S 16:21 0:00 grep osmo
Socket: in 1 tries, connected to 127.0.0.1:4253 <socket.socket fd=4, family=AddressFamily.AF_INET, type=SocketKind.SOCK_STREAM, proto=0, laddr=('127.0.0.1', 47402), raddr=('127.0.0.1', 4253)> (1 sockets open) Terminating took 0.897s Socket: closing 127.0.0.1:4253 <socket.socket fd=4, family=AddressFamily.AF_INET, type=SocketKind.SOCK_STREAM, proto=0, laddr=('127.0.0.1', 47402), raddr=('127.0.0.1', 4253)> (0 sockets open) Verifying src/gtphub/osmo-gtphub -c /build/writtenconfig/osmo-gtphub-1iface.cfgdj0_yh5q, test token_vty_command Launching: PWD=/build 'src/gtphub/osmo-gtphub' '-c' '/build/writtenconfig/osmo-gtphub-1iface.cfgdj0_yh5q'
ls -l /proc/12000/fd
total 0 lr-x------ 1 build build 64 Dec 15 16:20 0 -> pipe:[33965675] l-wx------ 1 build build 64 Dec 15 16:20 1 -> pipe:[33965676] l-wx------ 1 build build 64 Dec 15 16:20 2 -> pipe:[33965677] l-wx------ 1 build build 64 Dec 15 16:20 3 -> /dev/null
ss -tn
State Recv-Q Send-Q Local Address:Port Peer Address:Port
ss -tln
State Recv-Q Send-Q Local Address:Port Peer Address:Port
ps xua | grep osmo
build 12000 1.1 0.0 54076 21252 ? S 16:20 0:00 /usr/bin/python3 /usr/local/bin/osmotestconfig.py -p /build -w /build -v build 12089 0.0 0.0 21474963656 17080 ? S 16:21 0:00 src/gtphub/osmo-gtphub -c /build/writtenconfig/osmo-gtphub-1iface.cfgdj0_yh5q build 12096 0.0 0.0 4280 748 ? S 16:21 0:00 /bin/sh -c ps xua | grep osmo build 12098 0.0 0.0 12784 956 ? S 16:21 0:00 grep osmo
Socket: in 1 tries, connected to 127.0.0.1:4253 <socket.socket fd=4, family=AddressFamily.AF_INET, type=SocketKind.SOCK_STREAM, proto=0, laddr=('127.0.0.1', 47404), raddr=('127.0.0.1', 4253)> (1 sockets open) Terminating took 0.897s Socket: closing 127.0.0.1:4253 <socket.socket fd=4, family=AddressFamily.AF_INET, type=SocketKind.SOCK_STREAM, proto=0, laddr=('127.0.0.1', 47404), raddr=('127.0.0.1', 4253)> (0 sockets open) ERRORS: 1 Makefile:710: recipe for target 'vty-python-test' failed make[7]: Leaving directory '/build/tests' make[7]: *** [vty-python-test] Error 1 make[6]: *** [vty-test] Error 2 Makefile:727: recipe for target 'vty-test' failed make[6]: Leaving directory '/build/tests' Makefile:704: recipe for target 'python-tests' failed make[5]: Leaving directory '/build/tests' make[5]: *** [python-tests] Error 2 Makefile:735: recipe for target 'check-local' failed make[4]: *** [check-local] Error 2 make[4]: Leaving directory '/build/tests' make[3]: *** [check-am] Error 2 Makefile:564: recipe for target 'check-am' failed make[3]: Leaving directory '/build/tests' Makefile:416: recipe for target 'check-recursive' failed make[2]: Leaving directory '/build/tests' make[2]: *** [check-recursive] Error 1 Makefile:461: recipe for target 'check-recursive' failed make[1]: Leaving directory '/build' make[1]: *** [check-recursive] Error 1 Makefile:752: recipe for target 'check' failed make: *** [check] Error 2 + cat-testlogs.sh Build step 'Execute shell' marked build as failure [WARNINGS]Skipping publisher since build result is FAILURE
Changes:
------------------------------------------ [...truncated 411.84 KB...] ! OsmoGbProxy (1.6.0.108-3326) configuration saved from vty !! ! log stderr logging filter all 1 logging color 1 logging print category-hex 1 logging print category 0 logging timestamp 0 logging print file 1 logging level gprs debug logging level ns info logging level obj notice logging level lglobal notice logging level llapd notice logging level linp notice logging level lmux notice logging level lmi notice logging level lmib notice logging level lsms notice logging level lctrl notice logging level lgtp notice logging level lstats notice logging level lgsup notice logging level loap notice logging level lss7 notice logging level lsccp notice logging level lsua notice logging level lm3ua notice logging level lmgcp notice logging level ljibuf notice logging level lrspro notice logging level lns notice logging level lbssgp notice ! stats interval 5 ! line vty no login ! ns encapsulation framerelay-gre enabled 0 encapsulation udp local-ip 127.0.0.100 encapsulation udp local-port 23000 encapsulation udp use-reset-block-unblock enabled nse 101 nsvci 101 nse 101 remote-role sgsn nse 101 encapsulation udp nse 101 remote-ip 192.168.100.239 nse 101 remote-port 7777 timer tns-block 3 timer tns-block-retries 3 timer tns-reset 3 timer tns-reset-retries 3 timer tns-test 30 timer tns-alive 3 timer tns-alive-retries 10 timer tsns-prov 3 timer unknown 0x8 3 timer unknown 0x9 3 gbproxy sgsn nsei 101
ss -tn
State Recv-Q Send-Q Local Address:Port Peer Address:Port
ss -tln
State Recv-Q Send-Q Local Address:Port Peer Address:Port
ps xua | grep osmo
build 12005 2.1 0.0 53904 21008 ? S 20:46 0:00 /usr/bin/python3 /usr/local/bin/osmotestconfig.py -p /build -w /build -v build 12039 0.0 0.0 21475111140 31548 ? R 20:46 0:00 src/sgsn/osmo-sgsn -c /build/doc/examples/osmo-sgsn/osmo-sgsn.cfg build 12046 0.0 0.0 4280 760 ? S 20:46 0:00 /bin/sh -c ps xua | grep osmo build 12048 0.0 0.0 12784 992 ? S 20:46 0:00 grep osmo
Socket: in 1 tries, connected to 127.0.0.1:4245 <socket.socket fd=4, family=AddressFamily.AF_INET, type=SocketKind.SOCK_STREAM, proto=0, laddr=('127.0.0.1', 57018), raddr=('127.0.0.1', 4245)> (1 sockets open) Terminating took 0.897s Socket: closing 127.0.0.1:4245 <socket.socket fd=4, family=AddressFamily.AF_INET, type=SocketKind.SOCK_STREAM, proto=0, laddr=('127.0.0.1', 57018), raddr=('127.0.0.1', 4245)> (0 sockets open) Verifying src/sgsn/osmo-sgsn -c /build/writtenconfig/osmo-sgsn.cfgiz34gx3m, test write_config Launching: PWD=/build 'src/sgsn/osmo-sgsn' '-c' '/build/writtenconfig/osmo-sgsn.cfgiz34gx3m'
ls -l /proc/12005/fd
total 0 lr-x------ 1 build build 64 Dec 15 20:46 0 -> pipe:[34855452] l-wx------ 1 build build 64 Dec 15 20:46 1 -> pipe:[34855453] l-wx------ 1 build build 64 Dec 15 20:46 2 -> pipe:[34855454] l-wx------ 1 build build 64 Dec 15 20:46 3 -> /dev/null
ss -tn
State Recv-Q Send-Q Local Address:Port Peer Address:Port
ss -tln
State Recv-Q Send-Q Local Address:Port Peer Address:Port
ps xua | grep osmo
build 12005 1.8 0.0 54040 21100 ? S 20:46 0:00 /usr/bin/python3 /usr/local/bin/osmotestconfig.py -p /build -w /build -v build 12050 0.0 0.1 21475111140 34536 ? R 20:46 0:00 src/sgsn/osmo-sgsn -c /build/writtenconfig/osmo-sgsn.cfgiz34gx3m build 12057 0.0 0.0 4280 744 ? S 20:46 0:00 /bin/sh -c ps xua | grep osmo build 12059 0.0 0.0 12784 932 ? S 20:46 0:00 grep osmo
Socket: in 1 tries, connected to 127.0.0.1:4245 <socket.socket fd=4, family=AddressFamily.AF_INET, type=SocketKind.SOCK_STREAM, proto=0, laddr=('127.0.0.1', 57020), raddr=('127.0.0.1', 4245)> (1 sockets open) Terminating took 0.897s Socket: closing 127.0.0.1:4245 <socket.socket fd=4, family=AddressFamily.AF_INET, type=SocketKind.SOCK_STREAM, proto=0, laddr=('127.0.0.1', 57020), raddr=('127.0.0.1', 4245)> (0 sockets open) Verifying src/sgsn/osmo-sgsn -c /build/writtenconfig/osmo-sgsn.cfgiz34gx3m, test token_vty_command Launching: PWD=/build 'src/sgsn/osmo-sgsn' '-c' '/build/writtenconfig/osmo-sgsn.cfgiz34gx3m'
ls -l /proc/12005/fd
total 0 lr-x------ 1 build build 64 Dec 15 20:46 0 -> pipe:[34855452] l-wx------ 1 build build 64 Dec 15 20:46 1 -> pipe:[34855453] l-wx------ 1 build build 64 Dec 15 20:46 2 -> pipe:[34855454] l-wx------ 1 build build 64 Dec 15 20:46 3 -> /dev/null
ss -tn
State Recv-Q Send-Q Local Address:Port Peer Address:Port
ss -tln
State Recv-Q Send-Q Local Address:Port Peer Address:Port
ps xua | grep osmo
build 12005 1.8 0.0 54040 21100 ? S 20:46 0:00 /usr/bin/python3 /usr/local/bin/osmotestconfig.py -p /build -w /build -v build 12061 0.0 0.1 21475044960 35916 ? R 20:46 0:00 src/sgsn/osmo-sgsn -c /build/writtenconfig/osmo-sgsn.cfgiz34gx3m build 12068 0.0 0.0 4280 696 ? S 20:46 0:00 /bin/sh -c ps xua | grep osmo build 12070 0.0 0.0 12784 912 ? S 20:46 0:00 grep osmo
Socket: in 1 tries, connected to 127.0.0.1:4245 <socket.socket fd=4, family=AddressFamily.AF_INET, type=SocketKind.SOCK_STREAM, proto=0, laddr=('127.0.0.1', 57022), raddr=('127.0.0.1', 4245)> (1 sockets open) Terminating took 0.897s Socket: closing 127.0.0.1:4245 <socket.socket fd=4, family=AddressFamily.AF_INET, type=SocketKind.SOCK_STREAM, proto=0, laddr=('127.0.0.1', 57022), raddr=('127.0.0.1', 4245)> (0 sockets open) Verifying src/gtphub/osmo-gtphub -c /build/doc/examples/osmo-gtphub/osmo-gtphub-1iface.cfg, test verify_doc Launching: PWD=/build 'src/gtphub/osmo-gtphub' '-c' '/build/doc/examples/osmo-gtphub/osmo-gtphub-1iface.cfg'
ls -l /proc/12005/fd
total 0 lr-x------ 1 build build 64 Dec 15 20:46 0 -> pipe:[34855452] l-wx------ 1 build build 64 Dec 15 20:46 1 -> pipe:[34855453] l-wx------ 1 build build 64 Dec 15 20:46 2 -> pipe:[34855454] l-wx------ 1 build build 64 Dec 15 20:46 3 -> /dev/null
ss -tn
State Recv-Q Send-Q Local Address:Port Peer Address:Port
ss -tln
State Recv-Q Send-Q Local Address:Port Peer Address:Port
ps xua | grep osmo
build 12005 1.5 0.0 54040 21100 ? S 20:46 0:00 /usr/bin/python3 /usr/local/bin/osmotestconfig.py -p /build -w /build -v build 12072 0.0 0.0 21474963656 22860 ? S 20:46 0:00 src/gtphub/osmo-gtphub -c /build/doc/examples/osmo-gtphub/osmo-gtphub-1iface.cfg build 12079 0.0 0.0 4280 712 ? S 20:46 0:00 /bin/sh -c ps xua | grep osmo build 12081 0.0 0.0 12784 968 ? S 20:46 0:00 grep osmo
Socket: in 1 tries, connected to 127.0.0.1:4253 <socket.socket fd=4, family=AddressFamily.AF_INET, type=SocketKind.SOCK_STREAM, proto=0, laddr=('127.0.0.1', 47932), raddr=('127.0.0.1', 4253)> (1 sockets open) Terminating took 0.897s Socket: closing 127.0.0.1:4253 <socket.socket fd=4, family=AddressFamily.AF_INET, type=SocketKind.SOCK_STREAM, proto=0, laddr=('127.0.0.1', 47932), raddr=('127.0.0.1', 4253)> (0 sockets open) Verifying src/gtphub/osmo-gtphub -c /build/writtenconfig/osmo-gtphub-1iface.cfg571870th, test write_config Launching: PWD=/build 'src/gtphub/osmo-gtphub' '-c' '/build/writtenconfig/osmo-gtphub-1iface.cfg571870th'
ls -l /proc/12005/fd
total 0 lr-x------ 1 build build 64 Dec 15 20:46 0 -> pipe:[34855452] l-wx------ 1 build build 64 Dec 15 20:46 1 -> pipe:[34855453] l-wx------ 1 build build 64 Dec 15 20:46 2 -> pipe:[34855454] l-wx------ 1 build build 64 Dec 15 20:46 3 -> /dev/null
ss -tn
State Recv-Q Send-Q Local Address:Port Peer Address:Port
ss -tln
State Recv-Q Send-Q Local Address:Port Peer Address:Port
ps xua | grep osmo
build 12005 1.4 0.0 54040 21100 ? S 20:46 0:00 /usr/bin/python3 /usr/local/bin/osmotestconfig.py -p /build -w /build -v build 12083 0.0 0.0 21474963656 26064 ? S 20:46 0:00 src/gtphub/osmo-gtphub -c /build/writtenconfig/osmo-gtphub-1iface.cfg571870th build 12090 0.0 0.0 4280 712 ? S 20:46 0:00 /bin/sh -c ps xua | grep osmo build 12092 0.0 0.0 12784 992 ? S 20:46 0:00 grep osmo
Socket: in 1 tries, connected to 127.0.0.1:4253 <socket.socket fd=4, family=AddressFamily.AF_INET, type=SocketKind.SOCK_STREAM, proto=0, laddr=('127.0.0.1', 47934), raddr=('127.0.0.1', 4253)> (1 sockets open) Terminating took 0.897s Socket: closing 127.0.0.1:4253 <socket.socket fd=4, family=AddressFamily.AF_INET, type=SocketKind.SOCK_STREAM, proto=0, laddr=('127.0.0.1', 47934), raddr=('127.0.0.1', 4253)> (0 sockets open) Verifying src/gtphub/osmo-gtphub -c /build/writtenconfig/osmo-gtphub-1iface.cfg571870th, test token_vty_command Launching: PWD=/build 'src/gtphub/osmo-gtphub' '-c' '/build/writtenconfig/osmo-gtphub-1iface.cfg571870th'
ls -l /proc/12005/fd
total 0 lr-x------ 1 build build 64 Dec 15 20:46 0 -> pipe:[34855452] l-wx------ 1 build build 64 Dec 15 20:46 1 -> pipe:[34855453] l-wx------ 1 build build 64 Dec 15 20:46 2 -> pipe:[34855454] l-wx------ 1 build build 64 Dec 15 20:46 3 -> /dev/null
ss -tn
State Recv-Q Send-Q Local Address:Port Peer Address:Port
ss -tln
State Recv-Q Send-Q Local Address:Port Peer Address:Port
ps xua | grep osmo
build 12005 1.3 0.0 54040 21100 ? S 20:46 0:00 /usr/bin/python3 /usr/local/bin/osmotestconfig.py -p /build -w /build -v build 12094 0.0 0.0 21474963656 23124 ? S 20:46 0:00 src/gtphub/osmo-gtphub -c /build/writtenconfig/osmo-gtphub-1iface.cfg571870th build 12101 0.0 0.0 4280 708 ? S 20:46 0:00 /bin/sh -c ps xua | grep osmo build 12103 0.0 0.0 12784 968 ? S 20:46 0:00 grep osmo
ERRORS: 1 Socket: in 1 tries, connected to 127.0.0.1:4253 <socket.socket fd=4, family=AddressFamily.AF_INET, type=SocketKind.SOCK_STREAM, proto=0, laddr=('127.0.0.1', 47936), raddr=('127.0.0.1', 4253)> (1 sockets open) Terminating took 0.897s Socket: closing 127.0.0.1:4253 <socket.socket fd=4, family=AddressFamily.AF_INET, type=SocketKind.SOCK_STREAM, proto=0, laddr=('127.0.0.1', 47936), raddr=('127.0.0.1', 4253)> (0 sockets open) make[7]: *** [vty-python-test] Error 1 Makefile:710: recipe for target 'vty-python-test' failed make[7]: Leaving directory '/build/tests' Makefile:727: recipe for target 'vty-test' failed make[6]: Leaving directory '/build/tests' make[6]: *** [vty-test] Error 2 Makefile:704: recipe for target 'python-tests' failed make[5]: Leaving directory '/build/tests' make[5]: *** [python-tests] Error 2 Makefile:735: recipe for target 'check-local' failed make[4]: Leaving directory '/build/tests' make[4]: *** [check-local] Error 2 Makefile:564: recipe for target 'check-am' failed make[3]: Leaving directory '/build/tests' make[3]: *** [check-am] Error 2 Makefile:416: recipe for target 'check-recursive' failed make[2]: Leaving directory '/build/tests' make[2]: *** [check-recursive] Error 1 Makefile:461: recipe for target 'check-recursive' failed make[1]: Leaving directory '/build' make[1]: *** [check-recursive] Error 1 Makefile:752: recipe for target 'check' failed make: *** [check] Error 2 + cat-testlogs.sh Build step 'Execute shell' marked build as failure [WARNINGS]Skipping publisher since build result is FAILURE
Changes:
------------------------------------------ [...truncated 412.18 KB...] Error was [Errno 111] Connection refused Config was ! ! OsmoGbProxy (1.6.0.108-3326) configuration saved from vty !! ! log stderr logging filter all 1 logging color 1 logging print category-hex 1 logging print category 0 logging timestamp 0 logging print file 1 logging level gprs debug logging level ns info logging level obj notice logging level lglobal notice logging level llapd notice logging level linp notice logging level lmux notice logging level lmi notice logging level lmib notice logging level lsms notice logging level lctrl notice logging level lgtp notice logging level lstats notice logging level lgsup notice logging level loap notice logging level lss7 notice logging level lsccp notice logging level lsua notice logging level lm3ua notice logging level lmgcp notice logging level ljibuf notice logging level lrspro notice logging level lns notice logging level lbssgp notice ! stats interval 5 ! line vty no login ! ns encapsulation framerelay-gre enabled 0 encapsulation udp local-ip 127.0.0.100 encapsulation udp local-port 23000 encapsulation udp use-reset-block-unblock enabled nse 101 nsvci 101 nse 101 remote-role sgsn nse 101 encapsulation udp nse 101 remote-ip 192.168.100.239 nse 101 remote-port 7777 timer tns-block 3 timer tns-block-retries 3 timer tns-reset 3 timer tns-reset-retries 3 timer tns-test 30 timer tns-alive 3 timer tns-alive-retries 10 timer tsns-prov 3 timer unknown 0x8 3 timer unknown 0x9 3 gbproxy sgsn nsei 101
State Recv-Q Send-Q Local Address:Port Peer Address:Port
ss -tln
State Recv-Q Send-Q Local Address:Port Peer Address:Port
ps xua | grep osmo
build 12007 2.0 0.0 53864 20992 ? S 00:04 0:00 /usr/bin/python3 /usr/local/bin/osmotestconfig.py -p /build -w /build -v build 12041 0.0 0.0 21475111140 29948 ? R 00:04 0:00 src/sgsn/osmo-sgsn -c /build/doc/examples/osmo-sgsn/osmo-sgsn.cfg build 12048 0.0 0.0 4280 744 ? S 00:04 0:00 /bin/sh -c ps xua | grep osmo build 12050 0.0 0.0 12784 952 ? S 00:04 0:00 grep osmo
Socket: in 1 tries, connected to 127.0.0.1:4245 <socket.socket fd=4, family=AddressFamily.AF_INET, type=SocketKind.SOCK_STREAM, proto=0, laddr=('127.0.0.1', 37146), raddr=('127.0.0.1', 4245)> (1 sockets open) Terminating took 0.897s Socket: closing 127.0.0.1:4245 <socket.socket fd=4, family=AddressFamily.AF_INET, type=SocketKind.SOCK_STREAM, proto=0, laddr=('127.0.0.1', 37146), raddr=('127.0.0.1', 4245)> (0 sockets open) Verifying src/sgsn/osmo-sgsn -c /build/writtenconfig/osmo-sgsn.cfgna1aig9a, test write_config Launching: PWD=/build 'src/sgsn/osmo-sgsn' '-c' '/build/writtenconfig/osmo-sgsn.cfgna1aig9a'
ls -l /proc/12007/fd
total 0 lr-x------ 1 build build 64 Dec 16 00:04 0 -> pipe:[566454028] l-wx------ 1 build build 64 Dec 16 00:04 1 -> pipe:[566454029] l-wx------ 1 build build 64 Dec 16 00:04 2 -> pipe:[566454030] l-wx------ 1 build build 64 Dec 16 00:04 3 -> /dev/null
ss -tn
State Recv-Q Send-Q Local Address:Port Peer Address:Port
ss -tln
State Recv-Q Send-Q Local Address:Port Peer Address:Port
ps xua | grep osmo
build 12007 1.6 0.0 54000 21080 ? S 00:04 0:00 /usr/bin/python3 /usr/local/bin/osmotestconfig.py -p /build -w /build -v build 12052 0.0 0.0 21475111140 28732 ? S 00:04 0:00 src/sgsn/osmo-sgsn -c /build/writtenconfig/osmo-sgsn.cfgna1aig9a build 12059 0.0 0.0 4280 716 ? S 00:04 0:00 /bin/sh -c ps xua | grep osmo build 12061 0.0 0.0 12784 980 ? S 00:04 0:00 grep osmo
Socket: in 1 tries, connected to 127.0.0.1:4245 <socket.socket fd=4, family=AddressFamily.AF_INET, type=SocketKind.SOCK_STREAM, proto=0, laddr=('127.0.0.1', 37148), raddr=('127.0.0.1', 4245)> (1 sockets open) Terminating took 0.897s Socket: closing 127.0.0.1:4245 <socket.socket fd=4, family=AddressFamily.AF_INET, type=SocketKind.SOCK_STREAM, proto=0, laddr=('127.0.0.1', 37148), raddr=('127.0.0.1', 4245)> (0 sockets open) Verifying src/sgsn/osmo-sgsn -c /build/writtenconfig/osmo-sgsn.cfgna1aig9a, test token_vty_command Launching: PWD=/build 'src/sgsn/osmo-sgsn' '-c' '/build/writtenconfig/osmo-sgsn.cfgna1aig9a'
ls -l /proc/12007/fd
total 0 lr-x------ 1 build build 64 Dec 16 00:04 0 -> pipe:[566454028] l-wx------ 1 build build 64 Dec 16 00:04 1 -> pipe:[566454029] l-wx------ 1 build build 64 Dec 16 00:04 2 -> pipe:[566454030] l-wx------ 1 build build 64 Dec 16 00:04 3 -> /dev/null
ss -tn
State Recv-Q Send-Q Local Address:Port Peer Address:Port
ss -tln
State Recv-Q Send-Q Local Address:Port Peer Address:Port
ps xua | grep osmo
build 12007 1.5 0.0 54000 21080 ? S 00:04 0:00 /usr/bin/python3 /usr/local/bin/osmotestconfig.py -p /build -w /build -v build 12063 0.0 0.0 21475111140 28828 ? S 00:04 0:00 src/sgsn/osmo-sgsn -c /build/writtenconfig/osmo-sgsn.cfgna1aig9a build 12070 0.0 0.0 4280 716 ? S 00:04 0:00 /bin/sh -c ps xua | grep osmo build 12072 0.0 0.0 12784 948 ? S 00:04 0:00 grep osmo
Socket: in 1 tries, connected to 127.0.0.1:4245 <socket.socket fd=4, family=AddressFamily.AF_INET, type=SocketKind.SOCK_STREAM, proto=0, laddr=('127.0.0.1', 37150), raddr=('127.0.0.1', 4245)> (1 sockets open) Terminating took 0.897s Socket: closing 127.0.0.1:4245 <socket.socket fd=4, family=AddressFamily.AF_INET, type=SocketKind.SOCK_STREAM, proto=0, laddr=('127.0.0.1', 37150), raddr=('127.0.0.1', 4245)> (0 sockets open) Verifying src/gtphub/osmo-gtphub -c /build/doc/examples/osmo-gtphub/osmo-gtphub-1iface.cfg, test verify_doc Launching: PWD=/build 'src/gtphub/osmo-gtphub' '-c' '/build/doc/examples/osmo-gtphub/osmo-gtphub-1iface.cfg'
ls -l /proc/12007/fd
total 0 lr-x------ 1 build build 64 Dec 16 00:04 0 -> pipe:[566454028] l-wx------ 1 build build 64 Dec 16 00:04 1 -> pipe:[566454029] l-wx------ 1 build build 64 Dec 16 00:04 2 -> pipe:[566454030] l-wx------ 1 build build 64 Dec 16 00:04 3 -> /dev/null
ss -tn
State Recv-Q Send-Q Local Address:Port Peer Address:Port
ss -tln
State Recv-Q Send-Q Local Address:Port Peer Address:Port
ps xua | grep osmo
build 12007 1.2 0.0 54000 21080 ? S 00:04 0:00 /usr/bin/python3 /usr/local/bin/osmotestconfig.py -p /build -w /build -v build 12074 0.0 0.0 21474963656 25396 ? S 00:04 0:00 src/gtphub/osmo-gtphub -c /build/doc/examples/osmo-gtphub/osmo-gtphub-1iface.cfg build 12081 0.0 0.0 4280 724 ? S 00:04 0:00 /bin/sh -c ps xua | grep osmo build 12083 0.0 0.0 12784 1016 ? S 00:04 0:00 grep osmo
Socket: in 1 tries, connected to 127.0.0.1:4253 <socket.socket fd=4, family=AddressFamily.AF_INET, type=SocketKind.SOCK_STREAM, proto=0, laddr=('127.0.0.1', 60950), raddr=('127.0.0.1', 4253)> (1 sockets open) Terminating took 0.897s Socket: closing 127.0.0.1:4253 <socket.socket fd=4, family=AddressFamily.AF_INET, type=SocketKind.SOCK_STREAM, proto=0, laddr=('127.0.0.1', 60950), raddr=('127.0.0.1', 4253)> (0 sockets open) Verifying src/gtphub/osmo-gtphub -c /build/writtenconfig/osmo-gtphub-1iface.cfgn06e4gui, test write_config Launching: PWD=/build 'src/gtphub/osmo-gtphub' '-c' '/build/writtenconfig/osmo-gtphub-1iface.cfgn06e4gui'
ls -l /proc/12007/fd
total 0 lr-x------ 1 build build 64 Dec 16 00:04 0 -> pipe:[566454028] l-wx------ 1 build build 64 Dec 16 00:04 1 -> pipe:[566454029] l-wx------ 1 build build 64 Dec 16 00:04 2 -> pipe:[566454030] l-wx------ 1 build build 64 Dec 16 00:04 3 -> /dev/null
ss -tn
State Recv-Q Send-Q Local Address:Port Peer Address:Port
ss -tln
State Recv-Q Send-Q Local Address:Port Peer Address:Port
ps xua | grep osmo
build 12007 1.2 0.0 54000 21080 ? S 00:04 0:00 /usr/bin/python3 /usr/local/bin/osmotestconfig.py -p /build -w /build -v build 12085 0.0 0.0 21474963656 25816 ? S 00:04 0:00 src/gtphub/osmo-gtphub -c /build/writtenconfig/osmo-gtphub-1iface.cfgn06e4gui build 12092 0.0 0.0 4280 708 ? S 00:04 0:00 /bin/sh -c ps xua | grep osmo build 12094 0.0 0.0 12784 988 ? S 00:04 0:00 grep osmo
Socket: in 1 tries, connected to 127.0.0.1:4253 <socket.socket fd=4, family=AddressFamily.AF_INET, type=SocketKind.SOCK_STREAM, proto=0, laddr=('127.0.0.1', 60952), raddr=('127.0.0.1', 4253)> (1 sockets open) Terminating took 0.897s Socket: closing 127.0.0.1:4253 <socket.socket fd=4, family=AddressFamily.AF_INET, type=SocketKind.SOCK_STREAM, proto=0, laddr=('127.0.0.1', 60952), raddr=('127.0.0.1', 4253)> (0 sockets open) Verifying src/gtphub/osmo-gtphub -c /build/writtenconfig/osmo-gtphub-1iface.cfgn06e4gui, test token_vty_command Launching: PWD=/build 'src/gtphub/osmo-gtphub' '-c' '/build/writtenconfig/osmo-gtphub-1iface.cfgn06e4gui'
ls -l /proc/12007/fd
total 0 lr-x------ 1 build build 64 Dec 16 00:04 0 -> pipe:[566454028] l-wx------ 1 build build 64 Dec 16 00:04 1 -> pipe:[566454029] l-wx------ 1 build build 64 Dec 16 00:04 2 -> pipe:[566454030] l-wx------ 1 build build 64 Dec 16 00:04 3 -> /dev/null
ss -tn
State Recv-Q Send-Q Local Address:Port Peer Address:Port
ss -tln
State Recv-Q Send-Q Local Address:Port Peer Address:Port
ps xua | grep osmo
build 12007 1.0 0.0 54000 21080 ? S 00:04 0:00 /usr/bin/python3 /usr/local/bin/osmotestconfig.py -p /build -w /build -v build 12096 0.0 0.0 21474963656 25488 ? S 00:04 0:00 src/gtphub/osmo-gtphub -c /build/writtenconfig/osmo-gtphub-1iface.cfgn06e4gui build 12103 0.0 0.0 4280 712 ? S 00:04 0:00 /bin/sh -c ps xua | grep osmo build 12105 0.0 0.0 12784 960 ? S 00:04 0:00 grep osmo
Socket: in 1 tries, connected to 127.0.0.1:4253 <socket.socket fd=4, family=AddressFamily.AF_INET, type=SocketKind.SOCK_STREAM, proto=0, laddr=('127.0.0.1', 60960), raddr=('127.0.0.1', 4253)> (1 sockets open) Terminating took 0.897s Socket: closing 127.0.0.1:4253 <socket.socket fd=4, family=AddressFamily.AF_INET, type=SocketKind.SOCK_STREAM, proto=0, laddr=('127.0.0.1', 60960), raddr=('127.0.0.1', 4253)> (0 sockets open) ERRORS: 1 make[7]: *** [vty-python-test] Error 1 Makefile:710: recipe for target 'vty-python-test' failed make[7]: Leaving directory '/build/tests' Makefile:727: recipe for target 'vty-test' failed make[6]: Leaving directory '/build/tests' make[6]: *** [vty-test] Error 2 make[5]: *** [python-tests] Error 2 Makefile:704: recipe for target 'python-tests' failed make[5]: Leaving directory '/build/tests' Makefile:735: recipe for target 'check-local' failed make[4]: *** [check-local] Error 2 make[4]: Leaving directory '/build/tests' Makefile:564: recipe for target 'check-am' failed make[3]: Leaving directory '/build/tests' make[3]: *** [check-am] Error 2 Makefile:416: recipe for target 'check-recursive' failed make[2]: Leaving directory '/build/tests' make[2]: *** [check-recursive] Error 1 Makefile:461: recipe for target 'check-recursive' failed make[1]: Leaving directory '/build' make[1]: *** [check-recursive] Error 1 Makefile:752: recipe for target 'check' failed make: *** [check] Error 2 + cat-testlogs.sh Build step 'Execute shell' marked build as failure [WARNINGS]Skipping publisher since build result is FAILURE
Changes:
------------------------------------------ [...truncated 413.70 KB...] logging filter all 1 logging color 1 logging print category-hex 1 logging print category 0 logging timestamp 0 logging print file 1 logging level gprs debug logging level ns info logging level obj notice logging level lglobal notice logging level llapd notice logging level linp notice logging level lmux notice logging level lmi notice logging level lmib notice logging level lsms notice logging level lctrl notice logging level lgtp notice logging level lstats notice logging level lgsup notice logging level loap notice logging level lss7 notice logging level lsccp notice logging level lsua notice logging level lm3ua notice logging level lmgcp notice logging level ljibuf notice logging level lrspro notice logging level lns notice logging level lbssgp notice ! stats interval 5 ! line vty no login ! ns encapsulation framerelay-gre enabled 0 encapsulation udp local-ip 127.0.0.100 encapsulation udp local-port 23000 encapsulation udp use-reset-block-unblock enabled nse 101 nsvci 101 nse 101 remote-role sgsn nse 101 encapsulation udp nse 101 remote-ip 192.168.100.239 nse 101 remote-port 7777 timer tns-block 3 timer tns-block-retries 3 timer tns-reset 3 timer tns-reset-retries 3 timer tns-test 30 timer tns-alive 3 timer tns-alive-retries 10 timer tsns-prov 3 timer unknown 0x8 3 timer unknown 0x9 3 gbproxy sgsn nsei 101
ss -tn
State Recv-Q Send-Q Local Address:Port Peer Address:Port
ss -tln
State Recv-Q Send-Q Local Address:Port Peer Address:Port
ps xua | grep osmo
build 12228 2.1 0.0 53908 21208 ? S 00:06 0:00 /usr/bin/python3 /usr/local/bin/osmotestconfig.py -p /build -w /build -v build 12262 0.0 0.1 21475044960 38412 ? R 00:06 0:00 src/sgsn/osmo-sgsn -c /build/doc/examples/osmo-sgsn/osmo-sgsn.cfg build 12269 0.0 0.0 4280 736 ? S 00:06 0:00 /bin/sh -c ps xua | grep osmo build 12271 0.0 0.0 12784 936 ? S 00:06 0:00 grep osmo
Socket: in 1 tries, connected to 127.0.0.1:4245 <socket.socket fd=4, family=AddressFamily.AF_INET, type=SocketKind.SOCK_STREAM, proto=0, laddr=('127.0.0.1', 58140), raddr=('127.0.0.1', 4245)> (1 sockets open) Terminating took 0.897s Socket: closing 127.0.0.1:4245 <socket.socket fd=4, family=AddressFamily.AF_INET, type=SocketKind.SOCK_STREAM, proto=0, laddr=('127.0.0.1', 58140), raddr=('127.0.0.1', 4245)> (0 sockets open) Verifying src/sgsn/osmo-sgsn -c /build/writtenconfig/osmo-sgsn.cfgaxi1fefs, test write_config Launching: PWD=/build 'src/sgsn/osmo-sgsn' '-c' '/build/writtenconfig/osmo-sgsn.cfgaxi1fefs'
ls -l /proc/12228/fd
total 0 lr-x------ 1 build build 64 Dec 16 00:06 0 -> pipe:[35556812] l-wx------ 1 build build 64 Dec 16 00:06 1 -> pipe:[35556813] l-wx------ 1 build build 64 Dec 16 00:06 2 -> pipe:[35556814] l-wx------ 1 build build 64 Dec 16 00:06 3 -> /dev/null
ss -tn
State Recv-Q Send-Q Local Address:Port Peer Address:Port
ss -tln
State Recv-Q Send-Q Local Address:Port Peer Address:Port
ps xua | grep osmo
build 12228 1.9 0.0 54040 21296 ? S 00:06 0:00 /usr/bin/python3 /usr/local/bin/osmotestconfig.py -p /build -w /build -v build 12273 0.0 0.1 21475044960 32880 ? R 00:06 0:00 src/sgsn/osmo-sgsn -c /build/writtenconfig/osmo-sgsn.cfgaxi1fefs build 12280 0.0 0.0 4280 708 ? S 00:06 0:00 /bin/sh -c ps xua | grep osmo build 12282 0.0 0.0 8868 372 ? R 00:06 0:00 grep osmo
Socket: in 1 tries, connected to 127.0.0.1:4245 <socket.socket fd=4, family=AddressFamily.AF_INET, type=SocketKind.SOCK_STREAM, proto=0, laddr=('127.0.0.1', 58142), raddr=('127.0.0.1', 4245)> (1 sockets open) Terminating took 0.897s Socket: closing 127.0.0.1:4245 <socket.socket fd=4, family=AddressFamily.AF_INET, type=SocketKind.SOCK_STREAM, proto=0, laddr=('127.0.0.1', 58142), raddr=('127.0.0.1', 4245)> (0 sockets open) Verifying src/sgsn/osmo-sgsn -c /build/writtenconfig/osmo-sgsn.cfgaxi1fefs, test token_vty_command Launching: PWD=/build 'src/sgsn/osmo-sgsn' '-c' '/build/writtenconfig/osmo-sgsn.cfgaxi1fefs'
ls -l /proc/12228/fd
total 0 lr-x------ 1 build build 64 Dec 16 00:06 0 -> pipe:[35556812] l-wx------ 1 build build 64 Dec 16 00:06 1 -> pipe:[35556813] l-wx------ 1 build build 64 Dec 16 00:06 2 -> pipe:[35556814] l-wx------ 1 build build 64 Dec 16 00:06 3 -> /dev/null
ss -tn
State Recv-Q Send-Q Local Address:Port Peer Address:Port
ss -tln
State Recv-Q Send-Q Local Address:Port Peer Address:Port LISTEN 0 10 127.0.0.1:4245 *:* LISTEN 0 10 127.0.0.1:4251 *:*
ps xua | grep osmo
build 12228 1.3 0.0 54040 21296 ? S 00:06 0:00 /usr/bin/python3 /usr/local/bin/osmotestconfig.py -p /build -w /build -v build 12284 0.0 0.0 21475111140 31940 ? S 00:06 0:00 src/sgsn/osmo-sgsn -c /build/writtenconfig/osmo-sgsn.cfgaxi1fefs build 12291 0.0 0.0 4280 716 ? S 00:06 0:00 /bin/sh -c ps xua | grep osmo build 12293 0.0 0.0 12784 944 ? S 00:06 0:00 grep osmo
Socket: in 1 tries, connected to 127.0.0.1:4245 <socket.socket fd=4, family=AddressFamily.AF_INET, type=SocketKind.SOCK_STREAM, proto=0, laddr=('127.0.0.1', 58148), raddr=('127.0.0.1', 4245)> (1 sockets open) Terminating took 0.897s Socket: closing 127.0.0.1:4245 <socket.socket fd=4, family=AddressFamily.AF_INET, type=SocketKind.SOCK_STREAM, proto=0, laddr=('127.0.0.1', 58148), raddr=('127.0.0.1', 4245)> (0 sockets open) Verifying src/gtphub/osmo-gtphub -c /build/doc/examples/osmo-gtphub/osmo-gtphub-1iface.cfg, test verify_doc Launching: PWD=/build 'src/gtphub/osmo-gtphub' '-c' '/build/doc/examples/osmo-gtphub/osmo-gtphub-1iface.cfg'
ls -l /proc/12228/fd
total 0 lr-x------ 1 build build 64 Dec 16 00:06 0 -> pipe:[35556812] l-wx------ 1 build build 64 Dec 16 00:06 1 -> pipe:[35556813] l-wx------ 1 build build 64 Dec 16 00:06 2 -> pipe:[35556814] l-wx------ 1 build build 64 Dec 16 00:06 3 -> /dev/null
ss -tn
State Recv-Q Send-Q Local Address:Port Peer Address:Port
ss -tln
State Recv-Q Send-Q Local Address:Port Peer Address:Port LISTEN 0 10 127.0.0.1:4253 *:*
ps xua | grep osmo
build 12228 1.2 0.0 54040 21296 ? S 00:06 0:00 /usr/bin/python3 /usr/local/bin/osmotestconfig.py -p /build -w /build -v build 12295 0.0 0.0 21474963656 23564 ? S 00:06 0:00 src/gtphub/osmo-gtphub -c /build/doc/examples/osmo-gtphub/osmo-gtphub-1iface.cfg build 12302 0.0 0.0 4280 740 ? S 00:06 0:00 /bin/sh -c ps xua | grep osmo build 12304 0.0 0.0 12784 932 ? S 00:06 0:00 grep osmo
Socket: in 1 tries, connected to 127.0.0.1:4253 <socket.socket fd=4, family=AddressFamily.AF_INET, type=SocketKind.SOCK_STREAM, proto=0, laddr=('127.0.0.1', 49062), raddr=('127.0.0.1', 4253)> (1 sockets open) Terminating took 0.897s Socket: closing 127.0.0.1:4253 <socket.socket fd=4, family=AddressFamily.AF_INET, type=SocketKind.SOCK_STREAM, proto=0, laddr=('127.0.0.1', 49062), raddr=('127.0.0.1', 4253)> (0 sockets open) Verifying src/gtphub/osmo-gtphub -c /build/writtenconfig/osmo-gtphub-1iface.cfgcco8dcfr, test write_config Launching: PWD=/build 'src/gtphub/osmo-gtphub' '-c' '/build/writtenconfig/osmo-gtphub-1iface.cfgcco8dcfr'
ls -l /proc/12228/fd
total 0 lr-x------ 1 build build 64 Dec 16 00:06 0 -> pipe:[35556812] l-wx------ 1 build build 64 Dec 16 00:06 1 -> pipe:[35556813] l-wx------ 1 build build 64 Dec 16 00:06 2 -> pipe:[35556814] l-wx------ 1 build build 64 Dec 16 00:06 3 -> /dev/null
ss -tn
State Recv-Q Send-Q Local Address:Port Peer Address:Port
ss -tln
State Recv-Q Send-Q Local Address:Port Peer Address:Port LISTEN 0 10 127.0.0.1:4253 *:*
ps xua | grep osmo
build 12228 1.2 0.0 54040 21296 ? S 00:06 0:00 /usr/bin/python3 /usr/local/bin/osmotestconfig.py -p /build -w /build -v build 12306 0.0 0.0 21474963656 22820 ? S 00:06 0:00 src/gtphub/osmo-gtphub -c /build/writtenconfig/osmo-gtphub-1iface.cfgcco8dcfr build 12313 0.0 0.0 4280 768 ? S 00:06 0:00 /bin/sh -c ps xua | grep osmo build 12315 0.0 0.0 12784 984 ? S 00:06 0:00 grep osmo
Socket: in 1 tries, connected to 127.0.0.1:4253 <socket.socket fd=4, family=AddressFamily.AF_INET, type=SocketKind.SOCK_STREAM, proto=0, laddr=('127.0.0.1', 49066), raddr=('127.0.0.1', 4253)> (1 sockets open) Terminating took 0.897s Socket: closing 127.0.0.1:4253 <socket.socket fd=4, family=AddressFamily.AF_INET, type=SocketKind.SOCK_STREAM, proto=0, laddr=('127.0.0.1', 49066), raddr=('127.0.0.1', 4253)> (0 sockets open) Verifying src/gtphub/osmo-gtphub -c /build/writtenconfig/osmo-gtphub-1iface.cfgcco8dcfr, test token_vty_command Launching: PWD=/build 'src/gtphub/osmo-gtphub' '-c' '/build/writtenconfig/osmo-gtphub-1iface.cfgcco8dcfr'
ls -l /proc/12228/fd
total 0 lr-x------ 1 build build 64 Dec 16 00:06 0 -> pipe:[35556812] l-wx------ 1 build build 64 Dec 16 00:06 1 -> pipe:[35556813] l-wx------ 1 build build 64 Dec 16 00:06 2 -> pipe:[35556814] l-wx------ 1 build build 64 Dec 16 00:06 3 -> /dev/null
ss -tn
State Recv-Q Send-Q Local Address:Port Peer Address:Port
ss -tln
State Recv-Q Send-Q Local Address:Port Peer Address:Port
ps xua | grep osmo
build 12228 0.8 0.0 54040 21296 ? S 00:06 0:00 /usr/bin/python3 /usr/local/bin/osmotestconfig.py -p /build -w /build -v build 12317 0.0 0.0 21474963656 24356 ? S 00:06 0:00 src/gtphub/osmo-gtphub -c /build/writtenconfig/osmo-gtphub-1iface.cfgcco8dcfr build 12324 0.0 0.0 4280 712 ? S 00:06 0:00 /bin/sh -c ps xua | grep osmo build 12326 0.0 0.0 12784 928 ? S 00:06 0:00 grep osmo
ERRORS: 1 Socket: in 1 tries, connected to 127.0.0.1:4253 <socket.socket fd=4, family=AddressFamily.AF_INET, type=SocketKind.SOCK_STREAM, proto=0, laddr=('127.0.0.1', 49076), raddr=('127.0.0.1', 4253)> (1 sockets open) Terminating took 0.897s Socket: closing 127.0.0.1:4253 <socket.socket fd=4, family=AddressFamily.AF_INET, type=SocketKind.SOCK_STREAM, proto=0, laddr=('127.0.0.1', 49076), raddr=('127.0.0.1', 4253)> (0 sockets open) make[7]: *** [vty-python-test] Error 1 Makefile:710: recipe for target 'vty-python-test' failed make[7]: Leaving directory '/build/tests' Makefile:727: recipe for target 'vty-test' failed make[6]: Leaving directory '/build/tests' make[6]: *** [vty-test] Error 2 make[5]: *** [python-tests] Error 2 Makefile:704: recipe for target 'python-tests' failed make[5]: Leaving directory '/build/tests' Makefile:735: recipe for target 'check-local' failed make[4]: Leaving directory '/build/tests' make[4]: *** [check-local] Error 2 make[3]: *** [check-am] Error 2 Makefile:564: recipe for target 'check-am' failed make[3]: Leaving directory '/build/tests' make[2]: *** [check-recursive] Error 1 Makefile:416: recipe for target 'check-recursive' failed make[2]: Leaving directory '/build/tests' Makefile:461: recipe for target 'check-recursive' failed make[1]: *** [check-recursive] Error 1 make[1]: Leaving directory '/build' Makefile:752: recipe for target 'check' failed make: *** [check] Error 2 + cat-testlogs.sh Build step 'Execute shell' marked build as failure [WARNINGS]Skipping publisher since build result is FAILURE
Changes:
------------------------------------------ [...truncated 383.15 KB...] ! OsmoGbProxy (1.6.0.108-3326) configuration saved from vty !! ! log stderr logging filter all 1 logging color 1 logging print category-hex 1 logging print category 0 logging timestamp 0 logging print file 1 logging level gprs debug logging level ns info logging level obj notice logging level lglobal notice logging level llapd notice logging level linp notice logging level lmux notice logging level lmi notice logging level lmib notice logging level lsms notice logging level lctrl notice logging level lgtp notice logging level lstats notice logging level lgsup notice logging level loap notice logging level lss7 notice logging level lsccp notice logging level lsua notice logging level lm3ua notice logging level lmgcp notice logging level ljibuf notice logging level lrspro notice logging level lns notice logging level lbssgp notice ! stats interval 5 ! line vty no login ! ns encapsulation framerelay-gre enabled 0 encapsulation udp local-ip 127.0.0.100 encapsulation udp local-port 23000 encapsulation udp use-reset-block-unblock enabled nse 101 nsvci 101 nse 101 remote-role sgsn nse 101 encapsulation udp nse 101 remote-ip 192.168.100.239 nse 101 remote-port 7777 timer tns-block 3 timer tns-block-retries 3 timer tns-reset 3 timer tns-reset-retries 3 timer tns-test 30 timer tns-alive 3 timer tns-alive-retries 10 timer tsns-prov 3 timer unknown 0x8 3 timer unknown 0x9 3 gbproxy sgsn nsei 101
State Recv-Q Send-Q Local Address:Port Peer Address:Port
ss -tln
State Recv-Q Send-Q Local Address:Port Peer Address:Port
ps xua | grep osmo
build 12245 3.0 0.0 53908 20936 ? S 00:08 0:00 /usr/bin/python3 /usr/local/bin/osmotestconfig.py -p /build -w /build -v build 12279 0.0 0.0 21475111140 18004 ? S 00:08 0:00 src/sgsn/osmo-sgsn -c /build/doc/examples/osmo-sgsn/osmo-sgsn.cfg build 12286 0.0 0.0 4280 760 ? S 00:08 0:00 /bin/sh -c ps xua | grep osmo build 12288 0.0 0.0 12784 1024 ? S 00:08 0:00 grep osmo
Socket: in 1 tries, connected to 127.0.0.1:4245 <socket.socket fd=4, family=AddressFamily.AF_INET, type=SocketKind.SOCK_STREAM, proto=0, laddr=('127.0.0.1', 37698), raddr=('127.0.0.1', 4245)> (1 sockets open) Terminating took 0.897s Socket: closing 127.0.0.1:4245 <socket.socket fd=4, family=AddressFamily.AF_INET, type=SocketKind.SOCK_STREAM, proto=0, laddr=('127.0.0.1', 37698), raddr=('127.0.0.1', 4245)> (0 sockets open) Verifying src/sgsn/osmo-sgsn -c /build/writtenconfig/osmo-sgsn.cfg178k01yi, test write_config Launching: PWD=/build 'src/sgsn/osmo-sgsn' '-c' '/build/writtenconfig/osmo-sgsn.cfg178k01yi'
ls -l /proc/12245/fd
total 0 lr-x------ 1 build build 64 Dec 16 00:08 0 -> pipe:[566751120] l-wx------ 1 build build 64 Dec 16 00:08 1 -> pipe:[566751121] l-wx------ 1 build build 64 Dec 16 00:08 2 -> pipe:[566751122] l-wx------ 1 build build 64 Dec 16 00:08 3 -> /dev/null
ss -tn
State Recv-Q Send-Q Local Address:Port Peer Address:Port
ss -tln
State Recv-Q Send-Q Local Address:Port Peer Address:Port
ps xua | grep osmo
build 12245 2.7 0.0 54044 21028 ? S 00:08 0:00 /usr/bin/python3 /usr/local/bin/osmotestconfig.py -p /build -w /build -v build 12290 0.0 0.0 21475111140 18060 ? R 00:08 0:00 src/sgsn/osmo-sgsn -c /build/writtenconfig/osmo-sgsn.cfg178k01yi build 12297 0.0 0.0 4280 712 ? S 00:08 0:00 /bin/sh -c ps xua | grep osmo build 12299 0.0 0.0 12784 960 ? S 00:08 0:00 grep osmo
Socket: in 1 tries, connected to 127.0.0.1:4245 <socket.socket fd=4, family=AddressFamily.AF_INET, type=SocketKind.SOCK_STREAM, proto=0, laddr=('127.0.0.1', 37704), raddr=('127.0.0.1', 4245)> (1 sockets open) Terminating took 0.897s Socket: closing 127.0.0.1:4245 <socket.socket fd=4, family=AddressFamily.AF_INET, type=SocketKind.SOCK_STREAM, proto=0, laddr=('127.0.0.1', 37704), raddr=('127.0.0.1', 4245)> (0 sockets open) Verifying src/sgsn/osmo-sgsn -c /build/writtenconfig/osmo-sgsn.cfg178k01yi, test token_vty_command Launching: PWD=/build 'src/sgsn/osmo-sgsn' '-c' '/build/writtenconfig/osmo-sgsn.cfg178k01yi'
ls -l /proc/12245/fd
total 0 lr-x------ 1 build build 64 Dec 16 00:08 0 -> pipe:[566751120] l-wx------ 1 build build 64 Dec 16 00:08 1 -> pipe:[566751121] l-wx------ 1 build build 64 Dec 16 00:08 2 -> pipe:[566751122] l-wx------ 1 build build 64 Dec 16 00:08 3 -> /dev/null
ss -tn
State Recv-Q Send-Q Local Address:Port Peer Address:Port
ss -tln
State Recv-Q Send-Q Local Address:Port Peer Address:Port
ps xua | grep osmo
build 12245 2.1 0.0 54044 21028 ? S 00:08 0:00 /usr/bin/python3 /usr/local/bin/osmotestconfig.py -p /build -w /build -v build 12301 0.0 0.0 21475044960 24644 ? R 00:08 0:00 src/sgsn/osmo-sgsn -c /build/writtenconfig/osmo-sgsn.cfg178k01yi build 12308 0.0 0.0 4280 712 ? S 00:08 0:00 /bin/sh -c ps xua | grep osmo build 12310 0.0 0.0 12784 932 ? S 00:08 0:00 grep osmo
Socket: in 1 tries, connected to 127.0.0.1:4245 <socket.socket fd=4, family=AddressFamily.AF_INET, type=SocketKind.SOCK_STREAM, proto=0, laddr=('127.0.0.1', 37706), raddr=('127.0.0.1', 4245)> (1 sockets open) Terminating took 0.897s Socket: closing 127.0.0.1:4245 <socket.socket fd=4, family=AddressFamily.AF_INET, type=SocketKind.SOCK_STREAM, proto=0, laddr=('127.0.0.1', 37706), raddr=('127.0.0.1', 4245)> (0 sockets open) Verifying src/gtphub/osmo-gtphub -c /build/doc/examples/osmo-gtphub/osmo-gtphub-1iface.cfg, test verify_doc Launching: PWD=/build 'src/gtphub/osmo-gtphub' '-c' '/build/doc/examples/osmo-gtphub/osmo-gtphub-1iface.cfg'
ls -l /proc/12245/fd
total 0 lr-x------ 1 build build 64 Dec 16 00:08 0 -> pipe:[566751120] l-wx------ 1 build build 64 Dec 16 00:08 1 -> pipe:[566751121] l-wx------ 1 build build 64 Dec 16 00:08 2 -> pipe:[566751122] l-wx------ 1 build build 64 Dec 16 00:08 3 -> /dev/null
ss -tn
State Recv-Q Send-Q Local Address:Port Peer Address:Port
ss -tln
State Recv-Q Send-Q Local Address:Port Peer Address:Port LISTEN 0 10 127.0.0.1:4253 *:*
ps xua | grep osmo
build 12245 2.0 0.0 54044 21028 ? S 00:08 0:00 /usr/bin/python3 /usr/local/bin/osmotestconfig.py -p /build -w /build -v build 12312 0.0 0.0 21474963656 14328 ? S 00:08 0:00 src/gtphub/osmo-gtphub -c /build/doc/examples/osmo-gtphub/osmo-gtphub-1iface.cfg build 12319 0.0 0.0 4280 716 ? S 00:08 0:00 /bin/sh -c ps xua | grep osmo build 12321 0.0 0.0 4280 88 ? R 00:08 0:00 /bin/sh -c ps xua | grep osmo
Socket: in 1 tries, connected to 127.0.0.1:4253 <socket.socket fd=4, family=AddressFamily.AF_INET, type=SocketKind.SOCK_STREAM, proto=0, laddr=('127.0.0.1', 33282), raddr=('127.0.0.1', 4253)> (1 sockets open) Terminating took 0.897s Socket: closing 127.0.0.1:4253 <socket.socket fd=4, family=AddressFamily.AF_INET, type=SocketKind.SOCK_STREAM, proto=0, laddr=('127.0.0.1', 33282), raddr=('127.0.0.1', 4253)> (0 sockets open) Verifying src/gtphub/osmo-gtphub -c /build/writtenconfig/osmo-gtphub-1iface.cfgpev2eiqf, test write_config Launching: PWD=/build 'src/gtphub/osmo-gtphub' '-c' '/build/writtenconfig/osmo-gtphub-1iface.cfgpev2eiqf'
ls -l /proc/12245/fd
total 0 lr-x------ 1 build build 64 Dec 16 00:08 0 -> pipe:[566751120] l-wx------ 1 build build 64 Dec 16 00:08 1 -> pipe:[566751121] l-wx------ 1 build build 64 Dec 16 00:08 2 -> pipe:[566751122] l-wx------ 1 build build 64 Dec 16 00:08 3 -> /dev/null
ss -tn
State Recv-Q Send-Q Local Address:Port Peer Address:Port
ss -tln
State Recv-Q Send-Q Local Address:Port Peer Address:Port LISTEN 0 10 127.0.0.1:4253 *:*
ps xua | grep osmo
build 12245 1.6 0.0 54044 21028 ? S 00:08 0:00 /usr/bin/python3 /usr/local/bin/osmotestconfig.py -p /build -w /build -v build 12323 0.0 0.0 21474963656 14292 ? S 00:08 0:00 src/gtphub/osmo-gtphub -c /build/writtenconfig/osmo-gtphub-1iface.cfgpev2eiqf build 12330 0.0 0.0 4280 744 ? S 00:08 0:00 /bin/sh -c ps xua | grep osmo build 12332 0.0 0.0 12784 976 ? S 00:08 0:00 grep osmo
Socket: in 1 tries, connected to 127.0.0.1:4253 <socket.socket fd=4, family=AddressFamily.AF_INET, type=SocketKind.SOCK_STREAM, proto=0, laddr=('127.0.0.1', 33284), raddr=('127.0.0.1', 4253)> (1 sockets open) Terminating took 0.897s Socket: closing 127.0.0.1:4253 <socket.socket fd=4, family=AddressFamily.AF_INET, type=SocketKind.SOCK_STREAM, proto=0, laddr=('127.0.0.1', 33284), raddr=('127.0.0.1', 4253)> (0 sockets open) Verifying src/gtphub/osmo-gtphub -c /build/writtenconfig/osmo-gtphub-1iface.cfgpev2eiqf, test token_vty_command Launching: PWD=/build 'src/gtphub/osmo-gtphub' '-c' '/build/writtenconfig/osmo-gtphub-1iface.cfgpev2eiqf'
ls -l /proc/12245/fd
total 0 lr-x------ 1 build build 64 Dec 16 00:08 0 -> pipe:[566751120] l-wx------ 1 build build 64 Dec 16 00:08 1 -> pipe:[566751121] l-wx------ 1 build build 64 Dec 16 00:08 2 -> pipe:[566751122] l-wx------ 1 build build 64 Dec 16 00:08 3 -> /dev/null
ss -tn
State Recv-Q Send-Q Local Address:Port Peer Address:Port
ss -tln
State Recv-Q Send-Q Local Address:Port Peer Address:Port LISTEN 0 10 127.0.0.1:4253 *:*
ps xua | grep osmo
build 12245 1.6 0.0 54044 21028 ? S 00:08 0:00 /usr/bin/python3 /usr/local/bin/osmotestconfig.py -p /build -w /build -v build 12334 0.0 0.0 21474963656 14292 ? S 00:08 0:00 src/gtphub/osmo-gtphub -c /build/writtenconfig/osmo-gtphub-1iface.cfgpev2eiqf build 12341 0.0 0.0 4280 756 ? S 00:08 0:00 /bin/sh -c ps xua | grep osmo build 12343 0.0 0.0 12784 972 ? S 00:08 0:00 grep osmo
ERRORS: 1 Socket: in 1 tries, connected to 127.0.0.1:4253 <socket.socket fd=4, family=AddressFamily.AF_INET, type=SocketKind.SOCK_STREAM, proto=0, laddr=('127.0.0.1', 33290), raddr=('127.0.0.1', 4253)> (1 sockets open) Terminating took 0.897s Socket: closing 127.0.0.1:4253 <socket.socket fd=4, family=AddressFamily.AF_INET, type=SocketKind.SOCK_STREAM, proto=0, laddr=('127.0.0.1', 33290), raddr=('127.0.0.1', 4253)> (0 sockets open) Makefile:710: recipe for target 'vty-python-test' failed make[7]: Leaving directory '/build/tests' make[7]: *** [vty-python-test] Error 1 make[6]: *** [vty-test] Error 2 Makefile:727: recipe for target 'vty-test' failed make[6]: Leaving directory '/build/tests' Makefile:704: recipe for target 'python-tests' failed make[5]: Leaving directory '/build/tests' make[5]: *** [python-tests] Error 2 Makefile:735: recipe for target 'check-local' failed make[4]: *** [check-local] Error 2 make[4]: Leaving directory '/build/tests' Makefile:564: recipe for target 'check-am' failed make[3]: *** [check-am] Error 2 make[3]: Leaving directory '/build/tests' Makefile:416: recipe for target 'check-recursive' failed make[2]: Leaving directory '/build/tests' make[2]: *** [check-recursive] Error 1 Makefile:461: recipe for target 'check-recursive' failed make[1]: *** [check-recursive] Error 1 make[1]: Leaving directory '/build' make: *** [check] Error 2 Makefile:752: recipe for target 'check' failed + cat-testlogs.sh Build step 'Execute shell' marked build as failure [WARNINGS]Skipping publisher since build result is FAILURE
Changes:
------------------------------------------ [...truncated 414.84 KB...] logging color 1 logging print category-hex 1 logging print category 0 logging timestamp 0 logging print file 1 logging level gprs debug logging level ns info logging level obj notice logging level lglobal notice logging level llapd notice logging level linp notice logging level lmux notice logging level lmi notice logging level lmib notice logging level lsms notice logging level lctrl notice logging level lgtp notice logging level lstats notice logging level lgsup notice logging level loap notice logging level lss7 notice logging level lsccp notice logging level lsua notice logging level lm3ua notice logging level lmgcp notice logging level ljibuf notice logging level lrspro notice logging level lns notice logging level lbssgp notice ! stats interval 5 ! line vty no login ! ns encapsulation framerelay-gre enabled 0 encapsulation udp local-ip 127.0.0.100 encapsulation udp local-port 23000 encapsulation udp use-reset-block-unblock enabled nse 101 nsvci 101 nse 101 remote-role sgsn nse 101 encapsulation udp nse 101 remote-ip 192.168.100.239 nse 101 remote-port 7777 timer tns-block 3 timer tns-block-retries 3 timer tns-reset 3 timer tns-reset-retries 3 timer tns-test 30 timer tns-alive 3 timer tns-alive-retries 10 timer tsns-prov 3 timer unknown 0x8 3 timer unknown 0x9 3 gbproxy sgsn nsei 101
ss -tn
State Recv-Q Send-Q Local Address:Port Peer Address:Port
ss -tln
State Recv-Q Send-Q Local Address:Port Peer Address:Port LISTEN 0 10 127.0.0.1:4245 *:* LISTEN 0 10 127.0.0.1:4251 *:*
ps xua | grep osmo
build 12228 1.6 0.0 53864 21168 ? S 00:14 0:00 /usr/bin/python3 /usr/local/bin/osmotestconfig.py -p /build -w /build -v build 12262 0.0 0.0 21475111140 31736 ? S 00:14 0:00 src/sgsn/osmo-sgsn -c /build/doc/examples/osmo-sgsn/osmo-sgsn.cfg build 12269 0.0 0.0 4280 744 ? S 00:14 0:00 /bin/sh -c ps xua | grep osmo build 12271 0.0 0.0 4280 84 ? R 00:14 0:00 /bin/sh -c ps xua | grep osmo
Socket: in 1 tries, connected to 127.0.0.1:4245 <socket.socket fd=4, family=AddressFamily.AF_INET, type=SocketKind.SOCK_STREAM, proto=0, laddr=('127.0.0.1', 58548), raddr=('127.0.0.1', 4245)> (1 sockets open) Terminating took 0.897s Socket: closing 127.0.0.1:4245 <socket.socket fd=4, family=AddressFamily.AF_INET, type=SocketKind.SOCK_STREAM, proto=0, laddr=('127.0.0.1', 58548), raddr=('127.0.0.1', 4245)> (0 sockets open) Verifying src/sgsn/osmo-sgsn -c /build/writtenconfig/osmo-sgsn.cfgzdvsqta2, test write_config Launching: PWD=/build 'src/sgsn/osmo-sgsn' '-c' '/build/writtenconfig/osmo-sgsn.cfgzdvsqta2'
ls -l /proc/12228/fd
total 0 lr-x------ 1 build build 64 Dec 16 00:14 0 -> pipe:[35998787] l-wx------ 1 build build 64 Dec 16 00:14 1 -> pipe:[35998788] l-wx------ 1 build build 64 Dec 16 00:14 2 -> pipe:[35998789] l-wx------ 1 build build 64 Dec 16 00:14 3 -> /dev/null
ss -tn
State Recv-Q Send-Q Local Address:Port Peer Address:Port
ss -tln
State Recv-Q Send-Q Local Address:Port Peer Address:Port
ps xua | grep osmo
build 12228 1.3 0.0 54000 21256 ? S 00:14 0:00 /usr/bin/python3 /usr/local/bin/osmotestconfig.py -p /build -w /build -v build 12273 0.0 0.0 21475111140 31552 ? S 00:14 0:00 src/sgsn/osmo-sgsn -c /build/writtenconfig/osmo-sgsn.cfgzdvsqta2 build 12280 0.0 0.0 4280 704 ? S 00:14 0:00 /bin/sh -c ps xua | grep osmo build 12282 0.0 0.0 12784 1024 ? S 00:14 0:00 grep osmo
Socket: in 1 tries, connected to 127.0.0.1:4245 <socket.socket fd=4, family=AddressFamily.AF_INET, type=SocketKind.SOCK_STREAM, proto=0, laddr=('127.0.0.1', 58550), raddr=('127.0.0.1', 4245)> (1 sockets open) Terminating took 0.897s Socket: closing 127.0.0.1:4245 <socket.socket fd=4, family=AddressFamily.AF_INET, type=SocketKind.SOCK_STREAM, proto=0, laddr=('127.0.0.1', 58550), raddr=('127.0.0.1', 4245)> (0 sockets open) Verifying src/sgsn/osmo-sgsn -c /build/writtenconfig/osmo-sgsn.cfgzdvsqta2, test token_vty_command Launching: PWD=/build 'src/sgsn/osmo-sgsn' '-c' '/build/writtenconfig/osmo-sgsn.cfgzdvsqta2'
ls -l /proc/12228/fd
total 0 lr-x------ 1 build build 64 Dec 16 00:14 0 -> pipe:[35998787] l-wx------ 1 build build 64 Dec 16 00:14 1 -> pipe:[35998788] l-wx------ 1 build build 64 Dec 16 00:14 2 -> pipe:[35998789] l-wx------ 1 build build 64 Dec 16 00:14 3 -> /dev/null
ss -tn
State Recv-Q Send-Q Local Address:Port Peer Address:Port
ss -tln
State Recv-Q Send-Q Local Address:Port Peer Address:Port LISTEN 0 10 127.0.0.1:4245 *:* LISTEN 0 10 127.0.0.1:4251 *:*
ps xua | grep osmo
build 12228 1.1 0.0 54000 21256 ? S 00:14 0:00 /usr/bin/python3 /usr/local/bin/osmotestconfig.py -p /build -w /build -v build 12284 0.0 0.0 21475111140 29968 ? S 00:14 0:00 src/sgsn/osmo-sgsn -c /build/writtenconfig/osmo-sgsn.cfgzdvsqta2 build 12291 0.0 0.0 4280 696 ? S 00:14 0:00 /bin/sh -c ps xua | grep osmo build 12293 0.0 0.0 12784 960 ? R 00:14 0:00 grep osmo
Socket: in 1 tries, connected to 127.0.0.1:4245 <socket.socket fd=4, family=AddressFamily.AF_INET, type=SocketKind.SOCK_STREAM, proto=0, laddr=('127.0.0.1', 58554), raddr=('127.0.0.1', 4245)> (1 sockets open) Terminating took 0.897s Socket: closing 127.0.0.1:4245 <socket.socket fd=4, family=AddressFamily.AF_INET, type=SocketKind.SOCK_STREAM, proto=0, laddr=('127.0.0.1', 58554), raddr=('127.0.0.1', 4245)> (0 sockets open) Verifying src/gtphub/osmo-gtphub -c /build/doc/examples/osmo-gtphub/osmo-gtphub-1iface.cfg, test verify_doc Launching: PWD=/build 'src/gtphub/osmo-gtphub' '-c' '/build/doc/examples/osmo-gtphub/osmo-gtphub-1iface.cfg'
ls -l /proc/12228/fd
total 0 lr-x------ 1 build build 64 Dec 16 00:14 0 -> pipe:[35998787] l-wx------ 1 build build 64 Dec 16 00:14 1 -> pipe:[35998788] l-wx------ 1 build build 64 Dec 16 00:14 2 -> pipe:[35998789] l-wx------ 1 build build 64 Dec 16 00:14 3 -> /dev/null
ss -tn
State Recv-Q Send-Q Local Address:Port Peer Address:Port
ss -tln
State Recv-Q Send-Q Local Address:Port Peer Address:Port
ps xua | grep osmo
build 12228 1.0 0.0 54000 21256 ? S 00:14 0:00 /usr/bin/python3 /usr/local/bin/osmotestconfig.py -p /build -w /build -v build 12295 0.0 0.0 21474963656 24636 ? S 00:14 0:00 src/gtphub/osmo-gtphub -c /build/doc/examples/osmo-gtphub/osmo-gtphub-1iface.cfg build 12302 0.0 0.0 4280 760 ? S 00:14 0:00 /bin/sh -c ps xua | grep osmo build 12304 0.0 0.0 12784 972 ? S 00:14 0:00 grep osmo
Socket: in 1 tries, connected to 127.0.0.1:4253 <socket.socket fd=4, family=AddressFamily.AF_INET, type=SocketKind.SOCK_STREAM, proto=0, laddr=('127.0.0.1', 49464), raddr=('127.0.0.1', 4253)> (1 sockets open) Terminating took 0.897s Socket: closing 127.0.0.1:4253 <socket.socket fd=4, family=AddressFamily.AF_INET, type=SocketKind.SOCK_STREAM, proto=0, laddr=('127.0.0.1', 49464), raddr=('127.0.0.1', 4253)> (0 sockets open) Verifying src/gtphub/osmo-gtphub -c /build/writtenconfig/osmo-gtphub-1iface.cfgtcodjgb9, test write_config Launching: PWD=/build 'src/gtphub/osmo-gtphub' '-c' '/build/writtenconfig/osmo-gtphub-1iface.cfgtcodjgb9'
ls -l /proc/12228/fd
total 0 lr-x------ 1 build build 64 Dec 16 00:14 0 -> pipe:[35998787] l-wx------ 1 build build 64 Dec 16 00:14 1 -> pipe:[35998788] l-wx------ 1 build build 64 Dec 16 00:14 2 -> pipe:[35998789] l-wx------ 1 build build 64 Dec 16 00:14 3 -> /dev/null
ss -tn
State Recv-Q Send-Q Local Address:Port Peer Address:Port
ss -tln
State Recv-Q Send-Q Local Address:Port Peer Address:Port LISTEN 0 10 127.0.0.1:4253 *:*
ps xua | grep osmo
build 12228 1.0 0.0 54000 21256 ? S 00:14 0:00 /usr/bin/python3 /usr/local/bin/osmotestconfig.py -p /build -w /build -v build 12306 0.0 0.0 21474963656 23120 ? S 00:14 0:00 src/gtphub/osmo-gtphub -c /build/writtenconfig/osmo-gtphub-1iface.cfgtcodjgb9 build 12313 0.0 0.0 4280 712 ? S 00:14 0:00 /bin/sh -c ps xua | grep osmo build 12315 0.0 0.0 12784 912 ? S 00:14 0:00 grep osmo
Socket: in 1 tries, connected to 127.0.0.1:4253 <socket.socket fd=4, family=AddressFamily.AF_INET, type=SocketKind.SOCK_STREAM, proto=0, laddr=('127.0.0.1', 49466), raddr=('127.0.0.1', 4253)> (1 sockets open) Terminating took 0.897s Socket: closing 127.0.0.1:4253 <socket.socket fd=4, family=AddressFamily.AF_INET, type=SocketKind.SOCK_STREAM, proto=0, laddr=('127.0.0.1', 49466), raddr=('127.0.0.1', 4253)> (0 sockets open) Verifying src/gtphub/osmo-gtphub -c /build/writtenconfig/osmo-gtphub-1iface.cfgtcodjgb9, test token_vty_command Launching: PWD=/build 'src/gtphub/osmo-gtphub' '-c' '/build/writtenconfig/osmo-gtphub-1iface.cfgtcodjgb9'
ls -l /proc/12228/fd
total 0 lr-x------ 1 build build 64 Dec 16 00:14 0 -> pipe:[35998787] l-wx------ 1 build build 64 Dec 16 00:14 1 -> pipe:[35998788] l-wx------ 1 build build 64 Dec 16 00:14 2 -> pipe:[35998789] l-wx------ 1 build build 64 Dec 16 00:14 3 -> /dev/null
ss -tn
State Recv-Q Send-Q Local Address:Port Peer Address:Port
ss -tln
State Recv-Q Send-Q Local Address:Port Peer Address:Port
ps xua | grep osmo
build 12228 0.8 0.0 54000 21256 ? S 00:14 0:00 /usr/bin/python3 /usr/local/bin/osmotestconfig.py -p /build -w /build -v build 12317 0.0 0.0 21474963656 23576 ? S 00:14 0:00 src/gtphub/osmo-gtphub -c /build/writtenconfig/osmo-gtphub-1iface.cfgtcodjgb9 build 12324 0.0 0.0 4280 772 ? S 00:14 0:00 /bin/sh -c ps xua | grep osmo build 12326 0.0 0.0 12784 948 ? S 00:14 0:00 grep osmo
ERRORS: 1 Socket: in 1 tries, connected to 127.0.0.1:4253 <socket.socket fd=4, family=AddressFamily.AF_INET, type=SocketKind.SOCK_STREAM, proto=0, laddr=('127.0.0.1', 49470), raddr=('127.0.0.1', 4253)> (1 sockets open) Terminating took 0.897s Socket: closing 127.0.0.1:4253 <socket.socket fd=4, family=AddressFamily.AF_INET, type=SocketKind.SOCK_STREAM, proto=0, laddr=('127.0.0.1', 49470), raddr=('127.0.0.1', 4253)> (0 sockets open) make[7]: *** [vty-python-test] Error 1 Makefile:710: recipe for target 'vty-python-test' failed make[7]: Leaving directory '/build/tests' make[6]: *** [vty-test] Error 2 Makefile:727: recipe for target 'vty-test' failed make[6]: Leaving directory '/build/tests' Makefile:704: recipe for target 'python-tests' failed make[5]: Leaving directory '/build/tests' make[5]: *** [python-tests] Error 2 Makefile:735: recipe for target 'check-local' failed make[4]: Leaving directory '/build/tests' make[4]: *** [check-local] Error 2 make[3]: *** [check-am] Error 2 Makefile:564: recipe for target 'check-am' failed make[3]: Leaving directory '/build/tests' make[2]: *** [check-recursive] Error 1 Makefile:416: recipe for target 'check-recursive' failed make[2]: Leaving directory '/build/tests' Makefile:461: recipe for target 'check-recursive' failed make[1]: Leaving directory '/build' make[1]: *** [check-recursive] Error 1 Makefile:752: recipe for target 'check' failed make: *** [check] Error 2 + cat-testlogs.sh Build step 'Execute shell' marked build as failure [WARNINGS]Skipping publisher since build result is FAILURE
Changes:
------------------------------------------ [...truncated 412.88 KB...] !! ! log stderr logging filter all 1 logging color 1 logging print category-hex 1 logging print category 0 logging timestamp 0 logging print file 1 logging level gprs debug logging level ns info logging level obj notice logging level lglobal notice logging level llapd notice logging level linp notice logging level lmux notice logging level lmi notice logging level lmib notice logging level lsms notice logging level lctrl notice logging level lgtp notice logging level lstats notice logging level lgsup notice logging level loap notice logging level lss7 notice logging level lsccp notice logging level lsua notice logging level lm3ua notice logging level lmgcp notice logging level ljibuf notice logging level lrspro notice logging level lns notice logging level lbssgp notice ! stats interval 5 ! line vty no login ! ns encapsulation framerelay-gre enabled 0 encapsulation udp local-ip 127.0.0.100 encapsulation udp local-port 23000 encapsulation udp use-reset-block-unblock enabled nse 101 nsvci 101 nse 101 remote-role sgsn nse 101 encapsulation udp nse 101 remote-ip 192.168.100.239 nse 101 remote-port 7777 timer tns-block 3 timer tns-block-retries 3 timer tns-reset 3 timer tns-reset-retries 3 timer tns-test 30 timer tns-alive 3 timer tns-alive-retries 10 timer tsns-prov 3 timer unknown 0x8 3 timer unknown 0x9 3 gbproxy sgsn nsei 101
ss -tn
State Recv-Q Send-Q Local Address:Port Peer Address:Port
ss -tln
State Recv-Q Send-Q Local Address:Port Peer Address:Port
ps xua | grep osmo
build 12456 1.8 0.0 53948 21240 ? S 00:51 0:00 /usr/bin/python3 /usr/local/bin/osmotestconfig.py -p /build -w /build -v build 12490 0.0 0.0 21475111140 18324 ? S 00:52 0:00 src/sgsn/osmo-sgsn -c /build/doc/examples/osmo-sgsn/osmo-sgsn.cfg build 12497 0.0 0.0 4280 756 ? S 00:52 0:00 /bin/sh -c ps xua | grep osmo build 12499 0.0 0.0 12784 1012 ? S 00:52 0:00 grep osmo
Socket: in 1 tries, connected to 127.0.0.1:4245 <socket.socket fd=4, family=AddressFamily.AF_INET, type=SocketKind.SOCK_STREAM, proto=0, laddr=('127.0.0.1', 43010), raddr=('127.0.0.1', 4245)> (1 sockets open) Terminating took 0.897s Socket: closing 127.0.0.1:4245 <socket.socket fd=4, family=AddressFamily.AF_INET, type=SocketKind.SOCK_STREAM, proto=0, laddr=('127.0.0.1', 43010), raddr=('127.0.0.1', 4245)> (0 sockets open) Verifying src/sgsn/osmo-sgsn -c /build/writtenconfig/osmo-sgsn.cfgxswtyd00, test write_config Launching: PWD=/build 'src/sgsn/osmo-sgsn' '-c' '/build/writtenconfig/osmo-sgsn.cfgxswtyd00'
ls -l /proc/12456/fd
total 0 lr-x------ 1 build build 64 Dec 16 00:51 0 -> pipe:[2438836665] l-wx------ 1 build build 64 Dec 16 00:51 1 -> pipe:[2438836666] l-wx------ 1 build build 64 Dec 16 00:51 2 -> pipe:[2438836667] l-wx------ 1 build build 64 Dec 16 00:51 3 -> /dev/null
ss -tn
State Recv-Q Send-Q Local Address:Port Peer Address:Port
ss -tln
State Recv-Q Send-Q Local Address:Port Peer Address:Port
ps xua | grep osmo
build 12456 1.8 0.0 53948 21324 ? S 00:51 0:00 /usr/bin/python3 /usr/local/bin/osmotestconfig.py -p /build -w /build -v build 12501 0.0 0.0 21474978780 18116 ? R 00:52 0:00 src/sgsn/osmo-sgsn -c /build/writtenconfig/osmo-sgsn.cfgxswtyd00 build 12508 0.0 0.0 4280 760 ? S 00:52 0:00 /bin/sh -c ps xua | grep osmo build 12510 0.0 0.0 12784 936 ? S 00:52 0:00 grep osmo
Socket: in 1 tries, connected to 127.0.0.1:4245 <socket.socket fd=4, family=AddressFamily.AF_INET, type=SocketKind.SOCK_STREAM, proto=0, laddr=('127.0.0.1', 43026), raddr=('127.0.0.1', 4245)> (1 sockets open) Terminating took 0.897s Socket: closing 127.0.0.1:4245 <socket.socket fd=4, family=AddressFamily.AF_INET, type=SocketKind.SOCK_STREAM, proto=0, laddr=('127.0.0.1', 43026), raddr=('127.0.0.1', 4245)> (0 sockets open) Verifying src/sgsn/osmo-sgsn -c /build/writtenconfig/osmo-sgsn.cfgxswtyd00, test token_vty_command Launching: PWD=/build 'src/sgsn/osmo-sgsn' '-c' '/build/writtenconfig/osmo-sgsn.cfgxswtyd00'
ls -l /proc/12456/fd
total 0 lr-x------ 1 build build 64 Dec 16 00:51 0 -> pipe:[2438836665] l-wx------ 1 build build 64 Dec 16 00:51 1 -> pipe:[2438836666] l-wx------ 1 build build 64 Dec 16 00:51 2 -> pipe:[2438836667] l-wx------ 1 build build 64 Dec 16 00:51 3 -> /dev/null
ss -tn
State Recv-Q Send-Q Local Address:Port Peer Address:Port
ss -tln
State Recv-Q Send-Q Local Address:Port Peer Address:Port
ps xua | grep osmo
build 12456 1.4 0.0 53948 21324 ? S 00:51 0:00 /usr/bin/python3 /usr/local/bin/osmotestconfig.py -p /build -w /build -v build 12512 0.0 0.0 21475044960 23356 ? R 00:52 0:00 src/sgsn/osmo-sgsn -c /build/writtenconfig/osmo-sgsn.cfgxswtyd00 build 12519 0.0 0.0 4280 692 ? S 00:52 0:00 /bin/sh -c ps xua | grep osmo build 12521 0.0 0.0 12784 944 ? S 00:52 0:00 grep osmo
Socket: in 1 tries, connected to 127.0.0.1:4245 <socket.socket fd=4, family=AddressFamily.AF_INET, type=SocketKind.SOCK_STREAM, proto=0, laddr=('127.0.0.1', 43042), raddr=('127.0.0.1', 4245)> (1 sockets open) Terminating took 0.897s Socket: closing 127.0.0.1:4245 <socket.socket fd=4, family=AddressFamily.AF_INET, type=SocketKind.SOCK_STREAM, proto=0, laddr=('127.0.0.1', 43042), raddr=('127.0.0.1', 4245)> (0 sockets open) Verifying src/gtphub/osmo-gtphub -c /build/doc/examples/osmo-gtphub/osmo-gtphub-1iface.cfg, test verify_doc Launching: PWD=/build 'src/gtphub/osmo-gtphub' '-c' '/build/doc/examples/osmo-gtphub/osmo-gtphub-1iface.cfg'
ls -l /proc/12456/fd
total 0 lr-x------ 1 build build 64 Dec 16 00:51 0 -> pipe:[2438836665] l-wx------ 1 build build 64 Dec 16 00:51 1 -> pipe:[2438836666] l-wx------ 1 build build 64 Dec 16 00:51 2 -> pipe:[2438836667] l-wx------ 1 build build 64 Dec 16 00:51 3 -> /dev/null
ss -tn
State Recv-Q Send-Q Local Address:Port Peer Address:Port
ss -tln
State Recv-Q Send-Q Local Address:Port Peer Address:Port
ps xua | grep osmo
build 12456 1.3 0.0 53948 21324 ? S 00:51 0:00 /usr/bin/python3 /usr/local/bin/osmotestconfig.py -p /build -w /build -v build 12523 0.0 0.0 21474963656 14212 ? S 00:52 0:00 src/gtphub/osmo-gtphub -c /build/doc/examples/osmo-gtphub/osmo-gtphub-1iface.cfg build 12530 0.0 0.0 4280 684 ? S 00:52 0:00 /bin/sh -c ps xua | grep osmo build 12532 0.0 0.0 12784 944 ? S 00:52 0:00 grep osmo
Socket: in 1 tries, connected to 127.0.0.1:4253 <socket.socket fd=4, family=AddressFamily.AF_INET, type=SocketKind.SOCK_STREAM, proto=0, laddr=('127.0.0.1', 40744), raddr=('127.0.0.1', 4253)> (1 sockets open) Terminating took 0.897s Socket: closing 127.0.0.1:4253 <socket.socket fd=4, family=AddressFamily.AF_INET, type=SocketKind.SOCK_STREAM, proto=0, laddr=('127.0.0.1', 40744), raddr=('127.0.0.1', 4253)> (0 sockets open) Verifying src/gtphub/osmo-gtphub -c /build/writtenconfig/osmo-gtphub-1iface.cfgh1jduode, test write_config Launching: PWD=/build 'src/gtphub/osmo-gtphub' '-c' '/build/writtenconfig/osmo-gtphub-1iface.cfgh1jduode'
ls -l /proc/12456/fd
total 0 lr-x------ 1 build build 64 Dec 16 00:51 0 -> pipe:[2438836665] l-wx------ 1 build build 64 Dec 16 00:51 1 -> pipe:[2438836666] l-wx------ 1 build build 64 Dec 16 00:51 2 -> pipe:[2438836667] l-wx------ 1 build build 64 Dec 16 00:51 3 -> /dev/null
ss -tn
State Recv-Q Send-Q Local Address:Port Peer Address:Port
ss -tln
State Recv-Q Send-Q Local Address:Port Peer Address:Port LISTEN 0 10 127.0.0.1:4253 *:*
ps xua | grep osmo
build 12456 1.2 0.0 53948 21324 ? S 00:51 0:00 /usr/bin/python3 /usr/local/bin/osmotestconfig.py -p /build -w /build -v build 12534 0.0 0.0 21474963656 14272 ? S 00:52 0:00 src/gtphub/osmo-gtphub -c /build/writtenconfig/osmo-gtphub-1iface.cfgh1jduode build 12541 0.0 0.0 4280 704 ? S 00:52 0:00 /bin/sh -c ps xua | grep osmo build 12543 0.0 0.0 12784 996 ? S 00:52 0:00 grep osmo
Socket: in 1 tries, connected to 127.0.0.1:4253 <socket.socket fd=4, family=AddressFamily.AF_INET, type=SocketKind.SOCK_STREAM, proto=0, laddr=('127.0.0.1', 40760), raddr=('127.0.0.1', 4253)> (1 sockets open) Terminating took 0.897s Socket: closing 127.0.0.1:4253 <socket.socket fd=4, family=AddressFamily.AF_INET, type=SocketKind.SOCK_STREAM, proto=0, laddr=('127.0.0.1', 40760), raddr=('127.0.0.1', 4253)> (0 sockets open) Verifying src/gtphub/osmo-gtphub -c /build/writtenconfig/osmo-gtphub-1iface.cfgh1jduode, test token_vty_command Launching: PWD=/build 'src/gtphub/osmo-gtphub' '-c' '/build/writtenconfig/osmo-gtphub-1iface.cfgh1jduode'
ls -l /proc/12456/fd
total 0 lr-x------ 1 build build 64 Dec 16 00:51 0 -> pipe:[2438836665] l-wx------ 1 build build 64 Dec 16 00:51 1 -> pipe:[2438836666] l-wx------ 1 build build 64 Dec 16 00:51 2 -> pipe:[2438836667] l-wx------ 1 build build 64 Dec 16 00:51 3 -> /dev/null
ss -tn
State Recv-Q Send-Q Local Address:Port Peer Address:Port
ss -tln
State Recv-Q Send-Q Local Address:Port Peer Address:Port
ps xua | grep osmo
build 12456 1.0 0.0 53948 21324 ? S 00:51 0:00 /usr/bin/python3 /usr/local/bin/osmotestconfig.py -p /build -w /build -v build 12545 0.0 0.0 21474963656 14152 ? S 00:52 0:00 src/gtphub/osmo-gtphub -c /build/writtenconfig/osmo-gtphub-1iface.cfgh1jduode build 12552 0.0 0.0 4280 712 ? S 00:52 0:00 /bin/sh -c ps xua | grep osmo build 12554 0.0 0.0 12784 944 ? S 00:52 0:00 grep osmo
ERRORS: 1 Socket: in 1 tries, connected to 127.0.0.1:4253 <socket.socket fd=4, family=AddressFamily.AF_INET, type=SocketKind.SOCK_STREAM, proto=0, laddr=('127.0.0.1', 40790), raddr=('127.0.0.1', 4253)> (1 sockets open) Terminating took 0.897s Socket: closing 127.0.0.1:4253 <socket.socket fd=4, family=AddressFamily.AF_INET, type=SocketKind.SOCK_STREAM, proto=0, laddr=('127.0.0.1', 40790), raddr=('127.0.0.1', 4253)> (0 sockets open) make[7]: *** [vty-python-test] Error 1 Makefile:710: recipe for target 'vty-python-test' failed make[7]: Leaving directory '/build/tests' make[6]: *** [vty-test] Error 2 Makefile:727: recipe for target 'vty-test' failed make[6]: Leaving directory '/build/tests' make[5]: *** [python-tests] Error 2 Makefile:704: recipe for target 'python-tests' failed make[5]: Leaving directory '/build/tests' make[4]: *** [check-local] Error 2 Makefile:735: recipe for target 'check-local' failed make[4]: Leaving directory '/build/tests' make[3]: *** [check-am] Error 2 Makefile:564: recipe for target 'check-am' failed make[3]: Leaving directory '/build/tests' Makefile:416: recipe for target 'check-recursive' failed make[2]: Leaving directory '/build/tests' make[2]: *** [check-recursive] Error 1 Makefile:461: recipe for target 'check-recursive' failed make[1]: Leaving directory '/build' make[1]: *** [check-recursive] Error 1 make: *** [check] Error 2 Makefile:752: recipe for target 'check' failed + cat-testlogs.sh Build step 'Execute shell' marked build as failure [WARNINGS]Skipping publisher since build result is FAILURE
Changes:
------------------------------------------ [...truncated 413.26 KB...] !! ! log stderr logging filter all 1 logging color 1 logging print category-hex 1 logging print category 0 logging timestamp 0 logging print file 1 logging level gprs debug logging level ns info logging level obj notice logging level lglobal notice logging level llapd notice logging level linp notice logging level lmux notice logging level lmi notice logging level lmib notice logging level lsms notice logging level lctrl notice logging level lgtp notice logging level lstats notice logging level lgsup notice logging level loap notice logging level lss7 notice logging level lsccp notice logging level lsua notice logging level lm3ua notice logging level lmgcp notice logging level ljibuf notice logging level lrspro notice logging level lns notice logging level lbssgp notice ! stats interval 5 ! line vty no login ! ns encapsulation framerelay-gre enabled 0 encapsulation udp local-ip 127.0.0.100 encapsulation udp local-port 23000 encapsulation udp use-reset-block-unblock enabled nse 101 nsvci 101 nse 101 remote-role sgsn nse 101 encapsulation udp nse 101 remote-ip 192.168.100.239 nse 101 remote-port 7777 timer tns-block 3 timer tns-block-retries 3 timer tns-reset 3 timer tns-reset-retries 3 timer tns-test 30 timer tns-alive 3 timer tns-alive-retries 10 timer tsns-prov 3 timer unknown 0x8 3 timer unknown 0x9 3 gbproxy sgsn nsei 101
State Recv-Q Send-Q Local Address:Port Peer Address:Port
ss -tln
State Recv-Q Send-Q Local Address:Port Peer Address:Port LISTEN 0 10 127.0.0.1:4245 *:* LISTEN 0 10 127.0.0.1:4251 *:*
ps xua | grep osmo
build 12013 1.1 0.0 53904 21080 ? S 00:55 0:00 /usr/bin/python3 /usr/local/bin/osmotestconfig.py -p /build -w /build -v build 12047 0.0 0.0 21475111140 28864 ? S 00:56 0:00 src/sgsn/osmo-sgsn -c /build/doc/examples/osmo-sgsn/osmo-sgsn.cfg build 12054 0.0 0.0 4280 704 ? S 00:56 0:00 /bin/sh -c ps xua | grep osmo build 12056 0.0 0.0 12784 1028 ? S 00:56 0:00 grep osmo
Socket: in 1 tries, connected to 127.0.0.1:4245 <socket.socket fd=4, family=AddressFamily.AF_INET, type=SocketKind.SOCK_STREAM, proto=0, laddr=('127.0.0.1', 59130), raddr=('127.0.0.1', 4245)> (1 sockets open) Terminating took 0.897s Socket: closing 127.0.0.1:4245 <socket.socket fd=4, family=AddressFamily.AF_INET, type=SocketKind.SOCK_STREAM, proto=0, laddr=('127.0.0.1', 59130), raddr=('127.0.0.1', 4245)> (0 sockets open) Verifying src/sgsn/osmo-sgsn -c /build/writtenconfig/osmo-sgsn.cfgwrsb_s1v, test write_config Launching: PWD=/build 'src/sgsn/osmo-sgsn' '-c' '/build/writtenconfig/osmo-sgsn.cfgwrsb_s1v'
ls -l /proc/12013/fd
total 0 lr-x------ 1 build build 64 Dec 16 00:55 0 -> pipe:[36753144] l-wx------ 1 build build 64 Dec 16 00:55 1 -> pipe:[36753145] l-wx------ 1 build build 64 Dec 16 00:55 2 -> pipe:[36753146] l-wx------ 1 build build 64 Dec 16 00:55 3 -> /dev/null
ss -tn
State Recv-Q Send-Q Local Address:Port Peer Address:Port
ss -tln
State Recv-Q Send-Q Local Address:Port Peer Address:Port
ps xua | grep osmo
build 12013 1.1 0.0 54040 21168 ? S 00:55 0:00 /usr/bin/python3 /usr/local/bin/osmotestconfig.py -p /build -w /build -v build 12058 0.0 0.0 21474978780 28564 ? R 00:56 0:00 src/sgsn/osmo-sgsn -c /build/writtenconfig/osmo-sgsn.cfgwrsb_s1v build 12065 0.0 0.0 4280 712 ? S 00:56 0:00 /bin/sh -c ps xua | grep osmo build 12067 0.0 0.0 12784 972 ? S 00:56 0:00 grep osmo
Socket: in 1 tries, connected to 127.0.0.1:4245 <socket.socket fd=4, family=AddressFamily.AF_INET, type=SocketKind.SOCK_STREAM, proto=0, laddr=('127.0.0.1', 59132), raddr=('127.0.0.1', 4245)> (1 sockets open) Terminating took 0.897s Socket: closing 127.0.0.1:4245 <socket.socket fd=4, family=AddressFamily.AF_INET, type=SocketKind.SOCK_STREAM, proto=0, laddr=('127.0.0.1', 59132), raddr=('127.0.0.1', 4245)> (0 sockets open) Verifying src/sgsn/osmo-sgsn -c /build/writtenconfig/osmo-sgsn.cfgwrsb_s1v, test token_vty_command Launching: PWD=/build 'src/sgsn/osmo-sgsn' '-c' '/build/writtenconfig/osmo-sgsn.cfgwrsb_s1v'
ls -l /proc/12013/fd
total 0 lr-x------ 1 build build 64 Dec 16 00:55 0 -> pipe:[36753144] l-wx------ 1 build build 64 Dec 16 00:55 1 -> pipe:[36753145] l-wx------ 1 build build 64 Dec 16 00:55 2 -> pipe:[36753146] l-wx------ 1 build build 64 Dec 16 00:55 3 -> /dev/null
ss -tn
State Recv-Q Send-Q Local Address:Port Peer Address:Port
ss -tln
State Recv-Q Send-Q Local Address:Port Peer Address:Port
ps xua | grep osmo
build 12013 1.0 0.0 54040 21168 ? S 00:55 0:00 /usr/bin/python3 /usr/local/bin/osmotestconfig.py -p /build -w /build -v build 12069 0.0 0.0 21474974552 27504 ? R 00:56 0:00 src/sgsn/osmo-sgsn -c /build/writtenconfig/osmo-sgsn.cfgwrsb_s1v build 12076 0.0 0.0 4280 716 ? S 00:56 0:00 /bin/sh -c ps xua | grep osmo build 12078 0.0 0.0 12784 1028 ? S 00:56 0:00 grep osmo
Socket: in 1 tries, connected to 127.0.0.1:4245 <socket.socket fd=4, family=AddressFamily.AF_INET, type=SocketKind.SOCK_STREAM, proto=0, laddr=('127.0.0.1', 59134), raddr=('127.0.0.1', 4245)> (1 sockets open) Terminating took 0.897s Socket: closing 127.0.0.1:4245 <socket.socket fd=4, family=AddressFamily.AF_INET, type=SocketKind.SOCK_STREAM, proto=0, laddr=('127.0.0.1', 59134), raddr=('127.0.0.1', 4245)> (0 sockets open) Verifying src/gtphub/osmo-gtphub -c /build/doc/examples/osmo-gtphub/osmo-gtphub-1iface.cfg, test verify_doc Launching: PWD=/build 'src/gtphub/osmo-gtphub' '-c' '/build/doc/examples/osmo-gtphub/osmo-gtphub-1iface.cfg'
ls -l /proc/12013/fd
total 0 lr-x------ 1 build build 64 Dec 16 00:55 0 -> pipe:[36753144] l-wx------ 1 build build 64 Dec 16 00:55 1 -> pipe:[36753145] l-wx------ 1 build build 64 Dec 16 00:55 2 -> pipe:[36753146] l-wx------ 1 build build 64 Dec 16 00:55 3 -> /dev/null
ss -tn
State Recv-Q Send-Q Local Address:Port Peer Address:Port
ss -tln
State Recv-Q Send-Q Local Address:Port Peer Address:Port
ps xua | grep osmo
build 12013 0.9 0.0 54040 21168 ? S 00:55 0:00 /usr/bin/python3 /usr/local/bin/osmotestconfig.py -p /build -w /build -v build 12080 0.0 0.0 21474963656 23504 ? S 00:56 0:00 src/gtphub/osmo-gtphub -c /build/doc/examples/osmo-gtphub/osmo-gtphub-1iface.cfg build 12087 0.0 0.0 4280 740 ? S 00:56 0:00 /bin/sh -c ps xua | grep osmo build 12089 0.0 0.0 12784 884 ? S 00:56 0:00 grep osmo
Socket: in 1 tries, connected to 127.0.0.1:4253 <socket.socket fd=4, family=AddressFamily.AF_INET, type=SocketKind.SOCK_STREAM, proto=0, laddr=('127.0.0.1', 50044), raddr=('127.0.0.1', 4253)> (1 sockets open) Terminating took 0.897s Socket: closing 127.0.0.1:4253 <socket.socket fd=4, family=AddressFamily.AF_INET, type=SocketKind.SOCK_STREAM, proto=0, laddr=('127.0.0.1', 50044), raddr=('127.0.0.1', 4253)> (0 sockets open) Verifying src/gtphub/osmo-gtphub -c /build/writtenconfig/osmo-gtphub-1iface.cfggsa7fe4k, test write_config Launching: PWD=/build 'src/gtphub/osmo-gtphub' '-c' '/build/writtenconfig/osmo-gtphub-1iface.cfggsa7fe4k'
ls -l /proc/12013/fd
total 0 lr-x------ 1 build build 64 Dec 16 00:55 0 -> pipe:[36753144] l-wx------ 1 build build 64 Dec 16 00:55 1 -> pipe:[36753145] l-wx------ 1 build build 64 Dec 16 00:55 2 -> pipe:[36753146] l-wx------ 1 build build 64 Dec 16 00:55 3 -> /dev/null
ss -tn
State Recv-Q Send-Q Local Address:Port Peer Address:Port
ss -tln
State Recv-Q Send-Q Local Address:Port Peer Address:Port
ps xua | grep osmo
build 12013 0.9 0.0 54040 21168 ? S 00:55 0:00 /usr/bin/python3 /usr/local/bin/osmotestconfig.py -p /build -w /build -v build 12091 0.0 0.0 21474963656 17896 ? R 00:56 0:00 src/gtphub/osmo-gtphub -c /build/writtenconfig/osmo-gtphub-1iface.cfggsa7fe4k build 12098 0.0 0.0 4280 716 ? S 00:56 0:00 /bin/sh -c ps xua | grep osmo build 12100 0.0 0.0 12784 900 ? S 00:56 0:00 grep osmo
Connecting socket failed, retrying... Socket: in 2 tries, connected to 127.0.0.1:4253 <socket.socket fd=5, family=AddressFamily.AF_INET, type=SocketKind.SOCK_STREAM, proto=0, laddr=('127.0.0.1', 50048), raddr=('127.0.0.1', 4253)> (1 sockets open) Terminating took 0.897s Socket: closing 127.0.0.1:4253 <socket.socket fd=5, family=AddressFamily.AF_INET, type=SocketKind.SOCK_STREAM, proto=0, laddr=('127.0.0.1', 50048), raddr=('127.0.0.1', 4253)> (0 sockets open) Verifying src/gtphub/osmo-gtphub -c /build/writtenconfig/osmo-gtphub-1iface.cfggsa7fe4k, test token_vty_command Launching: PWD=/build 'src/gtphub/osmo-gtphub' '-c' '/build/writtenconfig/osmo-gtphub-1iface.cfggsa7fe4k'
ls -l /proc/12013/fd
total 0 lr-x------ 1 build build 64 Dec 16 00:55 0 -> pipe:[36753144] l-wx------ 1 build build 64 Dec 16 00:55 1 -> pipe:[36753145] l-wx------ 1 build build 64 Dec 16 00:55 2 -> pipe:[36753146] l-wx------ 1 build build 64 Dec 16 00:55 3 -> /dev/null
ss -tn
State Recv-Q Send-Q Local Address:Port Peer Address:Port
ss -tln
State Recv-Q Send-Q Local Address:Port Peer Address:Port LISTEN 0 10 127.0.0.1:4253 *:*
ps xua | grep osmo
build 12013 0.7 0.0 54040 21168 ? S 00:55 0:00 /usr/bin/python3 /usr/local/bin/osmotestconfig.py -p /build -w /build -v build 12102 0.0 0.0 21474963656 24980 ? S 00:56 0:00 src/gtphub/osmo-gtphub -c /build/writtenconfig/osmo-gtphub-1iface.cfggsa7fe4k build 12109 0.0 0.0 4280 740 ? S 00:56 0:00 /bin/sh -c ps xua | grep osmo build 12111 0.0 0.0 12784 956 ? S 00:56 0:00 grep osmo
Socket: in 1 tries, connected to 127.0.0.1:4253 <socket.socket fd=4, family=AddressFamily.AF_INET, type=SocketKind.SOCK_STREAM, proto=0, laddr=('127.0.0.1', 50050), raddr=('127.0.0.1', 4253)> (1 sockets open) Terminating took 0.897s Socket: closing 127.0.0.1:4253 <socket.socket fd=4, family=AddressFamily.AF_INET, type=SocketKind.SOCK_STREAM, proto=0, laddr=('127.0.0.1', 50050), raddr=('127.0.0.1', 4253)> (0 sockets open) ERRORS: 1 Makefile:710: recipe for target 'vty-python-test' failed make[7]: Leaving directory '/build/tests' Makefile:727: recipe for target 'vty-test' failed make[6]: Leaving directory '/build/tests' make[7]: *** [vty-python-test] Error 1 make[6]: *** [vty-test] Error 2 make[5]: *** [python-tests] Error 2 Makefile:704: recipe for target 'python-tests' failed make[5]: Leaving directory '/build/tests' Makefile:735: recipe for target 'check-local' failed make[4]: Leaving directory '/build/tests' make[4]: *** [check-local] Error 2 Makefile:564: recipe for target 'check-am' failed make[3]: Leaving directory '/build/tests' make[3]: *** [check-am] Error 2 Makefile:416: recipe for target 'check-recursive' failed make[2]: Leaving directory '/build/tests' make[2]: *** [check-recursive] Error 1 make[1]: *** [check-recursive] Error 1 Makefile:461: recipe for target 'check-recursive' failed make[1]: Leaving directory '/build' make: *** [check] Error 2 Makefile:752: recipe for target 'check' failed + cat-testlogs.sh Build step 'Execute shell' marked build as failure [WARNINGS]Skipping publisher since build result is FAILURE
Changes:
------------------------------------------ [...truncated 413.96 KB...] ! log stderr logging filter all 1 logging color 1 logging print category-hex 1 logging print category 0 logging timestamp 0 logging print file 1 logging level gprs debug logging level ns info logging level obj notice logging level lglobal notice logging level llapd notice logging level linp notice logging level lmux notice logging level lmi notice logging level lmib notice logging level lsms notice logging level lctrl notice logging level lgtp notice logging level lstats notice logging level lgsup notice logging level loap notice logging level lss7 notice logging level lsccp notice logging level lsua notice logging level lm3ua notice logging level lmgcp notice logging level ljibuf notice logging level lrspro notice logging level lns notice logging level lbssgp notice ! stats interval 5 ! line vty no login ! ns encapsulation framerelay-gre enabled 0 encapsulation udp local-ip 127.0.0.100 encapsulation udp local-port 23000 encapsulation udp use-reset-block-unblock enabled nse 101 nsvci 101 nse 101 remote-role sgsn nse 101 encapsulation udp nse 101 remote-ip 192.168.100.239 nse 101 remote-port 7777 timer tns-block 3 timer tns-block-retries 3 timer tns-reset 3 timer tns-reset-retries 3 timer tns-test 30 timer tns-alive 3 timer tns-alive-retries 10 timer tsns-prov 3 timer unknown 0x8 3 timer unknown 0x9 3 gbproxy sgsn nsei 101
ss -tn
State Recv-Q Send-Q Local Address:Port Peer Address:Port
ss -tln
State Recv-Q Send-Q Local Address:Port Peer Address:Port
ps xua | grep osmo
build 11999 1.6 0.0 53908 21008 ? S 01:04 0:00 /usr/bin/python3 /usr/local/bin/osmotestconfig.py -p /build -w /build -v build 12033 0.0 0.0 21474974552 26168 ? R 01:04 0:00 src/sgsn/osmo-sgsn -c /build/doc/examples/osmo-sgsn/osmo-sgsn.cfg build 12040 0.0 0.0 4280 696 ? S 01:04 0:00 /bin/sh -c ps xua | grep osmo build 12042 0.0 0.0 12784 892 ? S 01:04 0:00 grep osmo
Socket: in 1 tries, connected to 127.0.0.1:4245 <socket.socket fd=4, family=AddressFamily.AF_INET, type=SocketKind.SOCK_STREAM, proto=0, laddr=('127.0.0.1', 59476), raddr=('127.0.0.1', 4245)> (1 sockets open) Terminating took 0.897s Socket: closing 127.0.0.1:4245 <socket.socket fd=4, family=AddressFamily.AF_INET, type=SocketKind.SOCK_STREAM, proto=0, laddr=('127.0.0.1', 59476), raddr=('127.0.0.1', 4245)> (0 sockets open) Verifying src/sgsn/osmo-sgsn -c /build/writtenconfig/osmo-sgsn.cfgpuhmyt16, test write_config Launching: PWD=/build 'src/sgsn/osmo-sgsn' '-c' '/build/writtenconfig/osmo-sgsn.cfgpuhmyt16'
ls -l /proc/11999/fd
total 0 lr-x------ 1 build build 64 Dec 16 01:04 0 -> pipe:[37509793] l-wx------ 1 build build 64 Dec 16 01:04 1 -> pipe:[37509794] l-wx------ 1 build build 64 Dec 16 01:04 2 -> pipe:[37509795] l-wx------ 1 build build 64 Dec 16 01:04 3 -> /dev/null
ss -tn
State Recv-Q Send-Q Local Address:Port Peer Address:Port
ss -tln
State Recv-Q Send-Q Local Address:Port Peer Address:Port
ps xua | grep osmo
build 11999 1.4 0.0 54040 21096 ? S 01:04 0:00 /usr/bin/python3 /usr/local/bin/osmotestconfig.py -p /build -w /build -v build 12044 0.0 0.1 21475111140 36284 ? R 01:04 0:00 src/sgsn/osmo-sgsn -c /build/writtenconfig/osmo-sgsn.cfgpuhmyt16 build 12051 0.0 0.0 4280 700 ? S 01:04 0:00 /bin/sh -c ps xua | grep osmo build 12053 0.0 0.0 12784 972 ? S 01:04 0:00 grep osmo
Socket: in 1 tries, connected to 127.0.0.1:4245 <socket.socket fd=4, family=AddressFamily.AF_INET, type=SocketKind.SOCK_STREAM, proto=0, laddr=('127.0.0.1', 59478), raddr=('127.0.0.1', 4245)> (1 sockets open) Terminating took 0.897s Socket: closing 127.0.0.1:4245 <socket.socket fd=4, family=AddressFamily.AF_INET, type=SocketKind.SOCK_STREAM, proto=0, laddr=('127.0.0.1', 59478), raddr=('127.0.0.1', 4245)> (0 sockets open) Verifying src/sgsn/osmo-sgsn -c /build/writtenconfig/osmo-sgsn.cfgpuhmyt16, test token_vty_command Launching: PWD=/build 'src/sgsn/osmo-sgsn' '-c' '/build/writtenconfig/osmo-sgsn.cfgpuhmyt16'
ls -l /proc/11999/fd
total 0 lr-x------ 1 build build 64 Dec 16 01:04 0 -> pipe:[37509793] l-wx------ 1 build build 64 Dec 16 01:04 1 -> pipe:[37509794] l-wx------ 1 build build 64 Dec 16 01:04 2 -> pipe:[37509795] l-wx------ 1 build build 64 Dec 16 01:04 3 -> /dev/null
ss -tn
State Recv-Q Send-Q Local Address:Port Peer Address:Port
ss -tln
State Recv-Q Send-Q Local Address:Port Peer Address:Port
ps xua | grep osmo
build 11999 1.4 0.0 54040 21096 ? S 01:04 0:00 /usr/bin/python3 /usr/local/bin/osmotestconfig.py -p /build -w /build -v build 12055 0.0 0.0 21474974552 27812 ? R 01:04 0:00 src/sgsn/osmo-sgsn -c /build/writtenconfig/osmo-sgsn.cfgpuhmyt16 build 12062 0.0 0.0 4280 740 ? S 01:04 0:00 /bin/sh -c ps xua | grep osmo build 12064 0.0 0.0 12784 1016 ? S 01:04 0:00 grep osmo
Socket: in 1 tries, connected to 127.0.0.1:4245 <socket.socket fd=4, family=AddressFamily.AF_INET, type=SocketKind.SOCK_STREAM, proto=0, laddr=('127.0.0.1', 59480), raddr=('127.0.0.1', 4245)> (1 sockets open) Terminating took 0.897s Socket: closing 127.0.0.1:4245 <socket.socket fd=4, family=AddressFamily.AF_INET, type=SocketKind.SOCK_STREAM, proto=0, laddr=('127.0.0.1', 59480), raddr=('127.0.0.1', 4245)> (0 sockets open) Verifying src/gtphub/osmo-gtphub -c /build/doc/examples/osmo-gtphub/osmo-gtphub-1iface.cfg, test verify_doc Launching: PWD=/build 'src/gtphub/osmo-gtphub' '-c' '/build/doc/examples/osmo-gtphub/osmo-gtphub-1iface.cfg'
ls -l /proc/11999/fd
total 0 lr-x------ 1 build build 64 Dec 16 01:04 0 -> pipe:[37509793] l-wx------ 1 build build 64 Dec 16 01:04 1 -> pipe:[37509794] l-wx------ 1 build build 64 Dec 16 01:04 2 -> pipe:[37509795] l-wx------ 1 build build 64 Dec 16 01:04 3 -> /dev/null
ss -tn
State Recv-Q Send-Q Local Address:Port Peer Address:Port
ss -tln
State Recv-Q Send-Q Local Address:Port Peer Address:Port LISTEN 0 10 127.0.0.1:4253 *:*
ps xua | grep osmo
build 11999 1.3 0.0 54040 21096 ? S 01:04 0:00 /usr/bin/python3 /usr/local/bin/osmotestconfig.py -p /build -w /build -v build 12066 0.0 0.0 21474963656 26240 ? S 01:04 0:00 src/gtphub/osmo-gtphub -c /build/doc/examples/osmo-gtphub/osmo-gtphub-1iface.cfg build 12073 0.0 0.0 4280 748 ? S 01:04 0:00 /bin/sh -c ps xua | grep osmo build 12075 0.0 0.0 12784 944 ? S 01:04 0:00 grep osmo
Socket: in 1 tries, connected to 127.0.0.1:4253 <socket.socket fd=4, family=AddressFamily.AF_INET, type=SocketKind.SOCK_STREAM, proto=0, laddr=('127.0.0.1', 50390), raddr=('127.0.0.1', 4253)> (1 sockets open) Terminating took 0.897s Socket: closing 127.0.0.1:4253 <socket.socket fd=4, family=AddressFamily.AF_INET, type=SocketKind.SOCK_STREAM, proto=0, laddr=('127.0.0.1', 50390), raddr=('127.0.0.1', 4253)> (0 sockets open) Verifying src/gtphub/osmo-gtphub -c /build/writtenconfig/osmo-gtphub-1iface.cfgtbnx1fm4, test write_config Launching: PWD=/build 'src/gtphub/osmo-gtphub' '-c' '/build/writtenconfig/osmo-gtphub-1iface.cfgtbnx1fm4'
ls -l /proc/11999/fd
total 0 lr-x------ 1 build build 64 Dec 16 01:04 0 -> pipe:[37509793] l-wx------ 1 build build 64 Dec 16 01:04 1 -> pipe:[37509794] l-wx------ 1 build build 64 Dec 16 01:04 2 -> pipe:[37509795] l-wx------ 1 build build 64 Dec 16 01:04 3 -> /dev/null
ss -tn
State Recv-Q Send-Q Local Address:Port Peer Address:Port
ss -tln
State Recv-Q Send-Q Local Address:Port Peer Address:Port
ps xua | grep osmo
build 11999 1.2 0.0 54040 21096 ? S 01:04 0:00 /usr/bin/python3 /usr/local/bin/osmotestconfig.py -p /build -w /build -v build 12077 0.0 0.0 21474963656 24572 ? S 01:04 0:00 src/gtphub/osmo-gtphub -c /build/writtenconfig/osmo-gtphub-1iface.cfgtbnx1fm4 build 12084 0.0 0.0 4280 704 ? S 01:04 0:00 /bin/sh -c ps xua | grep osmo build 12086 0.0 0.0 12784 952 ? S 01:04 0:00 grep osmo
Socket: in 1 tries, connected to 127.0.0.1:4253 <socket.socket fd=4, family=AddressFamily.AF_INET, type=SocketKind.SOCK_STREAM, proto=0, laddr=('127.0.0.1', 50392), raddr=('127.0.0.1', 4253)> (1 sockets open) Terminating took 0.897s Socket: closing 127.0.0.1:4253 <socket.socket fd=4, family=AddressFamily.AF_INET, type=SocketKind.SOCK_STREAM, proto=0, laddr=('127.0.0.1', 50392), raddr=('127.0.0.1', 4253)> (0 sockets open) Verifying src/gtphub/osmo-gtphub -c /build/writtenconfig/osmo-gtphub-1iface.cfgtbnx1fm4, test token_vty_command Launching: PWD=/build 'src/gtphub/osmo-gtphub' '-c' '/build/writtenconfig/osmo-gtphub-1iface.cfgtbnx1fm4'
ls -l /proc/11999/fd
total 0 lr-x------ 1 build build 64 Dec 16 01:04 0 -> pipe:[37509793] l-wx------ 1 build build 64 Dec 16 01:04 1 -> pipe:[37509794] l-wx------ 1 build build 64 Dec 16 01:04 2 -> pipe:[37509795] l-wx------ 1 build build 64 Dec 16 01:04 3 -> /dev/null
ss -tn
State Recv-Q Send-Q Local Address:Port Peer Address:Port
ss -tln
State Recv-Q Send-Q Local Address:Port Peer Address:Port LISTEN 0 10 127.0.0.1:4253 *:*
ps xua | grep osmo
build 11999 1.0 0.0 54040 21096 ? S 01:04 0:00 /usr/bin/python3 /usr/local/bin/osmotestconfig.py -p /build -w /build -v build 12088 0.0 0.0 21474963656 26340 ? S 01:04 0:00 src/gtphub/osmo-gtphub -c /build/writtenconfig/osmo-gtphub-1iface.cfgtbnx1fm4 build 12095 0.0 0.0 4280 708 ? S 01:04 0:00 /bin/sh -c ps xua | grep osmo build 12097 0.0 0.0 12784 936 ? S 01:04 0:00 grep osmo
ERRORS: 1 Socket: in 1 tries, connected to 127.0.0.1:4253 <socket.socket fd=4, family=AddressFamily.AF_INET, type=SocketKind.SOCK_STREAM, proto=0, laddr=('127.0.0.1', 50396), raddr=('127.0.0.1', 4253)> (1 sockets open) Terminating took 0.897s Socket: closing 127.0.0.1:4253 <socket.socket fd=4, family=AddressFamily.AF_INET, type=SocketKind.SOCK_STREAM, proto=0, laddr=('127.0.0.1', 50396), raddr=('127.0.0.1', 4253)> (0 sockets open) Makefile:710: recipe for target 'vty-python-test' failed make[7]: Leaving directory '/build/tests' make[7]: *** [vty-python-test] Error 1 Makefile:727: recipe for target 'vty-test' failed make[6]: Leaving directory '/build/tests' make[6]: *** [vty-test] Error 2 Makefile:704: recipe for target 'python-tests' failed make[5]: Leaving directory '/build/tests' make[5]: *** [python-tests] Error 2 make[4]: *** [check-local] Error 2 Makefile:735: recipe for target 'check-local' failed make[4]: Leaving directory '/build/tests' make[3]: *** [check-am] Error 2 Makefile:564: recipe for target 'check-am' failed make[3]: Leaving directory '/build/tests' Makefile:416: recipe for target 'check-recursive' failed make[2]: Leaving directory '/build/tests' make[2]: *** [check-recursive] Error 1 make[1]: *** [check-recursive] Error 1 Makefile:461: recipe for target 'check-recursive' failed make[1]: Leaving directory '/build' Makefile:752: recipe for target 'check' failed make: *** [check] Error 2 + cat-testlogs.sh Build step 'Execute shell' marked build as failure [WARNINGS]Skipping publisher since build result is FAILURE
Changes:
------------------------------------------ [...truncated 412.32 KB...] ! ! OsmoGbProxy (1.6.0.108-3326) configuration saved from vty !! ! log stderr logging filter all 1 logging color 1 logging print category-hex 1 logging print category 0 logging timestamp 0 logging print file 1 logging level gprs debug logging level ns info logging level obj notice logging level lglobal notice logging level llapd notice logging level linp notice logging level lmux notice logging level lmi notice logging level lmib notice logging level lsms notice logging level lctrl notice logging level lgtp notice logging level lstats notice logging level lgsup notice logging level loap notice logging level lss7 notice logging level lsccp notice logging level lsua notice logging level lm3ua notice logging level lmgcp notice logging level ljibuf notice logging level lrspro notice logging level lns notice logging level lbssgp notice ! stats interval 5 ! line vty no login ! ns encapsulation framerelay-gre enabled 0 encapsulation udp local-ip 127.0.0.100 encapsulation udp local-port 23000 encapsulation udp use-reset-block-unblock enabled nse 101 nsvci 101 nse 101 remote-role sgsn nse 101 encapsulation udp nse 101 remote-ip 192.168.100.239 nse 101 remote-port 7777 timer tns-block 3 timer tns-block-retries 3 timer tns-reset 3 timer tns-reset-retries 3 timer tns-test 30 timer tns-alive 3 timer tns-alive-retries 10 timer tsns-prov 3 timer unknown 0x8 3 timer unknown 0x9 3 gbproxy sgsn nsei 101
State Recv-Q Send-Q Local Address:Port Peer Address:Port
ss -tln
State Recv-Q Send-Q Local Address:Port Peer Address:Port
ps xua | grep osmo
build 11997 1.7 0.0 53984 20896 ? S 06:20 0:00 /usr/bin/python3 /usr/local/bin/osmotestconfig.py -p /build -w /build -v build 12031 0.0 0.0 21474974552 16384 ? R 06:20 0:00 src/sgsn/osmo-sgsn -c /build/doc/examples/osmo-sgsn/osmo-sgsn.cfg build 12038 0.0 0.0 4280 700 ? S 06:20 0:00 /bin/sh -c ps xua | grep osmo build 12040 0.0 0.0 12784 992 ? S 06:20 0:00 grep osmo
Connecting socket failed, retrying... Socket: in 2 tries, connected to 127.0.0.1:4245 <socket.socket fd=5, family=AddressFamily.AF_INET, type=SocketKind.SOCK_STREAM, proto=0, laddr=('127.0.0.1', 60686), raddr=('127.0.0.1', 4245)> (1 sockets open) Terminating took 0.897s Socket: closing 127.0.0.1:4245 <socket.socket fd=5, family=AddressFamily.AF_INET, type=SocketKind.SOCK_STREAM, proto=0, laddr=('127.0.0.1', 60686), raddr=('127.0.0.1', 4245)> (0 sockets open) Verifying src/sgsn/osmo-sgsn -c /build/writtenconfig/osmo-sgsn.cfg7kbgkds5, test write_config Launching: PWD=/build 'src/sgsn/osmo-sgsn' '-c' '/build/writtenconfig/osmo-sgsn.cfg7kbgkds5'
ls -l /proc/11997/fd
total 0 lr-x------ 1 build build 64 Dec 16 06:20 0 -> pipe:[38968314] l-wx------ 1 build build 64 Dec 16 06:20 1 -> pipe:[38968315] l-wx------ 1 build build 64 Dec 16 06:20 2 -> pipe:[38968316] l-wx------ 1 build build 64 Dec 16 06:20 3 -> /dev/null
ss -tn
State Recv-Q Send-Q Local Address:Port Peer Address:Port
ss -tln
State Recv-Q Send-Q Local Address:Port Peer Address:Port
ps xua | grep osmo
build 11997 1.4 0.0 53984 20988 ? S 06:20 0:00 /usr/bin/python3 /usr/local/bin/osmotestconfig.py -p /build -w /build -v build 12042 0.0 0.0 21475111140 19124 ? R 06:20 0:00 src/sgsn/osmo-sgsn -c /build/writtenconfig/osmo-sgsn.cfg7kbgkds5 build 12049 0.0 0.0 4280 740 ? S 06:20 0:00 /bin/sh -c ps xua | grep osmo build 12051 0.0 0.0 12784 968 ? S 06:20 0:00 grep osmo
Socket: in 1 tries, connected to 127.0.0.1:4245 <socket.socket fd=4, family=AddressFamily.AF_INET, type=SocketKind.SOCK_STREAM, proto=0, laddr=('127.0.0.1', 60688), raddr=('127.0.0.1', 4245)> (1 sockets open) Terminating took 0.897s Socket: closing 127.0.0.1:4245 <socket.socket fd=4, family=AddressFamily.AF_INET, type=SocketKind.SOCK_STREAM, proto=0, laddr=('127.0.0.1', 60688), raddr=('127.0.0.1', 4245)> (0 sockets open) Verifying src/sgsn/osmo-sgsn -c /build/writtenconfig/osmo-sgsn.cfg7kbgkds5, test token_vty_command Launching: PWD=/build 'src/sgsn/osmo-sgsn' '-c' '/build/writtenconfig/osmo-sgsn.cfg7kbgkds5'
ls -l /proc/11997/fd
total 0 lr-x------ 1 build build 64 Dec 16 06:20 0 -> pipe:[38968314] l-wx------ 1 build build 64 Dec 16 06:20 1 -> pipe:[38968315] l-wx------ 1 build build 64 Dec 16 06:20 2 -> pipe:[38968316] l-wx------ 1 build build 64 Dec 16 06:20 3 -> /dev/null
ss -tn
State Recv-Q Send-Q Local Address:Port Peer Address:Port
ss -tln
State Recv-Q Send-Q Local Address:Port Peer Address:Port
ps xua | grep osmo
build 11997 1.3 0.0 53984 20988 ? S 06:20 0:00 /usr/bin/python3 /usr/local/bin/osmotestconfig.py -p /build -w /build -v build 12053 0.0 0.0 21475111140 18288 ? S 06:20 0:00 src/sgsn/osmo-sgsn -c /build/writtenconfig/osmo-sgsn.cfg7kbgkds5 build 12060 0.0 0.0 4280 756 ? S 06:20 0:00 /bin/sh -c ps xua | grep osmo build 12062 0.0 0.0 12784 960 ? S 06:20 0:00 grep osmo
Socket: in 1 tries, connected to 127.0.0.1:4245 <socket.socket fd=4, family=AddressFamily.AF_INET, type=SocketKind.SOCK_STREAM, proto=0, laddr=('127.0.0.1', 60690), raddr=('127.0.0.1', 4245)> (1 sockets open) Terminating took 0.897s Socket: closing 127.0.0.1:4245 <socket.socket fd=4, family=AddressFamily.AF_INET, type=SocketKind.SOCK_STREAM, proto=0, laddr=('127.0.0.1', 60690), raddr=('127.0.0.1', 4245)> (0 sockets open) Verifying src/gtphub/osmo-gtphub -c /build/doc/examples/osmo-gtphub/osmo-gtphub-1iface.cfg, test verify_doc Launching: PWD=/build 'src/gtphub/osmo-gtphub' '-c' '/build/doc/examples/osmo-gtphub/osmo-gtphub-1iface.cfg'
ls -l /proc/11997/fd
total 0 lr-x------ 1 build build 64 Dec 16 06:20 0 -> pipe:[38968314] l-wx------ 1 build build 64 Dec 16 06:20 1 -> pipe:[38968315] l-wx------ 1 build build 64 Dec 16 06:20 2 -> pipe:[38968316] l-wx------ 1 build build 64 Dec 16 06:20 3 -> /dev/null
ss -tn
State Recv-Q Send-Q Local Address:Port Peer Address:Port
ss -tln
State Recv-Q Send-Q Local Address:Port Peer Address:Port
ps xua | grep osmo
build 11997 1.1 0.0 53984 20988 ? S 06:20 0:00 /usr/bin/python3 /usr/local/bin/osmotestconfig.py -p /build -w /build -v build 12064 0.0 0.0 21474963656 14000 ? S 06:20 0:00 src/gtphub/osmo-gtphub -c /build/doc/examples/osmo-gtphub/osmo-gtphub-1iface.cfg build 12071 0.0 0.0 4280 712 ? S 06:20 0:00 /bin/sh -c ps xua | grep osmo build 12073 0.0 0.0 12784 948 ? S 06:20 0:00 grep osmo
Socket: in 1 tries, connected to 127.0.0.1:4253 <socket.socket fd=4, family=AddressFamily.AF_INET, type=SocketKind.SOCK_STREAM, proto=0, laddr=('127.0.0.1', 51600), raddr=('127.0.0.1', 4253)> (1 sockets open) Terminating took 0.897s Socket: closing 127.0.0.1:4253 <socket.socket fd=4, family=AddressFamily.AF_INET, type=SocketKind.SOCK_STREAM, proto=0, laddr=('127.0.0.1', 51600), raddr=('127.0.0.1', 4253)> (0 sockets open) Verifying src/gtphub/osmo-gtphub -c /build/writtenconfig/osmo-gtphub-1iface.cfg_vi29se3, test write_config Launching: PWD=/build 'src/gtphub/osmo-gtphub' '-c' '/build/writtenconfig/osmo-gtphub-1iface.cfg_vi29se3'
ls -l /proc/11997/fd
total 0 lr-x------ 1 build build 64 Dec 16 06:20 0 -> pipe:[38968314] l-wx------ 1 build build 64 Dec 16 06:20 1 -> pipe:[38968315] l-wx------ 1 build build 64 Dec 16 06:20 2 -> pipe:[38968316] l-wx------ 1 build build 64 Dec 16 06:20 3 -> /dev/null
ss -tn
State Recv-Q Send-Q Local Address:Port Peer Address:Port
ss -tln
State Recv-Q Send-Q Local Address:Port Peer Address:Port
ps xua | grep osmo
build 11997 1.1 0.0 53984 20988 ? S 06:20 0:00 /usr/bin/python3 /usr/local/bin/osmotestconfig.py -p /build -w /build -v build 12075 0.0 0.0 21474963656 14240 ? S 06:20 0:00 src/gtphub/osmo-gtphub -c /build/writtenconfig/osmo-gtphub-1iface.cfg_vi29se3 build 12082 0.0 0.0 4280 712 ? S 06:20 0:00 /bin/sh -c ps xua | grep osmo build 12084 0.0 0.0 12784 964 ? S 06:20 0:00 grep osmo
Socket: in 1 tries, connected to 127.0.0.1:4253 <socket.socket fd=4, family=AddressFamily.AF_INET, type=SocketKind.SOCK_STREAM, proto=0, laddr=('127.0.0.1', 51604), raddr=('127.0.0.1', 4253)> (1 sockets open) Terminating took 0.897s Socket: closing 127.0.0.1:4253 <socket.socket fd=4, family=AddressFamily.AF_INET, type=SocketKind.SOCK_STREAM, proto=0, laddr=('127.0.0.1', 51604), raddr=('127.0.0.1', 4253)> (0 sockets open) Verifying src/gtphub/osmo-gtphub -c /build/writtenconfig/osmo-gtphub-1iface.cfg_vi29se3, test token_vty_command Launching: PWD=/build 'src/gtphub/osmo-gtphub' '-c' '/build/writtenconfig/osmo-gtphub-1iface.cfg_vi29se3'
ls -l /proc/11997/fd
total 0 lr-x------ 1 build build 64 Dec 16 06:20 0 -> pipe:[38968314] l-wx------ 1 build build 64 Dec 16 06:20 1 -> pipe:[38968315] l-wx------ 1 build build 64 Dec 16 06:20 2 -> pipe:[38968316] l-wx------ 1 build build 64 Dec 16 06:20 3 -> /dev/null
ss -tn
State Recv-Q Send-Q Local Address:Port Peer Address:Port
ss -tln
State Recv-Q Send-Q Local Address:Port Peer Address:Port LISTEN 0 10 127.0.0.1:4253 *:*
ps xua | grep osmo
build 11997 0.9 0.0 53984 20988 ? S 06:20 0:00 /usr/bin/python3 /usr/local/bin/osmotestconfig.py -p /build -w /build -v build 12086 0.0 0.0 21474963656 14148 ? S 06:20 0:00 src/gtphub/osmo-gtphub -c /build/writtenconfig/osmo-gtphub-1iface.cfg_vi29se3 build 12093 0.0 0.0 4280 736 ? S 06:20 0:00 /bin/sh -c ps xua | grep osmo build 12095 0.0 0.0 12784 968 ? S 06:20 0:00 grep osmo
ERRORS: 1 Socket: in 1 tries, connected to 127.0.0.1:4253 <socket.socket fd=4, family=AddressFamily.AF_INET, type=SocketKind.SOCK_STREAM, proto=0, laddr=('127.0.0.1', 51606), raddr=('127.0.0.1', 4253)> (1 sockets open) Terminating took 0.897s Socket: closing 127.0.0.1:4253 <socket.socket fd=4, family=AddressFamily.AF_INET, type=SocketKind.SOCK_STREAM, proto=0, laddr=('127.0.0.1', 51606), raddr=('127.0.0.1', 4253)> (0 sockets open) Makefile:710: recipe for target 'vty-python-test' failed make[7]: Leaving directory '/build/tests' make[7]: *** [vty-python-test] Error 1 Makefile:727: recipe for target 'vty-test' failed make[6]: Leaving directory '/build/tests' make[6]: *** [vty-test] Error 2 Makefile:704: recipe for target 'python-tests' failed make[5]: Leaving directory '/build/tests' make[5]: *** [python-tests] Error 2 Makefile:735: recipe for target 'check-local' failed make[4]: *** [check-local] Error 2 make[4]: Leaving directory '/build/tests' Makefile:564: recipe for target 'check-am' failed make[3]: Leaving directory '/build/tests' make[3]: *** [check-am] Error 2 Makefile:416: recipe for target 'check-recursive' failed make[2]: *** [check-recursive] Error 1 make[2]: Leaving directory '/build/tests' Makefile:461: recipe for target 'check-recursive' failed make[1]: Leaving directory '/build' make[1]: *** [check-recursive] Error 1 make: *** [check] Error 2 Makefile:752: recipe for target 'check' failed + cat-testlogs.sh Build step 'Execute shell' marked build as failure [WARNINGS]Skipping publisher since build result is FAILURE
Changes:
------------------------------------------ [...truncated 412.31 KB...] Config was ! ! OsmoGbProxy (1.6.0.108-3326) configuration saved from vty !! ! log stderr logging filter all 1 logging color 1 logging print category-hex 1 logging print category 0 logging timestamp 0 logging print file 1 logging level gprs debug logging level ns info logging level obj notice logging level lglobal notice logging level llapd notice logging level linp notice logging level lmux notice logging level lmi notice logging level lmib notice logging level lsms notice logging level lctrl notice logging level lgtp notice logging level lstats notice logging level lgsup notice logging level loap notice logging level lss7 notice logging level lsccp notice logging level lsua notice logging level lm3ua notice logging level lmgcp notice logging level ljibuf notice logging level lrspro notice logging level lns notice logging level lbssgp notice ! stats interval 5 ! line vty no login ! ns encapsulation framerelay-gre enabled 0 encapsulation udp local-ip 127.0.0.100 encapsulation udp local-port 23000 encapsulation udp use-reset-block-unblock enabled nse 101 nsvci 101 nse 101 remote-role sgsn nse 101 encapsulation udp nse 101 remote-ip 192.168.100.239 nse 101 remote-port 7777 timer tns-block 3 timer tns-block-retries 3 timer tns-reset 3 timer tns-reset-retries 3 timer tns-test 30 timer tns-alive 3 timer tns-alive-retries 10 timer tsns-prov 3 timer unknown 0x8 3 timer unknown 0x9 3 gbproxy sgsn nsei 101
State Recv-Q Send-Q Local Address:Port Peer Address:Port
ss -tln
State Recv-Q Send-Q Local Address:Port Peer Address:Port
ps xua | grep osmo
build 12460 1.4 0.0 53868 20992 ? S 06:21 0:00 /usr/bin/python3 /usr/local/bin/osmotestconfig.py -p /build -w /build -v build 12494 0.0 0.0 21474978780 17832 ? R 06:21 0:00 src/sgsn/osmo-sgsn -c /build/doc/examples/osmo-sgsn/osmo-sgsn.cfg build 12501 0.0 0.0 4280 708 ? S 06:21 0:00 /bin/sh -c ps xua | grep osmo build 12503 0.0 0.0 12784 968 ? S 06:21 0:00 grep osmo
Socket: in 1 tries, connected to 127.0.0.1:4245 <socket.socket fd=4, family=AddressFamily.AF_INET, type=SocketKind.SOCK_STREAM, proto=0, laddr=('127.0.0.1', 60782), raddr=('127.0.0.1', 4245)> (1 sockets open) Terminating took 0.897s Socket: closing 127.0.0.1:4245 <socket.socket fd=4, family=AddressFamily.AF_INET, type=SocketKind.SOCK_STREAM, proto=0, laddr=('127.0.0.1', 60782), raddr=('127.0.0.1', 4245)> (0 sockets open) Verifying src/sgsn/osmo-sgsn -c /build/writtenconfig/osmo-sgsn.cfgo3q23h2i, test write_config Launching: PWD=/build 'src/sgsn/osmo-sgsn' '-c' '/build/writtenconfig/osmo-sgsn.cfgo3q23h2i'
ls -l /proc/12460/fd
total 0 lr-x------ 1 build build 64 Dec 16 06:21 0 -> pipe:[38989736] l-wx------ 1 build build 64 Dec 16 06:21 1 -> pipe:[38989737] l-wx------ 1 build build 64 Dec 16 06:21 2 -> pipe:[38989738] l-wx------ 1 build build 64 Dec 16 06:21 3 -> /dev/null
ss -tn
State Recv-Q Send-Q Local Address:Port Peer Address:Port
ss -tln
State Recv-Q Send-Q Local Address:Port Peer Address:Port
ps xua | grep osmo
build 12460 1.4 0.0 54004 21080 ? S 06:21 0:00 /usr/bin/python3 /usr/local/bin/osmotestconfig.py -p /build -w /build -v build 12505 0.0 0.0 21474978780 18524 ? R 06:21 0:00 src/sgsn/osmo-sgsn -c /build/writtenconfig/osmo-sgsn.cfgo3q23h2i build 12512 0.0 0.0 4280 744 ? S 06:21 0:00 /bin/sh -c ps xua | grep osmo build 12514 0.0 0.0 12784 968 ? S 06:21 0:00 grep osmo
Socket: in 1 tries, connected to 127.0.0.1:4245 <socket.socket fd=4, family=AddressFamily.AF_INET, type=SocketKind.SOCK_STREAM, proto=0, laddr=('127.0.0.1', 60784), raddr=('127.0.0.1', 4245)> (1 sockets open) Terminating took 0.897s Socket: closing 127.0.0.1:4245 <socket.socket fd=4, family=AddressFamily.AF_INET, type=SocketKind.SOCK_STREAM, proto=0, laddr=('127.0.0.1', 60784), raddr=('127.0.0.1', 4245)> (0 sockets open) Verifying src/sgsn/osmo-sgsn -c /build/writtenconfig/osmo-sgsn.cfgo3q23h2i, test token_vty_command Launching: PWD=/build 'src/sgsn/osmo-sgsn' '-c' '/build/writtenconfig/osmo-sgsn.cfgo3q23h2i'
ls -l /proc/12460/fd
total 0 lr-x------ 1 build build 64 Dec 16 06:21 0 -> pipe:[38989736] l-wx------ 1 build build 64 Dec 16 06:21 1 -> pipe:[38989737] l-wx------ 1 build build 64 Dec 16 06:21 2 -> pipe:[38989738] l-wx------ 1 build build 64 Dec 16 06:21 3 -> /dev/null
ss -tn
State Recv-Q Send-Q Local Address:Port Peer Address:Port
ss -tln
State Recv-Q Send-Q Local Address:Port Peer Address:Port
ps xua | grep osmo
build 12460 1.0 0.0 54004 21080 ? S 06:21 0:00 /usr/bin/python3 /usr/local/bin/osmotestconfig.py -p /build -w /build -v build 12516 0.0 0.0 21474974552 17756 ? R 06:21 0:00 src/sgsn/osmo-sgsn -c /build/writtenconfig/osmo-sgsn.cfgo3q23h2i build 12523 0.0 0.0 4280 704 ? S 06:21 0:00 /bin/sh -c ps xua | grep osmo build 12525 0.0 0.0 12784 992 ? S 06:21 0:00 grep osmo
Connecting socket failed, retrying... Socket: in 2 tries, connected to 127.0.0.1:4245 <socket.socket fd=5, family=AddressFamily.AF_INET, type=SocketKind.SOCK_STREAM, proto=0, laddr=('127.0.0.1', 60788), raddr=('127.0.0.1', 4245)> (1 sockets open) Terminating took 0.897s Socket: closing 127.0.0.1:4245 <socket.socket fd=5, family=AddressFamily.AF_INET, type=SocketKind.SOCK_STREAM, proto=0, laddr=('127.0.0.1', 60788), raddr=('127.0.0.1', 4245)> (0 sockets open) Verifying src/gtphub/osmo-gtphub -c /build/doc/examples/osmo-gtphub/osmo-gtphub-1iface.cfg, test verify_doc Launching: PWD=/build 'src/gtphub/osmo-gtphub' '-c' '/build/doc/examples/osmo-gtphub/osmo-gtphub-1iface.cfg'
ls -l /proc/12460/fd
total 0 lr-x------ 1 build build 64 Dec 16 06:21 0 -> pipe:[38989736] l-wx------ 1 build build 64 Dec 16 06:21 1 -> pipe:[38989737] l-wx------ 1 build build 64 Dec 16 06:21 2 -> pipe:[38989738] l-wx------ 1 build build 64 Dec 16 06:21 3 -> /dev/null
ss -tn
State Recv-Q Send-Q Local Address:Port Peer Address:Port
ss -tln
State Recv-Q Send-Q Local Address:Port Peer Address:Port
ps xua | grep osmo
build 12460 1.0 0.0 54004 21080 ? S 06:21 0:00 /usr/bin/python3 /usr/local/bin/osmotestconfig.py -p /build -w /build -v build 12527 0.0 0.0 21474963656 14016 ? S 06:21 0:00 src/gtphub/osmo-gtphub -c /build/doc/examples/osmo-gtphub/osmo-gtphub-1iface.cfg build 12534 0.0 0.0 4280 708 ? S 06:21 0:00 /bin/sh -c ps xua | grep osmo build 12536 0.0 0.0 12784 972 ? S 06:21 0:00 grep osmo
Socket: in 1 tries, connected to 127.0.0.1:4253 <socket.socket fd=4, family=AddressFamily.AF_INET, type=SocketKind.SOCK_STREAM, proto=0, laddr=('127.0.0.1', 51698), raddr=('127.0.0.1', 4253)> (1 sockets open) Terminating took 0.897s Socket: closing 127.0.0.1:4253 <socket.socket fd=4, family=AddressFamily.AF_INET, type=SocketKind.SOCK_STREAM, proto=0, laddr=('127.0.0.1', 51698), raddr=('127.0.0.1', 4253)> (0 sockets open) Verifying src/gtphub/osmo-gtphub -c /build/writtenconfig/osmo-gtphub-1iface.cfgf9cngb0q, test write_config Launching: PWD=/build 'src/gtphub/osmo-gtphub' '-c' '/build/writtenconfig/osmo-gtphub-1iface.cfgf9cngb0q'
ls -l /proc/12460/fd
total 0 lr-x------ 1 build build 64 Dec 16 06:21 0 -> pipe:[38989736] l-wx------ 1 build build 64 Dec 16 06:21 1 -> pipe:[38989737] l-wx------ 1 build build 64 Dec 16 06:21 2 -> pipe:[38989738] l-wx------ 1 build build 64 Dec 16 06:21 3 -> /dev/null
ss -tn
State Recv-Q Send-Q Local Address:Port Peer Address:Port
ss -tln
State Recv-Q Send-Q Local Address:Port Peer Address:Port
ps xua | grep osmo
build 12460 0.8 0.0 54004 21080 ? S 06:21 0:00 /usr/bin/python3 /usr/local/bin/osmotestconfig.py -p /build -w /build -v build 12538 0.0 0.0 21474963656 14216 ? S 06:21 0:00 src/gtphub/osmo-gtphub -c /build/writtenconfig/osmo-gtphub-1iface.cfgf9cngb0q build 12545 0.0 0.0 4280 736 ? S 06:21 0:00 /bin/sh -c ps xua | grep osmo build 12547 0.0 0.0 12784 936 ? S 06:21 0:00 grep osmo
Socket: in 1 tries, connected to 127.0.0.1:4253 <socket.socket fd=4, family=AddressFamily.AF_INET, type=SocketKind.SOCK_STREAM, proto=0, laddr=('127.0.0.1', 51700), raddr=('127.0.0.1', 4253)> (1 sockets open) Terminating took 0.897s Socket: closing 127.0.0.1:4253 <socket.socket fd=4, family=AddressFamily.AF_INET, type=SocketKind.SOCK_STREAM, proto=0, laddr=('127.0.0.1', 51700), raddr=('127.0.0.1', 4253)> (0 sockets open) Verifying src/gtphub/osmo-gtphub -c /build/writtenconfig/osmo-gtphub-1iface.cfgf9cngb0q, test token_vty_command Launching: PWD=/build 'src/gtphub/osmo-gtphub' '-c' '/build/writtenconfig/osmo-gtphub-1iface.cfgf9cngb0q'
ls -l /proc/12460/fd
total 0 lr-x------ 1 build build 64 Dec 16 06:21 0 -> pipe:[38989736] l-wx------ 1 build build 64 Dec 16 06:21 1 -> pipe:[38989737] l-wx------ 1 build build 64 Dec 16 06:21 2 -> pipe:[38989738] l-wx------ 1 build build 64 Dec 16 06:21 3 -> /dev/null
ss -tn
State Recv-Q Send-Q Local Address:Port Peer Address:Port
ss -tln
State Recv-Q Send-Q Local Address:Port Peer Address:Port
ps xua | grep osmo
build 12460 0.8 0.0 54004 21080 ? S 06:21 0:00 /usr/bin/python3 /usr/local/bin/osmotestconfig.py -p /build -w /build -v build 12549 0.0 0.0 21474963656 14328 ? S 06:21 0:00 src/gtphub/osmo-gtphub -c /build/writtenconfig/osmo-gtphub-1iface.cfgf9cngb0q build 12556 0.0 0.0 4280 708 ? S 06:21 0:00 /bin/sh -c ps xua | grep osmo build 12558 0.0 0.0 12784 916 ? S 06:21 0:00 grep osmo
ERRORS: 1 Socket: in 1 tries, connected to 127.0.0.1:4253 <socket.socket fd=4, family=AddressFamily.AF_INET, type=SocketKind.SOCK_STREAM, proto=0, laddr=('127.0.0.1', 51704), raddr=('127.0.0.1', 4253)> (1 sockets open) Terminating took 0.897s Socket: closing 127.0.0.1:4253 <socket.socket fd=4, family=AddressFamily.AF_INET, type=SocketKind.SOCK_STREAM, proto=0, laddr=('127.0.0.1', 51704), raddr=('127.0.0.1', 4253)> (0 sockets open) make[7]: *** [vty-python-test] Error 1 Makefile:710: recipe for target 'vty-python-test' failed make[7]: Leaving directory '/build/tests' make[6]: *** [vty-test] Error 2 Makefile:727: recipe for target 'vty-test' failed make[6]: Leaving directory '/build/tests' Makefile:704: recipe for target 'python-tests' failed make[5]: Leaving directory '/build/tests' make[5]: *** [python-tests] Error 2 Makefile:735: recipe for target 'check-local' failed make[4]: Leaving directory '/build/tests' make[4]: *** [check-local] Error 2 Makefile:564: recipe for target 'check-am' failed make[3]: Leaving directory '/build/tests' make[3]: *** [check-am] Error 2 Makefile:416: recipe for target 'check-recursive' failed make[2]: Leaving directory '/build/tests' make[2]: *** [check-recursive] Error 1 Makefile:461: recipe for target 'check-recursive' failed make[1]: Leaving directory '/build' make[1]: *** [check-recursive] Error 1 Makefile:752: recipe for target 'check' failed make: *** [check] Error 2 + cat-testlogs.sh Build step 'Execute shell' marked build as failure [WARNINGS]Skipping publisher since build result is FAILURE
Changes:
------------------------------------------ [...truncated 412.55 KB...] !! ! log stderr logging filter all 1 logging color 1 logging print category-hex 1 logging print category 0 logging timestamp 0 logging print file 1 logging level gprs debug logging level ns info logging level obj notice logging level lglobal notice logging level llapd notice logging level linp notice logging level lmux notice logging level lmi notice logging level lmib notice logging level lsms notice logging level lctrl notice logging level lgtp notice logging level lstats notice logging level lgsup notice logging level loap notice logging level lss7 notice logging level lsccp notice logging level lsua notice logging level lm3ua notice logging level lmgcp notice logging level ljibuf notice logging level lrspro notice logging level lns notice logging level lbssgp notice ! stats interval 5 ! line vty no login ! ns encapsulation framerelay-gre enabled 0 encapsulation udp local-ip 127.0.0.100 encapsulation udp local-port 23000 encapsulation udp use-reset-block-unblock enabled nse 101 nsvci 101 nse 101 remote-role sgsn nse 101 encapsulation udp nse 101 remote-ip 192.168.100.239 nse 101 remote-port 7777 timer tns-block 3 timer tns-block-retries 3 timer tns-reset 3 timer tns-reset-retries 3 timer tns-test 30 timer tns-alive 3 timer tns-alive-retries 10 timer tsns-prov 3 timer unknown 0x8 3 timer unknown 0x9 3 gbproxy sgsn nsei 101
ss -tn
State Recv-Q Send-Q Local Address:Port Peer Address:Port
ss -tln
State Recv-Q Send-Q Local Address:Port Peer Address:Port
ps xua | grep osmo
build 11997 1.1 0.0 53980 21112 ? S 06:29 0:00 /usr/bin/python3 /usr/local/bin/osmotestconfig.py -p /build -w /build -v build 12031 0.0 0.0 21475111140 18304 ? S 06:29 0:00 src/sgsn/osmo-sgsn -c /build/doc/examples/osmo-sgsn/osmo-sgsn.cfg build 12038 0.0 0.0 4280 708 ? S 06:29 0:00 /bin/sh -c ps xua | grep osmo build 12040 0.0 0.0 12784 968 ? S 06:29 0:00 grep osmo
Socket: in 1 tries, connected to 127.0.0.1:4245 <socket.socket fd=4, family=AddressFamily.AF_INET, type=SocketKind.SOCK_STREAM, proto=0, laddr=('127.0.0.1', 60998), raddr=('127.0.0.1', 4245)> (1 sockets open) Terminating took 0.897s Socket: closing 127.0.0.1:4245 <socket.socket fd=4, family=AddressFamily.AF_INET, type=SocketKind.SOCK_STREAM, proto=0, laddr=('127.0.0.1', 60998), raddr=('127.0.0.1', 4245)> (0 sockets open) Verifying src/sgsn/osmo-sgsn -c /build/writtenconfig/osmo-sgsn.cfgf5_j0sdg, test write_config Launching: PWD=/build 'src/sgsn/osmo-sgsn' '-c' '/build/writtenconfig/osmo-sgsn.cfgf5_j0sdg'
ls -l /proc/11997/fd
total 0 lr-x------ 1 build build 64 Dec 16 06:29 0 -> pipe:[39448081] l-wx------ 1 build build 64 Dec 16 06:29 1 -> pipe:[39448082] l-wx------ 1 build build 64 Dec 16 06:29 2 -> pipe:[39448083] l-wx------ 1 build build 64 Dec 16 06:29 3 -> /dev/null
ss -tn
State Recv-Q Send-Q Local Address:Port Peer Address:Port
ss -tln
State Recv-Q Send-Q Local Address:Port Peer Address:Port
ps xua | grep osmo
build 11997 1.1 0.0 53980 21200 ? S 06:29 0:00 /usr/bin/python3 /usr/local/bin/osmotestconfig.py -p /build -w /build -v build 12042 1.0 0.0 21475111140 22884 ? R 06:29 0:00 src/sgsn/osmo-sgsn -c /build/writtenconfig/osmo-sgsn.cfgf5_j0sdg build 12049 0.0 0.0 4280 768 ? S 06:29 0:00 /bin/sh -c ps xua | grep osmo build 12051 0.0 0.0 12784 924 ? S 06:29 0:00 grep osmo
Socket: in 1 tries, connected to 127.0.0.1:4245 <socket.socket fd=4, family=AddressFamily.AF_INET, type=SocketKind.SOCK_STREAM, proto=0, laddr=('127.0.0.1', 32768), raddr=('127.0.0.1', 4245)> (1 sockets open) Terminating took 0.897s Socket: closing 127.0.0.1:4245 <socket.socket fd=4, family=AddressFamily.AF_INET, type=SocketKind.SOCK_STREAM, proto=0, laddr=('127.0.0.1', 32768), raddr=('127.0.0.1', 4245)> (0 sockets open) Verifying src/sgsn/osmo-sgsn -c /build/writtenconfig/osmo-sgsn.cfgf5_j0sdg, test token_vty_command Launching: PWD=/build 'src/sgsn/osmo-sgsn' '-c' '/build/writtenconfig/osmo-sgsn.cfgf5_j0sdg'
ls -l /proc/11997/fd
total 0 lr-x------ 1 build build 64 Dec 16 06:29 0 -> pipe:[39448081] l-wx------ 1 build build 64 Dec 16 06:29 1 -> pipe:[39448082] l-wx------ 1 build build 64 Dec 16 06:29 2 -> pipe:[39448083] l-wx------ 1 build build 64 Dec 16 06:29 3 -> /dev/null
ss -tn
State Recv-Q Send-Q Local Address:Port Peer Address:Port
ss -tln
State Recv-Q Send-Q Local Address:Port Peer Address:Port
ps xua | grep osmo
build 11997 0.9 0.0 53980 21200 ? S 06:29 0:00 /usr/bin/python3 /usr/local/bin/osmotestconfig.py -p /build -w /build -v build 12053 0.0 0.0 21475044960 24144 ? R 06:29 0:00 src/sgsn/osmo-sgsn -c /build/writtenconfig/osmo-sgsn.cfgf5_j0sdg build 12060 0.0 0.0 4280 708 ? S 06:29 0:00 /bin/sh -c ps xua | grep osmo build 12062 0.0 0.0 12784 956 ? S 06:29 0:00 grep osmo
Socket: in 1 tries, connected to 127.0.0.1:4245 <socket.socket fd=4, family=AddressFamily.AF_INET, type=SocketKind.SOCK_STREAM, proto=0, laddr=('127.0.0.1', 32774), raddr=('127.0.0.1', 4245)> (1 sockets open) Terminating took 0.897s Socket: closing 127.0.0.1:4245 <socket.socket fd=4, family=AddressFamily.AF_INET, type=SocketKind.SOCK_STREAM, proto=0, laddr=('127.0.0.1', 32774), raddr=('127.0.0.1', 4245)> (0 sockets open) Verifying src/gtphub/osmo-gtphub -c /build/doc/examples/osmo-gtphub/osmo-gtphub-1iface.cfg, test verify_doc Launching: PWD=/build 'src/gtphub/osmo-gtphub' '-c' '/build/doc/examples/osmo-gtphub/osmo-gtphub-1iface.cfg'
ls -l /proc/11997/fd
total 0 lr-x------ 1 build build 64 Dec 16 06:29 0 -> pipe:[39448081] l-wx------ 1 build build 64 Dec 16 06:29 1 -> pipe:[39448082] l-wx------ 1 build build 64 Dec 16 06:29 2 -> pipe:[39448083] l-wx------ 1 build build 64 Dec 16 06:29 3 -> /dev/null
ss -tn
State Recv-Q Send-Q Local Address:Port Peer Address:Port
ss -tln
State Recv-Q Send-Q Local Address:Port Peer Address:Port LISTEN 0 10 127.0.0.1:4253 *:*
ps xua | grep osmo
build 11997 0.9 0.0 53980 21200 ? S 06:29 0:00 /usr/bin/python3 /usr/local/bin/osmotestconfig.py -p /build -w /build -v build 12064 0.0 0.0 21474963656 14172 ? S 06:29 0:00 src/gtphub/osmo-gtphub -c /build/doc/examples/osmo-gtphub/osmo-gtphub-1iface.cfg build 12071 0.0 0.0 4280 704 ? S 06:29 0:00 /bin/sh -c ps xua | grep osmo build 12073 0.0 0.0 4280 88 ? R 06:29 0:00 /bin/sh -c ps xua | grep osmo
Socket: in 1 tries, connected to 127.0.0.1:4253 <socket.socket fd=4, family=AddressFamily.AF_INET, type=SocketKind.SOCK_STREAM, proto=0, laddr=('127.0.0.1', 51916), raddr=('127.0.0.1', 4253)> (1 sockets open) Terminating took 0.897s Socket: closing 127.0.0.1:4253 <socket.socket fd=4, family=AddressFamily.AF_INET, type=SocketKind.SOCK_STREAM, proto=0, laddr=('127.0.0.1', 51916), raddr=('127.0.0.1', 4253)> (0 sockets open) Verifying src/gtphub/osmo-gtphub -c /build/writtenconfig/osmo-gtphub-1iface.cfggwbjg4y9, test write_config Launching: PWD=/build 'src/gtphub/osmo-gtphub' '-c' '/build/writtenconfig/osmo-gtphub-1iface.cfggwbjg4y9'
ls -l /proc/11997/fd
total 0 lr-x------ 1 build build 64 Dec 16 06:29 0 -> pipe:[39448081] l-wx------ 1 build build 64 Dec 16 06:29 1 -> pipe:[39448082] l-wx------ 1 build build 64 Dec 16 06:29 2 -> pipe:[39448083] l-wx------ 1 build build 64 Dec 16 06:29 3 -> /dev/null
ss -tn
State Recv-Q Send-Q Local Address:Port Peer Address:Port
ss -tln
State Recv-Q Send-Q Local Address:Port Peer Address:Port
ps xua | grep osmo
build 11997 0.8 0.0 53980 21200 ? S 06:29 0:00 /usr/bin/python3 /usr/local/bin/osmotestconfig.py -p /build -w /build -v build 12075 0.0 0.0 21474963656 13956 ? S 06:29 0:00 src/gtphub/osmo-gtphub -c /build/writtenconfig/osmo-gtphub-1iface.cfggwbjg4y9 build 12082 0.0 0.0 4280 740 ? S 06:29 0:00 /bin/sh -c ps xua | grep osmo build 12084 0.0 0.0 12784 940 ? S 06:29 0:00 grep osmo
Socket: in 1 tries, connected to 127.0.0.1:4253 <socket.socket fd=4, family=AddressFamily.AF_INET, type=SocketKind.SOCK_STREAM, proto=0, laddr=('127.0.0.1', 51918), raddr=('127.0.0.1', 4253)> (1 sockets open) Terminating took 0.897s Socket: closing 127.0.0.1:4253 <socket.socket fd=4, family=AddressFamily.AF_INET, type=SocketKind.SOCK_STREAM, proto=0, laddr=('127.0.0.1', 51918), raddr=('127.0.0.1', 4253)> (0 sockets open) Verifying src/gtphub/osmo-gtphub -c /build/writtenconfig/osmo-gtphub-1iface.cfggwbjg4y9, test token_vty_command Launching: PWD=/build 'src/gtphub/osmo-gtphub' '-c' '/build/writtenconfig/osmo-gtphub-1iface.cfggwbjg4y9'
ls -l /proc/11997/fd
total 0 lr-x------ 1 build build 64 Dec 16 06:29 0 -> pipe:[39448081] l-wx------ 1 build build 64 Dec 16 06:29 1 -> pipe:[39448082] l-wx------ 1 build build 64 Dec 16 06:29 2 -> pipe:[39448083] l-wx------ 1 build build 64 Dec 16 06:29 3 -> /dev/null
ss -tn
State Recv-Q Send-Q Local Address:Port Peer Address:Port
ss -tln
State Recv-Q Send-Q Local Address:Port Peer Address:Port
ps xua | grep osmo
build 11997 0.8 0.0 53980 21200 ? S 06:29 0:00 /usr/bin/python3 /usr/local/bin/osmotestconfig.py -p /build -w /build -v build 12086 0.0 0.0 21474963656 14256 ? S 06:29 0:00 src/gtphub/osmo-gtphub -c /build/writtenconfig/osmo-gtphub-1iface.cfggwbjg4y9 build 12093 0.0 0.0 4280 704 ? S 06:29 0:00 /bin/sh -c ps xua | grep osmo build 12095 0.0 0.0 12784 1012 ? S 06:29 0:00 grep osmo
Socket: in 1 tries, connected to 127.0.0.1:4253 <socket.socket fd=4, family=AddressFamily.AF_INET, type=SocketKind.SOCK_STREAM, proto=0, laddr=('127.0.0.1', 51922), raddr=('127.0.0.1', 4253)> (1 sockets open) Terminating took 0.897s Socket: closing 127.0.0.1:4253 <socket.socket fd=4, family=AddressFamily.AF_INET, type=SocketKind.SOCK_STREAM, proto=0, laddr=('127.0.0.1', 51922), raddr=('127.0.0.1', 4253)> (0 sockets open) ERRORS: 1 make[7]: *** [vty-python-test] Error 1 Makefile:710: recipe for target 'vty-python-test' failed make[7]: Leaving directory '/build/tests' Makefile:727: recipe for target 'vty-test' failed make[6]: Leaving directory '/build/tests' make[6]: *** [vty-test] Error 2 make[5]: *** [python-tests] Error 2 Makefile:704: recipe for target 'python-tests' failed make[5]: Leaving directory '/build/tests' make[4]: *** [check-local] Error 2 Makefile:735: recipe for target 'check-local' failed make[4]: Leaving directory '/build/tests' Makefile:564: recipe for target 'check-am' failed make[3]: Leaving directory '/build/tests' make[3]: *** [check-am] Error 2 Makefile:416: recipe for target 'check-recursive' failed make[2]: Leaving directory '/build/tests' make[2]: *** [check-recursive] Error 1 Makefile:461: recipe for target 'check-recursive' failed make[1]: *** [check-recursive] Error 1 make[1]: Leaving directory '/build' make: *** [check] Error 2 Makefile:752: recipe for target 'check' failed + cat-testlogs.sh Build step 'Execute shell' marked build as failure [WARNINGS]Skipping publisher since build result is FAILURE
Changes:
------------------------------------------ [...truncated 411.26 KB...] ! ! OsmoGbProxy (1.6.0.108-3326) configuration saved from vty !! ! log stderr logging filter all 1 logging color 1 logging print category-hex 1 logging print category 0 logging timestamp 0 logging print file 1 logging level gprs debug logging level ns info logging level obj notice logging level lglobal notice logging level llapd notice logging level linp notice logging level lmux notice logging level lmi notice logging level lmib notice logging level lsms notice logging level lctrl notice logging level lgtp notice logging level lstats notice logging level lgsup notice logging level loap notice logging level lss7 notice logging level lsccp notice logging level lsua notice logging level lm3ua notice logging level lmgcp notice logging level ljibuf notice logging level lrspro notice logging level lns notice logging level lbssgp notice ! stats interval 5 ! line vty no login ! ns encapsulation framerelay-gre enabled 0 encapsulation udp local-ip 127.0.0.100 encapsulation udp local-port 23000 encapsulation udp use-reset-block-unblock enabled nse 101 nsvci 101 nse 101 remote-role sgsn nse 101 encapsulation udp nse 101 remote-ip 192.168.100.239 nse 101 remote-port 7777 timer tns-block 3 timer tns-block-retries 3 timer tns-reset 3 timer tns-reset-retries 3 timer tns-test 30 timer tns-alive 3 timer tns-alive-retries 10 timer tsns-prov 3 timer unknown 0x8 3 timer unknown 0x9 3 gbproxy sgsn nsei 101
State Recv-Q Send-Q Local Address:Port Peer Address:Port
ss -tln
State Recv-Q Send-Q Local Address:Port Peer Address:Port
ps xua | grep osmo
build 11999 2.1 0.0 53908 21068 ? S 07:38 0:00 /usr/bin/python3 /usr/local/bin/osmotestconfig.py -p /build -w /build -v build 12033 0.0 0.0 21475044960 25316 ? R 07:38 0:00 src/sgsn/osmo-sgsn -c /build/doc/examples/osmo-sgsn/osmo-sgsn.cfg build 12040 0.0 0.0 4280 712 ? S 07:38 0:00 /bin/sh -c ps xua | grep osmo build 12042 0.0 0.0 12784 940 ? S 07:38 0:00 grep osmo
Socket: in 1 tries, connected to 127.0.0.1:4245 <socket.socket fd=4, family=AddressFamily.AF_INET, type=SocketKind.SOCK_STREAM, proto=0, laddr=('127.0.0.1', 33166), raddr=('127.0.0.1', 4245)> (1 sockets open) Terminating took 0.897s Socket: closing 127.0.0.1:4245 <socket.socket fd=4, family=AddressFamily.AF_INET, type=SocketKind.SOCK_STREAM, proto=0, laddr=('127.0.0.1', 33166), raddr=('127.0.0.1', 4245)> (0 sockets open) Verifying src/sgsn/osmo-sgsn -c /build/writtenconfig/osmo-sgsn.cfglvdupelw, test write_config Launching: PWD=/build 'src/sgsn/osmo-sgsn' '-c' '/build/writtenconfig/osmo-sgsn.cfglvdupelw'
ls -l /proc/11999/fd
total 0 lr-x------ 1 build build 64 Dec 16 07:38 0 -> pipe:[40214622] l-wx------ 1 build build 64 Dec 16 07:38 1 -> pipe:[40214623] l-wx------ 1 build build 64 Dec 16 07:38 2 -> pipe:[40214624] l-wx------ 1 build build 64 Dec 16 07:38 3 -> /dev/null
ss -tn
State Recv-Q Send-Q Local Address:Port Peer Address:Port
ss -tln
State Recv-Q Send-Q Local Address:Port Peer Address:Port
ps xua | grep osmo
build 11999 1.8 0.0 54040 21156 ? S 07:38 0:00 /usr/bin/python3 /usr/local/bin/osmotestconfig.py -p /build -w /build -v build 12044 0.0 0.0 21475111140 18204 ? S 07:38 0:00 src/sgsn/osmo-sgsn -c /build/writtenconfig/osmo-sgsn.cfglvdupelw build 12051 0.0 0.0 4280 744 ? S 07:38 0:00 /bin/sh -c ps xua | grep osmo build 12053 0.0 0.0 12784 944 ? S 07:38 0:00 grep osmo
Socket: in 1 tries, connected to 127.0.0.1:4245 <socket.socket fd=4, family=AddressFamily.AF_INET, type=SocketKind.SOCK_STREAM, proto=0, laddr=('127.0.0.1', 33168), raddr=('127.0.0.1', 4245)> (1 sockets open) Terminating took 0.897s Socket: closing 127.0.0.1:4245 <socket.socket fd=4, family=AddressFamily.AF_INET, type=SocketKind.SOCK_STREAM, proto=0, laddr=('127.0.0.1', 33168), raddr=('127.0.0.1', 4245)> (0 sockets open) Verifying src/sgsn/osmo-sgsn -c /build/writtenconfig/osmo-sgsn.cfglvdupelw, test token_vty_command Launching: PWD=/build 'src/sgsn/osmo-sgsn' '-c' '/build/writtenconfig/osmo-sgsn.cfglvdupelw'
ls -l /proc/11999/fd
total 0 lr-x------ 1 build build 64 Dec 16 07:38 0 -> pipe:[40214622] l-wx------ 1 build build 64 Dec 16 07:38 1 -> pipe:[40214623] l-wx------ 1 build build 64 Dec 16 07:38 2 -> pipe:[40214624] l-wx------ 1 build build 64 Dec 16 07:38 3 -> /dev/null
ss -tn
State Recv-Q Send-Q Local Address:Port Peer Address:Port
ss -tln
State Recv-Q Send-Q Local Address:Port Peer Address:Port
ps xua | grep osmo
build 11999 1.3 0.0 54040 21156 ? S 07:38 0:00 /usr/bin/python3 /usr/local/bin/osmotestconfig.py -p /build -w /build -v build 12055 0.0 0.0 21474974552 17580 ? R 07:38 0:00 src/sgsn/osmo-sgsn -c /build/writtenconfig/osmo-sgsn.cfglvdupelw build 12062 0.0 0.0 4280 700 ? S 07:38 0:00 /bin/sh -c ps xua | grep osmo build 12064 0.0 0.0 12784 1028 ? S 07:38 0:00 grep osmo
Connecting socket failed, retrying... Socket: in 2 tries, connected to 127.0.0.1:4245 <socket.socket fd=5, family=AddressFamily.AF_INET, type=SocketKind.SOCK_STREAM, proto=0, laddr=('127.0.0.1', 33172), raddr=('127.0.0.1', 4245)> (1 sockets open) Terminating took 0.897s Socket: closing 127.0.0.1:4245 <socket.socket fd=5, family=AddressFamily.AF_INET, type=SocketKind.SOCK_STREAM, proto=0, laddr=('127.0.0.1', 33172), raddr=('127.0.0.1', 4245)> (0 sockets open) Verifying src/gtphub/osmo-gtphub -c /build/doc/examples/osmo-gtphub/osmo-gtphub-1iface.cfg, test verify_doc Launching: PWD=/build 'src/gtphub/osmo-gtphub' '-c' '/build/doc/examples/osmo-gtphub/osmo-gtphub-1iface.cfg'
ls -l /proc/11999/fd
total 0 lr-x------ 1 build build 64 Dec 16 07:38 0 -> pipe:[40214622] l-wx------ 1 build build 64 Dec 16 07:38 1 -> pipe:[40214623] l-wx------ 1 build build 64 Dec 16 07:38 2 -> pipe:[40214624] l-wx------ 1 build build 64 Dec 16 07:38 3 -> /dev/null
ss -tn
State Recv-Q Send-Q Local Address:Port Peer Address:Port
ss -tln
State Recv-Q Send-Q Local Address:Port Peer Address:Port
ps xua | grep osmo
build 11999 1.1 0.0 54040 21156 ? S 07:38 0:00 /usr/bin/python3 /usr/local/bin/osmotestconfig.py -p /build -w /build -v build 12066 0.0 0.0 21474963656 14236 ? S 07:38 0:00 src/gtphub/osmo-gtphub -c /build/doc/examples/osmo-gtphub/osmo-gtphub-1iface.cfg build 12073 0.0 0.0 4280 708 ? S 07:38 0:00 /bin/sh -c ps xua | grep osmo build 12075 0.0 0.0 12784 964 ? S 07:38 0:00 grep osmo
Socket: in 1 tries, connected to 127.0.0.1:4253 <socket.socket fd=4, family=AddressFamily.AF_INET, type=SocketKind.SOCK_STREAM, proto=0, laddr=('127.0.0.1', 52314), raddr=('127.0.0.1', 4253)> (1 sockets open) Terminating took 0.897s Socket: closing 127.0.0.1:4253 <socket.socket fd=4, family=AddressFamily.AF_INET, type=SocketKind.SOCK_STREAM, proto=0, laddr=('127.0.0.1', 52314), raddr=('127.0.0.1', 4253)> (0 sockets open) Verifying src/gtphub/osmo-gtphub -c /build/writtenconfig/osmo-gtphub-1iface.cfgf017l0wy, test write_config Launching: PWD=/build 'src/gtphub/osmo-gtphub' '-c' '/build/writtenconfig/osmo-gtphub-1iface.cfgf017l0wy'
ls -l /proc/11999/fd
total 0 lr-x------ 1 build build 64 Dec 16 07:38 0 -> pipe:[40214622] l-wx------ 1 build build 64 Dec 16 07:38 1 -> pipe:[40214623] l-wx------ 1 build build 64 Dec 16 07:38 2 -> pipe:[40214624] l-wx------ 1 build build 64 Dec 16 07:38 3 -> /dev/null
ss -tn
State Recv-Q Send-Q Local Address:Port Peer Address:Port
ss -tln
State Recv-Q Send-Q Local Address:Port Peer Address:Port LISTEN 0 10 127.0.0.1:4253 *:*
ps xua | grep osmo
build 11999 1.1 0.0 54040 21156 ? S 07:38 0:00 /usr/bin/python3 /usr/local/bin/osmotestconfig.py -p /build -w /build -v build 12077 0.0 0.0 21474963656 14120 ? S 07:38 0:00 src/gtphub/osmo-gtphub -c /build/writtenconfig/osmo-gtphub-1iface.cfgf017l0wy build 12084 0.0 0.0 4280 748 ? S 07:38 0:00 /bin/sh -c ps xua | grep osmo build 12086 0.0 0.0 12784 932 ? S 07:38 0:00 grep osmo
Socket: in 1 tries, connected to 127.0.0.1:4253 <socket.socket fd=4, family=AddressFamily.AF_INET, type=SocketKind.SOCK_STREAM, proto=0, laddr=('127.0.0.1', 52316), raddr=('127.0.0.1', 4253)> (1 sockets open) Terminating took 0.897s Socket: closing 127.0.0.1:4253 <socket.socket fd=4, family=AddressFamily.AF_INET, type=SocketKind.SOCK_STREAM, proto=0, laddr=('127.0.0.1', 52316), raddr=('127.0.0.1', 4253)> (0 sockets open) Verifying src/gtphub/osmo-gtphub -c /build/writtenconfig/osmo-gtphub-1iface.cfgf017l0wy, test token_vty_command Launching: PWD=/build 'src/gtphub/osmo-gtphub' '-c' '/build/writtenconfig/osmo-gtphub-1iface.cfgf017l0wy'
ls -l /proc/11999/fd
total 0 lr-x------ 1 build build 64 Dec 16 07:38 0 -> pipe:[40214622] l-wx------ 1 build build 64 Dec 16 07:38 1 -> pipe:[40214623] l-wx------ 1 build build 64 Dec 16 07:38 2 -> pipe:[40214624] l-wx------ 1 build build 64 Dec 16 07:38 3 -> /dev/null
ss -tn
State Recv-Q Send-Q Local Address:Port Peer Address:Port
ss -tln
State Recv-Q Send-Q Local Address:Port Peer Address:Port
ps xua | grep osmo
build 11999 1.0 0.0 54040 21156 ? S 07:38 0:00 /usr/bin/python3 /usr/local/bin/osmotestconfig.py -p /build -w /build -v build 12088 0.0 0.0 21474963656 14440 ? S 07:38 0:00 src/gtphub/osmo-gtphub -c /build/writtenconfig/osmo-gtphub-1iface.cfgf017l0wy build 12095 0.0 0.0 4280 716 ? S 07:38 0:00 /bin/sh -c ps xua | grep osmo build 12097 0.0 0.0 12784 1028 ? S 07:38 0:00 grep osmo
ERRORS: 1 Socket: in 1 tries, connected to 127.0.0.1:4253 <socket.socket fd=4, family=AddressFamily.AF_INET, type=SocketKind.SOCK_STREAM, proto=0, laddr=('127.0.0.1', 52318), raddr=('127.0.0.1', 4253)> (1 sockets open) Terminating took 0.897s Socket: closing 127.0.0.1:4253 <socket.socket fd=4, family=AddressFamily.AF_INET, type=SocketKind.SOCK_STREAM, proto=0, laddr=('127.0.0.1', 52318), raddr=('127.0.0.1', 4253)> (0 sockets open) make[7]: *** [vty-python-test] Error 1 Makefile:710: recipe for target 'vty-python-test' failed make[7]: Leaving directory '/build/tests' Makefile:727: recipe for target 'vty-test' failed make[6]: Leaving directory '/build/tests' make[6]: *** [vty-test] Error 2 make[5]: *** [python-tests] Error 2 Makefile:704: recipe for target 'python-tests' failed make[5]: Leaving directory '/build/tests' Makefile:735: recipe for target 'check-local' failed make[4]: Leaving directory '/build/tests' make[4]: *** [check-local] Error 2 Makefile:564: recipe for target 'check-am' failed make[3]: Leaving directory '/build/tests' make[3]: *** [check-am] Error 2 Makefile:416: recipe for target 'check-recursive' failed make[2]: Leaving directory '/build/tests' make[2]: *** [check-recursive] Error 1 make[1]: *** [check-recursive] Error 1 Makefile:461: recipe for target 'check-recursive' failed make[1]: Leaving directory '/build' Makefile:752: recipe for target 'check' failed make: *** [check] Error 2 + cat-testlogs.sh Build step 'Execute shell' marked build as failure [WARNINGS]Skipping publisher since build result is FAILURE
Changes:
------------------------------------------ [...truncated 412.63 KB...] ! OsmoGbProxy (1.6.0.108-3326) configuration saved from vty !! ! log stderr logging filter all 1 logging color 1 logging print category-hex 1 logging print category 0 logging timestamp 0 logging print file 1 logging level gprs debug logging level ns info logging level obj notice logging level lglobal notice logging level llapd notice logging level linp notice logging level lmux notice logging level lmi notice logging level lmib notice logging level lsms notice logging level lctrl notice logging level lgtp notice logging level lstats notice logging level lgsup notice logging level loap notice logging level lss7 notice logging level lsccp notice logging level lsua notice logging level lm3ua notice logging level lmgcp notice logging level ljibuf notice logging level lrspro notice logging level lns notice logging level lbssgp notice ! stats interval 5 ! line vty no login ! ns encapsulation framerelay-gre enabled 0 encapsulation udp local-ip 127.0.0.100 encapsulation udp local-port 23000 encapsulation udp use-reset-block-unblock enabled nse 101 nsvci 101 nse 101 remote-role sgsn nse 101 encapsulation udp nse 101 remote-ip 192.168.100.239 nse 101 remote-port 7777 timer tns-block 3 timer tns-block-retries 3 timer tns-reset 3 timer tns-reset-retries 3 timer tns-test 30 timer tns-alive 3 timer tns-alive-retries 10 timer tsns-prov 3 timer unknown 0x8 3 timer unknown 0x9 3 gbproxy sgsn nsei 101
State Recv-Q Send-Q Local Address:Port Peer Address:Port
ss -tln
State Recv-Q Send-Q Local Address:Port Peer Address:Port
ps xua | grep osmo
build 12232 2.1 0.0 53908 21060 ? S 07:41 0:00 /usr/bin/python3 /usr/local/bin/osmotestconfig.py -p /build -w /build -v build 12266 0.0 0.0 21475111140 18300 ? S 07:41 0:00 src/sgsn/osmo-sgsn -c /build/doc/examples/osmo-sgsn/osmo-sgsn.cfg build 12273 0.0 0.0 4280 772 ? S 07:41 0:00 /bin/sh -c ps xua | grep osmo build 12275 0.0 0.0 12784 976 ? S 07:41 0:00 grep osmo
Socket: in 1 tries, connected to 127.0.0.1:4245 <socket.socket fd=4, family=AddressFamily.AF_INET, type=SocketKind.SOCK_STREAM, proto=0, laddr=('127.0.0.1', 33270), raddr=('127.0.0.1', 4245)> (1 sockets open) Terminating took 0.897s Socket: closing 127.0.0.1:4245 <socket.socket fd=4, family=AddressFamily.AF_INET, type=SocketKind.SOCK_STREAM, proto=0, laddr=('127.0.0.1', 33270), raddr=('127.0.0.1', 4245)> (0 sockets open) Verifying src/sgsn/osmo-sgsn -c /build/writtenconfig/osmo-sgsn.cfgrswvvpr7, test write_config Launching: PWD=/build 'src/sgsn/osmo-sgsn' '-c' '/build/writtenconfig/osmo-sgsn.cfgrswvvpr7'
ls -l /proc/12232/fd
total 0 lr-x------ 1 build build 64 Dec 16 07:41 0 -> pipe:[40244260] l-wx------ 1 build build 64 Dec 16 07:41 1 -> pipe:[40244261] l-wx------ 1 build build 64 Dec 16 07:41 2 -> pipe:[40244262] l-wx------ 1 build build 64 Dec 16 07:41 3 -> /dev/null
ss -tn
State Recv-Q Send-Q Local Address:Port Peer Address:Port
ss -tln
State Recv-Q Send-Q Local Address:Port Peer Address:Port
ps xua | grep osmo
build 12232 2.0 0.0 54040 21148 ? S 07:41 0:00 /usr/bin/python3 /usr/local/bin/osmotestconfig.py -p /build -w /build -v build 12277 0.0 0.0 21475111140 18864 ? R 07:41 0:00 src/sgsn/osmo-sgsn -c /build/writtenconfig/osmo-sgsn.cfgrswvvpr7 build 12284 0.0 0.0 4280 748 ? S 07:41 0:00 /bin/sh -c ps xua | grep osmo build 12286 0.0 0.0 12784 948 ? S 07:41 0:00 grep osmo
Socket: in 1 tries, connected to 127.0.0.1:4245 <socket.socket fd=4, family=AddressFamily.AF_INET, type=SocketKind.SOCK_STREAM, proto=0, laddr=('127.0.0.1', 33272), raddr=('127.0.0.1', 4245)> (1 sockets open) Terminating took 0.897s Socket: closing 127.0.0.1:4245 <socket.socket fd=4, family=AddressFamily.AF_INET, type=SocketKind.SOCK_STREAM, proto=0, laddr=('127.0.0.1', 33272), raddr=('127.0.0.1', 4245)> (0 sockets open) Verifying src/sgsn/osmo-sgsn -c /build/writtenconfig/osmo-sgsn.cfgrswvvpr7, test token_vty_command Launching: PWD=/build 'src/sgsn/osmo-sgsn' '-c' '/build/writtenconfig/osmo-sgsn.cfgrswvvpr7'
ls -l /proc/12232/fd
total 0 lr-x------ 1 build build 64 Dec 16 07:41 0 -> pipe:[40244260] l-wx------ 1 build build 64 Dec 16 07:41 1 -> pipe:[40244261] l-wx------ 1 build build 64 Dec 16 07:41 2 -> pipe:[40244262] l-wx------ 1 build build 64 Dec 16 07:41 3 -> /dev/null
ss -tn
State Recv-Q Send-Q Local Address:Port Peer Address:Port
ss -tln
State Recv-Q Send-Q Local Address:Port Peer Address:Port
ps xua | grep osmo
build 12232 1.7 0.0 54040 21148 ? S 07:41 0:00 /usr/bin/python3 /usr/local/bin/osmotestconfig.py -p /build -w /build -v build 12288 0.0 0.0 21475111140 27404 ? R 07:42 0:00 src/sgsn/osmo-sgsn -c /build/writtenconfig/osmo-sgsn.cfgrswvvpr7 build 12295 0.0 0.0 4280 736 ? S 07:42 0:00 /bin/sh -c ps xua | grep osmo build 12297 0.0 0.0 12784 948 ? S 07:42 0:00 grep osmo
Socket: in 1 tries, connected to 127.0.0.1:4245 <socket.socket fd=4, family=AddressFamily.AF_INET, type=SocketKind.SOCK_STREAM, proto=0, laddr=('127.0.0.1', 33274), raddr=('127.0.0.1', 4245)> (1 sockets open) Terminating took 0.897s Socket: closing 127.0.0.1:4245 <socket.socket fd=4, family=AddressFamily.AF_INET, type=SocketKind.SOCK_STREAM, proto=0, laddr=('127.0.0.1', 33274), raddr=('127.0.0.1', 4245)> (0 sockets open) Verifying src/gtphub/osmo-gtphub -c /build/doc/examples/osmo-gtphub/osmo-gtphub-1iface.cfg, test verify_doc Launching: PWD=/build 'src/gtphub/osmo-gtphub' '-c' '/build/doc/examples/osmo-gtphub/osmo-gtphub-1iface.cfg'
ls -l /proc/12232/fd
total 0 lr-x------ 1 build build 64 Dec 16 07:41 0 -> pipe:[40244260] l-wx------ 1 build build 64 Dec 16 07:41 1 -> pipe:[40244261] l-wx------ 1 build build 64 Dec 16 07:41 2 -> pipe:[40244262] l-wx------ 1 build build 64 Dec 16 07:41 3 -> /dev/null
ss -tn
State Recv-Q Send-Q Local Address:Port Peer Address:Port
ss -tln
State Recv-Q Send-Q Local Address:Port Peer Address:Port LISTEN 0 10 127.0.0.1:4253 *:*
ps xua | grep osmo
build 12232 1.5 0.0 54040 21148 ? S 07:41 0:00 /usr/bin/python3 /usr/local/bin/osmotestconfig.py -p /build -w /build -v build 12299 0.0 0.0 21474963656 15788 ? S 07:42 0:00 src/gtphub/osmo-gtphub -c /build/doc/examples/osmo-gtphub/osmo-gtphub-1iface.cfg build 12306 0.0 0.0 4280 736 ? S 07:42 0:00 /bin/sh -c ps xua | grep osmo build 12308 0.0 0.0 12784 948 ? S 07:42 0:00 grep osmo
Socket: in 1 tries, connected to 127.0.0.1:4253 <socket.socket fd=4, family=AddressFamily.AF_INET, type=SocketKind.SOCK_STREAM, proto=0, laddr=('127.0.0.1', 52416), raddr=('127.0.0.1', 4253)> (1 sockets open) Terminating took 0.897s Socket: closing 127.0.0.1:4253 <socket.socket fd=4, family=AddressFamily.AF_INET, type=SocketKind.SOCK_STREAM, proto=0, laddr=('127.0.0.1', 52416), raddr=('127.0.0.1', 4253)> (0 sockets open) Verifying src/gtphub/osmo-gtphub -c /build/writtenconfig/osmo-gtphub-1iface.cfgaqvliun6, test write_config Launching: PWD=/build 'src/gtphub/osmo-gtphub' '-c' '/build/writtenconfig/osmo-gtphub-1iface.cfgaqvliun6'
ls -l /proc/12232/fd
total 0 lr-x------ 1 build build 64 Dec 16 07:41 0 -> pipe:[40244260] l-wx------ 1 build build 64 Dec 16 07:41 1 -> pipe:[40244261] l-wx------ 1 build build 64 Dec 16 07:41 2 -> pipe:[40244262] l-wx------ 1 build build 64 Dec 16 07:41 3 -> /dev/null
ss -tn
State Recv-Q Send-Q Local Address:Port Peer Address:Port
ss -tln
State Recv-Q Send-Q Local Address:Port Peer Address:Port LISTEN 0 10 127.0.0.1:4253 *:*
ps xua | grep osmo
build 12232 1.4 0.0 54040 21148 ? S 07:41 0:00 /usr/bin/python3 /usr/local/bin/osmotestconfig.py -p /build -w /build -v build 12310 0.0 0.0 21474963656 13952 ? S 07:42 0:00 src/gtphub/osmo-gtphub -c /build/writtenconfig/osmo-gtphub-1iface.cfgaqvliun6 build 12317 0.0 0.0 4280 736 ? S 07:42 0:00 /bin/sh -c ps xua | grep osmo build 12319 0.0 0.0 12784 960 ? S 07:42 0:00 grep osmo
Socket: in 1 tries, connected to 127.0.0.1:4253 <socket.socket fd=4, family=AddressFamily.AF_INET, type=SocketKind.SOCK_STREAM, proto=0, laddr=('127.0.0.1', 52418), raddr=('127.0.0.1', 4253)> (1 sockets open) Terminating took 0.897s Socket: closing 127.0.0.1:4253 <socket.socket fd=4, family=AddressFamily.AF_INET, type=SocketKind.SOCK_STREAM, proto=0, laddr=('127.0.0.1', 52418), raddr=('127.0.0.1', 4253)> (0 sockets open) Verifying src/gtphub/osmo-gtphub -c /build/writtenconfig/osmo-gtphub-1iface.cfgaqvliun6, test token_vty_command Launching: PWD=/build 'src/gtphub/osmo-gtphub' '-c' '/build/writtenconfig/osmo-gtphub-1iface.cfgaqvliun6'
ls -l /proc/12232/fd
total 0 lr-x------ 1 build build 64 Dec 16 07:41 0 -> pipe:[40244260] l-wx------ 1 build build 64 Dec 16 07:41 1 -> pipe:[40244261] l-wx------ 1 build build 64 Dec 16 07:41 2 -> pipe:[40244262] l-wx------ 1 build build 64 Dec 16 07:41 3 -> /dev/null
ss -tn
State Recv-Q Send-Q Local Address:Port Peer Address:Port
ss -tln
State Recv-Q Send-Q Local Address:Port Peer Address:Port LISTEN 0 10 127.0.0.1:4253 *:*
ps xua | grep osmo
build 12232 1.3 0.0 54040 21148 ? S 07:41 0:00 /usr/bin/python3 /usr/local/bin/osmotestconfig.py -p /build -w /build -v build 12321 0.0 0.0 21474963656 14904 ? S 07:42 0:00 src/gtphub/osmo-gtphub -c /build/writtenconfig/osmo-gtphub-1iface.cfgaqvliun6 build 12328 0.0 0.0 4280 748 ? S 07:42 0:00 /bin/sh -c ps xua | grep osmo build 12330 0.0 0.0 12784 928 ? S 07:42 0:00 grep osmo
ERRORS: 1 Socket: in 1 tries, connected to 127.0.0.1:4253 <socket.socket fd=4, family=AddressFamily.AF_INET, type=SocketKind.SOCK_STREAM, proto=0, laddr=('127.0.0.1', 52420), raddr=('127.0.0.1', 4253)> (1 sockets open) Terminating took 0.897s Socket: closing 127.0.0.1:4253 <socket.socket fd=4, family=AddressFamily.AF_INET, type=SocketKind.SOCK_STREAM, proto=0, laddr=('127.0.0.1', 52420), raddr=('127.0.0.1', 4253)> (0 sockets open) Makefile:710: recipe for target 'vty-python-test' failed make[7]: Leaving directory '/build/tests' make[7]: *** [vty-python-test] Error 1 Makefile:727: recipe for target 'vty-test' failed make[6]: *** [vty-test] Error 2 make[6]: Leaving directory '/build/tests' Makefile:704: recipe for target 'python-tests' failed make[5]: Leaving directory '/build/tests' make[5]: *** [python-tests] Error 2 Makefile:735: recipe for target 'check-local' failed make[4]: Leaving directory '/build/tests' make[4]: *** [check-local] Error 2 Makefile:564: recipe for target 'check-am' failed make[3]: Leaving directory '/build/tests' make[3]: *** [check-am] Error 2 Makefile:416: recipe for target 'check-recursive' failed make[2]: Leaving directory '/build/tests' make[2]: *** [check-recursive] Error 1 make[1]: *** [check-recursive] Error 1 Makefile:461: recipe for target 'check-recursive' failed make[1]: Leaving directory '/build' make: *** [check] Error 2 Makefile:752: recipe for target 'check' failed + cat-testlogs.sh Build step 'Execute shell' marked build as failure [WARNINGS]Skipping publisher since build result is FAILURE
Changes:
------------------------------------------ [...truncated 412.13 KB...] ! ! OsmoGbProxy (1.6.0.108-3326) configuration saved from vty !! ! log stderr logging filter all 1 logging color 1 logging print category-hex 1 logging print category 0 logging timestamp 0 logging print file 1 logging level gprs debug logging level ns info logging level obj notice logging level lglobal notice logging level llapd notice logging level linp notice logging level lmux notice logging level lmi notice logging level lmib notice logging level lsms notice logging level lctrl notice logging level lgtp notice logging level lstats notice logging level lgsup notice logging level loap notice logging level lss7 notice logging level lsccp notice logging level lsua notice logging level lm3ua notice logging level lmgcp notice logging level ljibuf notice logging level lrspro notice logging level lns notice logging level lbssgp notice ! stats interval 5 ! line vty no login ! ns encapsulation framerelay-gre enabled 0 encapsulation udp local-ip 127.0.0.100 encapsulation udp local-port 23000 encapsulation udp use-reset-block-unblock enabled nse 101 nsvci 101 nse 101 remote-role sgsn nse 101 encapsulation udp nse 101 remote-ip 192.168.100.239 nse 101 remote-port 7777 timer tns-block 3 timer tns-block-retries 3 timer tns-reset 3 timer tns-reset-retries 3 timer tns-test 30 timer tns-alive 3 timer tns-alive-retries 10 timer tsns-prov 3 timer unknown 0x8 3 timer unknown 0x9 3 gbproxy sgsn nsei 101
State Recv-Q Send-Q Local Address:Port Peer Address:Port
ss -tln
State Recv-Q Send-Q Local Address:Port Peer Address:Port
ps xua | grep osmo
build 12228 1.8 0.0 53876 20948 ? S 10:58 0:00 /usr/bin/python3 /usr/local/bin/osmotestconfig.py -p /build -w /build -v build 12262 0.0 0.0 21475111140 24652 ? R 10:58 0:00 src/sgsn/osmo-sgsn -c /build/doc/examples/osmo-sgsn/osmo-sgsn.cfg build 12269 0.0 0.0 4280 756 ? S 10:58 0:00 /bin/sh -c ps xua | grep osmo build 12271 0.0 0.0 12784 928 ? S 10:58 0:00 grep osmo
Socket: in 1 tries, connected to 127.0.0.1:4245 <socket.socket fd=4, family=AddressFamily.AF_INET, type=SocketKind.SOCK_STREAM, proto=0, laddr=('127.0.0.1', 37060), raddr=('127.0.0.1', 4245)> (1 sockets open) Terminating took 0.897s Socket: closing 127.0.0.1:4245 <socket.socket fd=4, family=AddressFamily.AF_INET, type=SocketKind.SOCK_STREAM, proto=0, laddr=('127.0.0.1', 37060), raddr=('127.0.0.1', 4245)> (0 sockets open) Verifying src/sgsn/osmo-sgsn -c /build/writtenconfig/osmo-sgsn.cfgzm1jdjko, test write_config Launching: PWD=/build 'src/sgsn/osmo-sgsn' '-c' '/build/writtenconfig/osmo-sgsn.cfgzm1jdjko'
ls -l /proc/12228/fd
total 0 lr-x------ 1 build build 64 Dec 16 10:58 0 -> pipe:[40893886] l-wx------ 1 build build 64 Dec 16 10:58 1 -> pipe:[40893887] l-wx------ 1 build build 64 Dec 16 10:58 2 -> pipe:[40893888] l-wx------ 1 build build 64 Dec 16 10:58 3 -> /dev/null
ss -tn
State Recv-Q Send-Q Local Address:Port Peer Address:Port
ss -tln
State Recv-Q Send-Q Local Address:Port Peer Address:Port
ps xua | grep osmo
build 12228 1.7 0.0 54012 21036 ? S 10:58 0:00 /usr/bin/python3 /usr/local/bin/osmotestconfig.py -p /build -w /build -v build 12273 0.0 0.0 21475111140 21044 ? R 10:58 0:00 src/sgsn/osmo-sgsn -c /build/writtenconfig/osmo-sgsn.cfgzm1jdjko build 12280 0.0 0.0 4280 724 ? S 10:58 0:00 /bin/sh -c ps xua | grep osmo build 12282 0.0 0.0 12784 968 ? S 10:58 0:00 grep osmo
Socket: in 1 tries, connected to 127.0.0.1:4245 <socket.socket fd=4, family=AddressFamily.AF_INET, type=SocketKind.SOCK_STREAM, proto=0, laddr=('127.0.0.1', 37062), raddr=('127.0.0.1', 4245)> (1 sockets open) Terminating took 0.897s Socket: closing 127.0.0.1:4245 <socket.socket fd=4, family=AddressFamily.AF_INET, type=SocketKind.SOCK_STREAM, proto=0, laddr=('127.0.0.1', 37062), raddr=('127.0.0.1', 4245)> (0 sockets open) Verifying src/sgsn/osmo-sgsn -c /build/writtenconfig/osmo-sgsn.cfgzm1jdjko, test token_vty_command Launching: PWD=/build 'src/sgsn/osmo-sgsn' '-c' '/build/writtenconfig/osmo-sgsn.cfgzm1jdjko'
ls -l /proc/12228/fd
total 0 lr-x------ 1 build build 64 Dec 16 10:58 0 -> pipe:[40893886] l-wx------ 1 build build 64 Dec 16 10:58 1 -> pipe:[40893887] l-wx------ 1 build build 64 Dec 16 10:58 2 -> pipe:[40893888] l-wx------ 1 build build 64 Dec 16 10:58 3 -> /dev/null
ss -tn
State Recv-Q Send-Q Local Address:Port Peer Address:Port
ss -tln
State Recv-Q Send-Q Local Address:Port Peer Address:Port
ps xua | grep osmo
build 12228 1.3 0.0 54012 21036 ? S 10:58 0:00 /usr/bin/python3 /usr/local/bin/osmotestconfig.py -p /build -w /build -v build 12284 0.0 0.0 21475111140 18468 ? S 10:58 0:00 src/sgsn/osmo-sgsn -c /build/writtenconfig/osmo-sgsn.cfgzm1jdjko build 12291 0.0 0.0 4280 796 ? S 10:58 0:00 /bin/sh -c ps xua | grep osmo build 12293 0.0 0.0 12784 964 ? S 10:58 0:00 grep osmo
Socket: in 1 tries, connected to 127.0.0.1:4245 <socket.socket fd=4, family=AddressFamily.AF_INET, type=SocketKind.SOCK_STREAM, proto=0, laddr=('127.0.0.1', 37064), raddr=('127.0.0.1', 4245)> (1 sockets open) Terminating took 0.897s Socket: closing 127.0.0.1:4245 <socket.socket fd=4, family=AddressFamily.AF_INET, type=SocketKind.SOCK_STREAM, proto=0, laddr=('127.0.0.1', 37064), raddr=('127.0.0.1', 4245)> (0 sockets open) Verifying src/gtphub/osmo-gtphub -c /build/doc/examples/osmo-gtphub/osmo-gtphub-1iface.cfg, test verify_doc Launching: PWD=/build 'src/gtphub/osmo-gtphub' '-c' '/build/doc/examples/osmo-gtphub/osmo-gtphub-1iface.cfg'
ls -l /proc/12228/fd
total 0 lr-x------ 1 build build 64 Dec 16 10:58 0 -> pipe:[40893886] l-wx------ 1 build build 64 Dec 16 10:58 1 -> pipe:[40893887] l-wx------ 1 build build 64 Dec 16 10:58 2 -> pipe:[40893888] l-wx------ 1 build build 64 Dec 16 10:58 3 -> /dev/null
ss -tn
State Recv-Q Send-Q Local Address:Port Peer Address:Port
ss -tln
State Recv-Q Send-Q Local Address:Port Peer Address:Port LISTEN 0 10 127.0.0.1:4253 *:*
ps xua | grep osmo
build 12228 1.2 0.0 54012 21036 ? S 10:58 0:00 /usr/bin/python3 /usr/local/bin/osmotestconfig.py -p /build -w /build -v build 12295 0.0 0.0 21474963656 15380 ? S 10:58 0:00 src/gtphub/osmo-gtphub -c /build/doc/examples/osmo-gtphub/osmo-gtphub-1iface.cfg build 12302 0.0 0.0 4280 700 ? S 10:58 0:00 /bin/sh -c ps xua | grep osmo build 12304 0.0 0.0 12784 936 ? S 10:58 0:00 grep osmo
Socket: in 1 tries, connected to 127.0.0.1:4253 <socket.socket fd=4, family=AddressFamily.AF_INET, type=SocketKind.SOCK_STREAM, proto=0, laddr=('127.0.0.1', 56206), raddr=('127.0.0.1', 4253)> (1 sockets open) Terminating took 0.897s Socket: closing 127.0.0.1:4253 <socket.socket fd=4, family=AddressFamily.AF_INET, type=SocketKind.SOCK_STREAM, proto=0, laddr=('127.0.0.1', 56206), raddr=('127.0.0.1', 4253)> (0 sockets open) Verifying src/gtphub/osmo-gtphub -c /build/writtenconfig/osmo-gtphub-1iface.cfgmty39fib, test write_config Launching: PWD=/build 'src/gtphub/osmo-gtphub' '-c' '/build/writtenconfig/osmo-gtphub-1iface.cfgmty39fib'
ls -l /proc/12228/fd
total 0 lr-x------ 1 build build 64 Dec 16 10:58 0 -> pipe:[40893886] l-wx------ 1 build build 64 Dec 16 10:58 1 -> pipe:[40893887] l-wx------ 1 build build 64 Dec 16 10:58 2 -> pipe:[40893888] l-wx------ 1 build build 64 Dec 16 10:58 3 -> /dev/null
ss -tn
State Recv-Q Send-Q Local Address:Port Peer Address:Port
ss -tln
State Recv-Q Send-Q Local Address:Port Peer Address:Port
ps xua | grep osmo
build 12228 1.2 0.0 54012 21036 ? S 10:58 0:00 /usr/bin/python3 /usr/local/bin/osmotestconfig.py -p /build -w /build -v build 12306 0.0 0.0 21474963656 15200 ? S 10:58 0:00 src/gtphub/osmo-gtphub -c /build/writtenconfig/osmo-gtphub-1iface.cfgmty39fib build 12313 0.0 0.0 4280 748 ? S 10:58 0:00 /bin/sh -c ps xua | grep osmo build 12315 0.0 0.0 12784 1016 ? S 10:58 0:00 grep osmo
Socket: in 1 tries, connected to 127.0.0.1:4253 <socket.socket fd=4, family=AddressFamily.AF_INET, type=SocketKind.SOCK_STREAM, proto=0, laddr=('127.0.0.1', 56208), raddr=('127.0.0.1', 4253)> (1 sockets open) Terminating took 0.897s Socket: closing 127.0.0.1:4253 <socket.socket fd=4, family=AddressFamily.AF_INET, type=SocketKind.SOCK_STREAM, proto=0, laddr=('127.0.0.1', 56208), raddr=('127.0.0.1', 4253)> (0 sockets open) Verifying src/gtphub/osmo-gtphub -c /build/writtenconfig/osmo-gtphub-1iface.cfgmty39fib, test token_vty_command Launching: PWD=/build 'src/gtphub/osmo-gtphub' '-c' '/build/writtenconfig/osmo-gtphub-1iface.cfgmty39fib'
ls -l /proc/12228/fd
total 0 lr-x------ 1 build build 64 Dec 16 10:58 0 -> pipe:[40893886] l-wx------ 1 build build 64 Dec 16 10:58 1 -> pipe:[40893887] l-wx------ 1 build build 64 Dec 16 10:58 2 -> pipe:[40893888] l-wx------ 1 build build 64 Dec 16 10:58 3 -> /dev/null
ss -tn
State Recv-Q Send-Q Local Address:Port Peer Address:Port
ss -tln
State Recv-Q Send-Q Local Address:Port Peer Address:Port LISTEN 0 10 127.0.0.1:4253 *:*
ps xua | grep osmo
build 12228 1.0 0.0 54012 21036 ? S 10:58 0:00 /usr/bin/python3 /usr/local/bin/osmotestconfig.py -p /build -w /build -v build 12317 0.0 0.0 21474963656 15756 ? S 10:58 0:00 src/gtphub/osmo-gtphub -c /build/writtenconfig/osmo-gtphub-1iface.cfgmty39fib build 12324 0.0 0.0 4280 704 ? S 10:58 0:00 /bin/sh -c ps xua | grep osmo build 12326 0.0 0.0 12784 952 ? S 10:58 0:00 grep osmo
Socket: in 1 tries, connected to 127.0.0.1:4253 <socket.socket fd=4, family=AddressFamily.AF_INET, type=SocketKind.SOCK_STREAM, proto=0, laddr=('127.0.0.1', 56210), raddr=('127.0.0.1', 4253)> (1 sockets open) Terminating took 0.897s Socket: closing 127.0.0.1:4253 <socket.socket fd=4, family=AddressFamily.AF_INET, type=SocketKind.SOCK_STREAM, proto=0, laddr=('127.0.0.1', 56210), raddr=('127.0.0.1', 4253)> (0 sockets open) ERRORS: 1 make[7]: *** [vty-python-test] Error 1 Makefile:710: recipe for target 'vty-python-test' failed make[7]: Leaving directory '/build/tests' Makefile:727: recipe for target 'vty-test' failed make[6]: Leaving directory '/build/tests' make[6]: *** [vty-test] Error 2 Makefile:704: recipe for target 'python-tests' failed make[5]: Leaving directory '/build/tests' make[5]: *** [python-tests] Error 2 Makefile:735: recipe for target 'check-local' failed make[4]: Leaving directory '/build/tests' make[4]: *** [check-local] Error 2 Makefile:564: recipe for target 'check-am' failed make[3]: Leaving directory '/build/tests' make[3]: *** [check-am] Error 2 Makefile:416: recipe for target 'check-recursive' failed make[2]: Leaving directory '/build/tests' make[2]: *** [check-recursive] Error 1 Makefile:461: recipe for target 'check-recursive' failed make[1]: Leaving directory '/build' make[1]: *** [check-recursive] Error 1 Makefile:752: recipe for target 'check' failed make: *** [check] Error 2 + cat-testlogs.sh Build step 'Execute shell' marked build as failure [WARNINGS]Skipping publisher since build result is FAILURE
jenkins-notifications@lists.osmocom.org