See https://jenkins.osmocom.org/jenkins/job/ttcn3-bts-test-io_uring/324/display/redirect
Changes:
------------------------------------------ [...truncated 3.69 MiB...] <failure type='fail-verdict'>"BTS_Tests.ttcn:291 : Timeout waiting for RSL bring up" BTS_Tests_LAPDm.ttcn:1475 BTS_Tests_LAPDm control part BTS_Tests_LAPDm.ttcn:157 TC_sabm_ua_dcch_sapi0_nopayload testcase </failure> </testcase> <testcase classname='BTS_Tests_LAPDm' name='TC_sabm_ua_dcch_sapi3' time='15.041758'> <failure type='fail-verdict'>"BTS_Tests.ttcn:291 : Timeout waiting for RSL bring up" BTS_Tests_LAPDm.ttcn:1476 BTS_Tests_LAPDm control part BTS_Tests_LAPDm.ttcn:162 TC_sabm_ua_dcch_sapi3 testcase </failure> </testcase> <testcase classname='BTS_Tests_LAPDm' name='TC_sabm_ua_dcch_sapi4' time='15.027663'> <failure type='fail-verdict'>"BTS_Tests.ttcn:291 : Timeout waiting for RSL bring up" BTS_Tests_LAPDm.ttcn:1477 BTS_Tests_LAPDm control part BTS_Tests_LAPDm.ttcn:167 TC_sabm_ua_dcch_sapi4 testcase </failure> </testcase> <testcase classname='BTS_Tests_LAPDm' name='TC_sabm_contention' time='15.037714'> <failure type='fail-verdict'>"BTS_Tests.ttcn:291 : Timeout waiting for RSL bring up" BTS_Tests_LAPDm.ttcn:1478 BTS_Tests_LAPDm control part BTS_Tests_LAPDm.ttcn:201 TC_sabm_contention testcase </failure> </testcase> <testcase classname='BTS_Tests_LAPDm' name='TC_sabm_retransmit' time='15.043908'> <failure type='fail-verdict'>"BTS_Tests.ttcn:291 : Timeout waiting for RSL bring up" BTS_Tests_LAPDm.ttcn:1479 BTS_Tests_LAPDm control part BTS_Tests_LAPDm.ttcn:225 TC_sabm_retransmit testcase </failure> </testcase> <testcase classname='BTS_Tests_LAPDm' name='TC_sabm_retransmit_bts' time='15.042793'> <failure type='fail-verdict'>"BTS_Tests.ttcn:291 : Timeout waiting for RSL bring up" BTS_Tests_LAPDm.ttcn:1480 BTS_Tests_LAPDm control part BTS_Tests_LAPDm.ttcn:315 TC_sabm_retransmit_bts testcase </failure> </testcase> <testcase classname='BTS_Tests_LAPDm' name='TC_sabm_invalid_resp' time='15.041132'> <failure type='fail-verdict'>"BTS_Tests.ttcn:291 : Timeout waiting for RSL bring up" BTS_Tests_LAPDm.ttcn:1481 BTS_Tests_LAPDm control part BTS_Tests_LAPDm.ttcn:379 TC_sabm_invalid_resp testcase </failure> </testcase> <testcase classname='BTS_Tests_LAPDm' name='TC_sabm_dm' time='15.043229'> <failure type='fail-verdict'>"BTS_Tests.ttcn:291 : Timeout waiting for RSL bring up" BTS_Tests_LAPDm.ttcn:1482 BTS_Tests_LAPDm control part BTS_Tests_LAPDm.ttcn:425 TC_sabm_dm testcase </failure> </testcase> <testcase classname='BTS_Tests_LAPDm' name='TC_establish_ign_first_sabm' time='15.043849'> <failure type='fail-verdict'>"BTS_Tests.ttcn:291 : Timeout waiting for RSL bring up" BTS_Tests_LAPDm.ttcn:1483 BTS_Tests_LAPDm control part BTS_Tests_LAPDm.ttcn:488 TC_establish_ign_first_sabm testcase </failure> </testcase> <testcase classname='BTS_Tests_LAPDm' name='TC_iframe_seq_and_ack' time='15.038098'> <failure type='fail-verdict'>"BTS_Tests.ttcn:291 : Timeout waiting for RSL bring up" BTS_Tests_LAPDm.ttcn:1484 BTS_Tests_LAPDm control part BTS_Tests_LAPDm.ttcn:579 TC_iframe_seq_and_ack testcase </failure> </testcase> <testcase classname='BTS_Tests_LAPDm' name='TC_iframe_timer_recovery' time='15.039753'> <failure type='fail-verdict'>"BTS_Tests.ttcn:291 : Timeout waiting for RSL bring up" BTS_Tests_LAPDm.ttcn:1485 BTS_Tests_LAPDm control part BTS_Tests_LAPDm.ttcn:685 TC_iframe_timer_recovery testcase </failure> </testcase> <testcase classname='BTS_Tests_LAPDm' name='TC_ns_seq_error' time='15.043701'> <failure type='fail-verdict'>"BTS_Tests.ttcn:291 : Timeout waiting for RSL bring up" BTS_Tests_LAPDm.ttcn:1486 BTS_Tests_LAPDm control part BTS_Tests_LAPDm.ttcn:768 TC_ns_seq_error testcase </failure> </testcase> <testcase classname='BTS_Tests_LAPDm' name='TC_nr_seq_error' time='15.045116'> <failure type='fail-verdict'>"BTS_Tests.ttcn:291 : Timeout waiting for RSL bring up" BTS_Tests_LAPDm.ttcn:1487 BTS_Tests_LAPDm control part BTS_Tests_LAPDm.ttcn:831 TC_nr_seq_error testcase </failure> </testcase> <testcase classname='BTS_Tests_LAPDm' name='TC_rec_invalid_frame' time='15.029958'> <failure type='fail-verdict'>"BTS_Tests.ttcn:291 : Timeout waiting for RSL bring up" BTS_Tests_LAPDm.ttcn:1488 BTS_Tests_LAPDm control part BTS_Tests_LAPDm.ttcn:961 TC_rec_invalid_frame testcase </failure> </testcase> <testcase classname='BTS_Tests_LAPDm' name='TC_segm_concat_dcch' time='15.039243'> <failure type='fail-verdict'>"BTS_Tests.ttcn:291 : Timeout waiting for RSL bring up" BTS_Tests_LAPDm.ttcn:1489 BTS_Tests_LAPDm control part BTS_Tests_LAPDm.ttcn:1088 TC_segm_concat_dcch testcase </failure> </testcase> <testcase classname='BTS_Tests_LAPDm' name='TC_segm_concat_sacch' time='15.031351'> <failure type='fail-verdict'>"BTS_Tests.ttcn:291 : Timeout waiting for RSL bring up" BTS_Tests_LAPDm.ttcn:1490 BTS_Tests_LAPDm control part BTS_Tests_LAPDm.ttcn:1093 TC_segm_concat_sacch testcase </failure> </testcase> <testcase classname='BTS_Tests_LAPDm' name='TC_t200_n200' time='15.027331'> <failure type='fail-verdict'>"BTS_Tests.ttcn:291 : Timeout waiting for RSL bring up" BTS_Tests_LAPDm.ttcn:1491 BTS_Tests_LAPDm control part BTS_Tests_LAPDm.ttcn:1182 TC_t200_n200 testcase </failure> </testcase> <testcase classname='BTS_Tests_LAPDm' name='TC_rr_response_frame_loss' time='15.028571'> <failure type='fail-verdict'>"BTS_Tests.ttcn:291 : Timeout waiting for RSL bring up" BTS_Tests_LAPDm.ttcn:1492 BTS_Tests_LAPDm control part BTS_Tests_LAPDm.ttcn:1239 TC_rr_response_frame_loss testcase </failure> </testcase> <testcase classname='BTS_Tests_LAPDm' name='TC_incorrect_cr' time='15.039910'> <failure type='fail-verdict'>"BTS_Tests.ttcn:291 : Timeout waiting for RSL bring up" BTS_Tests_LAPDm.ttcn:1493 BTS_Tests_LAPDm control part BTS_Tests_LAPDm.ttcn:1293 TC_incorrect_cr testcase </failure> </testcase> <testcase classname='BTS_Tests_LAPDm' name='TC_sabm_incorrect_c' time='15.030317'> <failure type='fail-verdict'>"BTS_Tests.ttcn:291 : Timeout waiting for RSL bring up" BTS_Tests_LAPDm.ttcn:1494 BTS_Tests_LAPDm control part BTS_Tests_LAPDm.ttcn:1341 TC_sabm_incorrect_c testcase </failure> </testcase> <testcase classname='BTS_Tests_LAPDm' name='TC_normal_reestablishment' time='15.040502'> <failure type='fail-verdict'>"BTS_Tests.ttcn:291 : Timeout waiting for RSL bring up" BTS_Tests_LAPDm.ttcn:1495 BTS_Tests_LAPDm control part BTS_Tests_LAPDm.ttcn:1403 TC_normal_reestablishment testcase </failure> </testcase> <testcase classname='BTS_Tests_LAPDm' name='TC_normal_reestablishment_state_unacked' time='15.030074'> <failure type='fail-verdict'>"BTS_Tests.ttcn:291 : Timeout waiting for RSL bring up" BTS_Tests_LAPDm.ttcn:1496 BTS_Tests_LAPDm control part BTS_Tests_LAPDm.ttcn:1470 TC_normal_reestablishment_state_unacked testcase </failure> </testcase> <testcase classname='BTS_Tests_VAMOS' name='TC_vamos_chan_act_vff' time='15.030312'> <failure type='fail-verdict'>"BTS_Tests.ttcn:291 : Timeout waiting for RSL bring up" BTS_Tests_VAMOS.ttcn:316 BTS_Tests_VAMOS control part BTS_Tests_VAMOS.ttcn:210 TC_vamos_chan_act_vff testcase </failure> </testcase> <testcase classname='BTS_Tests_VAMOS' name='TC_vamos_chan_act_vhh' time='15.042088'> <failure type='fail-verdict'>"BTS_Tests.ttcn:291 : Timeout waiting for RSL bring up" BTS_Tests_VAMOS.ttcn:317 BTS_Tests_VAMOS control part BTS_Tests_VAMOS.ttcn:224 TC_vamos_chan_act_vhh testcase </failure> </testcase> <testcase classname='BTS_Tests_VAMOS' name='TC_vamos_chan_act_hvhh' time='15.040705'> <failure type='fail-verdict'>"BTS_Tests.ttcn:291 : Timeout waiting for RSL bring up" BTS_Tests_VAMOS.ttcn:318 BTS_Tests_VAMOS control part BTS_Tests_VAMOS.ttcn:234 TC_vamos_chan_act_hvhh testcase </failure> </testcase> <testcase classname='BTS_Tests_VAMOS' name='TC_vamos_chan_act_dyn_ipa_vff' time='15.037274'> <failure type='fail-verdict'>"BTS_Tests.ttcn:291 : Timeout waiting for RSL bring up" BTS_Tests_VAMOS.ttcn:319 BTS_Tests_VAMOS control part BTS_Tests_VAMOS.ttcn:214 TC_vamos_chan_act_dyn_ipa_vff testcase </failure> </testcase> <testcase classname='BTS_Tests_VAMOS' name='TC_vamos_chan_act_dyn_osmo_vff' time='15.055958'> <failure type='fail-verdict'>"BTS_Tests.ttcn:291 : Timeout waiting for RSL bring up" BTS_Tests_VAMOS.ttcn:320 BTS_Tests_VAMOS control part BTS_Tests_VAMOS.ttcn:218 TC_vamos_chan_act_dyn_osmo_vff testcase </failure> </testcase> <testcase classname='BTS_Tests_VAMOS' name='TC_vamos_chan_act_dyn_osmo_vhh' time='15.032528'> <failure type='fail-verdict'>"BTS_Tests.ttcn:291 : Timeout waiting for RSL bring up" BTS_Tests_VAMOS.ttcn:321 BTS_Tests_VAMOS control part BTS_Tests_VAMOS.ttcn:228 TC_vamos_chan_act_dyn_osmo_vhh testcase </failure> </testcase> <testcase classname='BTS_Tests_VAMOS' name='TC_vamos_chan_act_dyn_osmo_hvhh' time='15.042954'> <failure type='fail-verdict'>"BTS_Tests.ttcn:291 : Timeout waiting for RSL bring up" BTS_Tests_VAMOS.ttcn:322 BTS_Tests_VAMOS control part BTS_Tests_VAMOS.ttcn:238 TC_vamos_chan_act_dyn_osmo_hvhh testcase </failure> </testcase> <testcase classname='BTS_Tests_VAMOS' name='TC_vamos_chan_mode_modify_vff' time='15.018891'> <failure type='fail-verdict'>"BTS_Tests.ttcn:291 : Timeout waiting for RSL bring up" BTS_Tests_VAMOS.ttcn:325 BTS_Tests_VAMOS control part BTS_Tests_VAMOS.ttcn:283 TC_vamos_chan_mode_modify_vff testcase </failure> </testcase> <testcase classname='BTS_Tests_VAMOS' name='TC_vamos_chan_mode_modify_vhh' time='15.042159'> <failure type='fail-verdict'>"BTS_Tests.ttcn:291 : Timeout waiting for RSL bring up" BTS_Tests_VAMOS.ttcn:326 BTS_Tests_VAMOS control part BTS_Tests_VAMOS.ttcn:297 TC_vamos_chan_mode_modify_vhh testcase </failure> </testcase> <testcase classname='BTS_Tests_VAMOS' name='TC_vamos_chan_mode_modify_hvhh' time='15.038714'> <failure type='fail-verdict'>"BTS_Tests.ttcn:291 : Timeout waiting for RSL bring up" BTS_Tests_VAMOS.ttcn:327 BTS_Tests_VAMOS control part BTS_Tests_VAMOS.ttcn:307 TC_vamos_chan_mode_modify_hvhh testcase </failure> </testcase> <testcase classname='BTS_Tests_VAMOS' name='TC_vamos_chan_mode_modify_dyn_ipa_vff' time='15.038604'> <failure type='fail-verdict'>"BTS_Tests.ttcn:291 : Timeout waiting for RSL bring up" BTS_Tests_VAMOS.ttcn:328 BTS_Tests_VAMOS control part BTS_Tests_VAMOS.ttcn:287 TC_vamos_chan_mode_modify_dyn_ipa_vff testcase </failure> </testcase> <testcase classname='BTS_Tests_VAMOS' name='TC_vamos_chan_mode_modify_dyn_osmo_vff' time='15.021106'> <failure type='fail-verdict'>"BTS_Tests.ttcn:291 : Timeout waiting for RSL bring up" BTS_Tests_VAMOS.ttcn:329 BTS_Tests_VAMOS control part BTS_Tests_VAMOS.ttcn:291 TC_vamos_chan_mode_modify_dyn_osmo_vff testcase </failure> </testcase> <testcase classname='BTS_Tests_VAMOS' name='TC_vamos_chan_mode_modify_dyn_osmo_vhh' time='15.025201'> <failure type='fail-verdict'>"BTS_Tests.ttcn:291 : Timeout waiting for RSL bring up" BTS_Tests_VAMOS.ttcn:330 BTS_Tests_VAMOS control part BTS_Tests_VAMOS.ttcn:301 TC_vamos_chan_mode_modify_dyn_osmo_vhh testcase </failure> </testcase> <testcase classname='BTS_Tests_VAMOS' name='TC_vamos_chan_mode_modify_dyn_osmo_hvhh' time='15.027565'> <failure type='fail-verdict'>"BTS_Tests.ttcn:291 : Timeout waiting for RSL bring up" BTS_Tests_VAMOS.ttcn:331 BTS_Tests_VAMOS control part BTS_Tests_VAMOS.ttcn:311 TC_vamos_chan_mode_modify_dyn_osmo_hvhh testcase </failure> </testcase> <testcase classname='BTS_Tests_ASCI' name='TC_vbs_notification' time='15.031591'> <failure type='fail-verdict'>"BTS_Tests.ttcn:291 : Timeout waiting for RSL bring up" BTS_Tests_ASCI.ttcn:422 BTS_Tests_ASCI control part BTS_Tests_ASCI.ttcn:83 TC_vbs_notification testcase </failure> </testcase> <testcase classname='BTS_Tests_ASCI' name='TC_vgcs_uplink_free_and_busy' time='15.029246'> <failure type='fail-verdict'>"BTS_Tests.ttcn:291 : Timeout waiting for RSL bring up" BTS_Tests_ASCI.ttcn:423 BTS_Tests_ASCI control part BTS_Tests_ASCI.ttcn:190 TC_vgcs_uplink_free_and_busy testcase </failure> </testcase> <testcase classname='BTS_Tests_ASCI' name='TC_vgcs_talker_fail' time='15.034028'> <failure type='fail-verdict'>"BTS_Tests.ttcn:291 : Timeout waiting for RSL bring up" BTS_Tests_ASCI.ttcn:424 BTS_Tests_ASCI control part BTS_Tests_ASCI.ttcn:289 TC_vgcs_talker_fail testcase </failure> </testcase> <testcase classname='BTS_Tests_ASCI' name='TC_vgcs_talker_est_rel' time='15.028581'> <failure type='fail-verdict'>"BTS_Tests.ttcn:291 : Timeout waiting for RSL bring up" BTS_Tests_ASCI.ttcn:425 BTS_Tests_ASCI control part BTS_Tests_ASCI.ttcn:333 TC_vgcs_talker_est_rel testcase </failure> </testcase> <testcase classname='BTS_Tests_ASCI' name='TC_vgcs_listener_det' time='15.034114'> <failure type='fail-verdict'>"BTS_Tests.ttcn:291 : Timeout waiting for RSL bring up" BTS_Tests_ASCI.ttcn:426 BTS_Tests_ASCI control part BTS_Tests_ASCI.ttcn:411 TC_vgcs_listener_det testcase </failure> </testcase> </testsuite> Build step 'Execute shell' marked build as failure Recording test results [Checks API] No suitable checks publisher found.
See https://jenkins.osmocom.org/jenkins/job/ttcn3-bts-test-io_uring/325/display/redirect
Changes:
------------------------------------------ [...truncated 4.57 MiB...] <failure type='fail-verdict'>"BTS_Tests.ttcn:291 : Timeout waiting for RSL bring up" BTS_Tests_LAPDm.ttcn:1475 BTS_Tests_LAPDm control part BTS_Tests_LAPDm.ttcn:157 TC_sabm_ua_dcch_sapi0_nopayload testcase </failure> </testcase> <testcase classname='BTS_Tests_LAPDm' name='TC_sabm_ua_dcch_sapi3' time='15.043246'> <failure type='fail-verdict'>"BTS_Tests.ttcn:291 : Timeout waiting for RSL bring up" BTS_Tests_LAPDm.ttcn:1476 BTS_Tests_LAPDm control part BTS_Tests_LAPDm.ttcn:162 TC_sabm_ua_dcch_sapi3 testcase </failure> </testcase> <testcase classname='BTS_Tests_LAPDm' name='TC_sabm_ua_dcch_sapi4' time='15.018369'> <failure type='fail-verdict'>"BTS_Tests.ttcn:291 : Timeout waiting for RSL bring up" BTS_Tests_LAPDm.ttcn:1477 BTS_Tests_LAPDm control part BTS_Tests_LAPDm.ttcn:167 TC_sabm_ua_dcch_sapi4 testcase </failure> </testcase> <testcase classname='BTS_Tests_LAPDm' name='TC_sabm_contention' time='15.033390'> <failure type='fail-verdict'>"BTS_Tests.ttcn:291 : Timeout waiting for RSL bring up" BTS_Tests_LAPDm.ttcn:1478 BTS_Tests_LAPDm control part BTS_Tests_LAPDm.ttcn:201 TC_sabm_contention testcase </failure> </testcase> <testcase classname='BTS_Tests_LAPDm' name='TC_sabm_retransmit' time='15.038874'> <failure type='fail-verdict'>"BTS_Tests.ttcn:291 : Timeout waiting for RSL bring up" BTS_Tests_LAPDm.ttcn:1479 BTS_Tests_LAPDm control part BTS_Tests_LAPDm.ttcn:225 TC_sabm_retransmit testcase </failure> </testcase> <testcase classname='BTS_Tests_LAPDm' name='TC_sabm_retransmit_bts' time='15.038309'> <failure type='fail-verdict'>"BTS_Tests.ttcn:291 : Timeout waiting for RSL bring up" BTS_Tests_LAPDm.ttcn:1480 BTS_Tests_LAPDm control part BTS_Tests_LAPDm.ttcn:315 TC_sabm_retransmit_bts testcase </failure> </testcase> <testcase classname='BTS_Tests_LAPDm' name='TC_sabm_invalid_resp' time='15.040929'> <failure type='fail-verdict'>"BTS_Tests.ttcn:291 : Timeout waiting for RSL bring up" BTS_Tests_LAPDm.ttcn:1481 BTS_Tests_LAPDm control part BTS_Tests_LAPDm.ttcn:379 TC_sabm_invalid_resp testcase </failure> </testcase> <testcase classname='BTS_Tests_LAPDm' name='TC_sabm_dm' time='15.040199'> <failure type='fail-verdict'>"BTS_Tests.ttcn:291 : Timeout waiting for RSL bring up" BTS_Tests_LAPDm.ttcn:1482 BTS_Tests_LAPDm control part BTS_Tests_LAPDm.ttcn:425 TC_sabm_dm testcase </failure> </testcase> <testcase classname='BTS_Tests_LAPDm' name='TC_establish_ign_first_sabm' time='15.045563'> <failure type='fail-verdict'>"BTS_Tests.ttcn:291 : Timeout waiting for RSL bring up" BTS_Tests_LAPDm.ttcn:1483 BTS_Tests_LAPDm control part BTS_Tests_LAPDm.ttcn:488 TC_establish_ign_first_sabm testcase </failure> </testcase> <testcase classname='BTS_Tests_LAPDm' name='TC_iframe_seq_and_ack' time='15.041811'> <failure type='fail-verdict'>"BTS_Tests.ttcn:291 : Timeout waiting for RSL bring up" BTS_Tests_LAPDm.ttcn:1484 BTS_Tests_LAPDm control part BTS_Tests_LAPDm.ttcn:579 TC_iframe_seq_and_ack testcase </failure> </testcase> <testcase classname='BTS_Tests_LAPDm' name='TC_iframe_timer_recovery' time='15.045085'> <failure type='fail-verdict'>"BTS_Tests.ttcn:291 : Timeout waiting for RSL bring up" BTS_Tests_LAPDm.ttcn:1485 BTS_Tests_LAPDm control part BTS_Tests_LAPDm.ttcn:685 TC_iframe_timer_recovery testcase </failure> </testcase> <testcase classname='BTS_Tests_LAPDm' name='TC_ns_seq_error' time='15.042460'> <failure type='fail-verdict'>"BTS_Tests.ttcn:291 : Timeout waiting for RSL bring up" BTS_Tests_LAPDm.ttcn:1486 BTS_Tests_LAPDm control part BTS_Tests_LAPDm.ttcn:768 TC_ns_seq_error testcase </failure> </testcase> <testcase classname='BTS_Tests_LAPDm' name='TC_nr_seq_error' time='15.041831'> <failure type='fail-verdict'>"BTS_Tests.ttcn:291 : Timeout waiting for RSL bring up" BTS_Tests_LAPDm.ttcn:1487 BTS_Tests_LAPDm control part BTS_Tests_LAPDm.ttcn:831 TC_nr_seq_error testcase </failure> </testcase> <testcase classname='BTS_Tests_LAPDm' name='TC_rec_invalid_frame' time='15.040940'> <failure type='fail-verdict'>"BTS_Tests.ttcn:291 : Timeout waiting for RSL bring up" BTS_Tests_LAPDm.ttcn:1488 BTS_Tests_LAPDm control part BTS_Tests_LAPDm.ttcn:961 TC_rec_invalid_frame testcase </failure> </testcase> <testcase classname='BTS_Tests_LAPDm' name='TC_segm_concat_dcch' time='15.034488'> <failure type='fail-verdict'>"BTS_Tests.ttcn:291 : Timeout waiting for RSL bring up" BTS_Tests_LAPDm.ttcn:1489 BTS_Tests_LAPDm control part BTS_Tests_LAPDm.ttcn:1088 TC_segm_concat_dcch testcase </failure> </testcase> <testcase classname='BTS_Tests_LAPDm' name='TC_segm_concat_sacch' time='15.035981'> <failure type='fail-verdict'>"BTS_Tests.ttcn:291 : Timeout waiting for RSL bring up" BTS_Tests_LAPDm.ttcn:1490 BTS_Tests_LAPDm control part BTS_Tests_LAPDm.ttcn:1093 TC_segm_concat_sacch testcase </failure> </testcase> <testcase classname='BTS_Tests_LAPDm' name='TC_t200_n200' time='15.039861'> <failure type='fail-verdict'>"BTS_Tests.ttcn:291 : Timeout waiting for RSL bring up" BTS_Tests_LAPDm.ttcn:1491 BTS_Tests_LAPDm control part BTS_Tests_LAPDm.ttcn:1182 TC_t200_n200 testcase </failure> </testcase> <testcase classname='BTS_Tests_LAPDm' name='TC_rr_response_frame_loss' time='15.043970'> <failure type='fail-verdict'>"BTS_Tests.ttcn:291 : Timeout waiting for RSL bring up" BTS_Tests_LAPDm.ttcn:1492 BTS_Tests_LAPDm control part BTS_Tests_LAPDm.ttcn:1239 TC_rr_response_frame_loss testcase </failure> </testcase> <testcase classname='BTS_Tests_LAPDm' name='TC_incorrect_cr' time='15.035292'> <failure type='fail-verdict'>"BTS_Tests.ttcn:291 : Timeout waiting for RSL bring up" BTS_Tests_LAPDm.ttcn:1493 BTS_Tests_LAPDm control part BTS_Tests_LAPDm.ttcn:1293 TC_incorrect_cr testcase </failure> </testcase> <testcase classname='BTS_Tests_LAPDm' name='TC_sabm_incorrect_c' time='15.029079'> <failure type='fail-verdict'>"BTS_Tests.ttcn:291 : Timeout waiting for RSL bring up" BTS_Tests_LAPDm.ttcn:1494 BTS_Tests_LAPDm control part BTS_Tests_LAPDm.ttcn:1341 TC_sabm_incorrect_c testcase </failure> </testcase> <testcase classname='BTS_Tests_LAPDm' name='TC_normal_reestablishment' time='15.038579'> <failure type='fail-verdict'>"BTS_Tests.ttcn:291 : Timeout waiting for RSL bring up" BTS_Tests_LAPDm.ttcn:1495 BTS_Tests_LAPDm control part BTS_Tests_LAPDm.ttcn:1403 TC_normal_reestablishment testcase </failure> </testcase> <testcase classname='BTS_Tests_LAPDm' name='TC_normal_reestablishment_state_unacked' time='15.026539'> <failure type='fail-verdict'>"BTS_Tests.ttcn:291 : Timeout waiting for RSL bring up" BTS_Tests_LAPDm.ttcn:1496 BTS_Tests_LAPDm control part BTS_Tests_LAPDm.ttcn:1470 TC_normal_reestablishment_state_unacked testcase </failure> </testcase> <testcase classname='BTS_Tests_VAMOS' name='TC_vamos_chan_act_vff' time='15.044810'> <failure type='fail-verdict'>"BTS_Tests.ttcn:291 : Timeout waiting for RSL bring up" BTS_Tests_VAMOS.ttcn:316 BTS_Tests_VAMOS control part BTS_Tests_VAMOS.ttcn:210 TC_vamos_chan_act_vff testcase </failure> </testcase> <testcase classname='BTS_Tests_VAMOS' name='TC_vamos_chan_act_vhh' time='15.031190'> <failure type='fail-verdict'>"BTS_Tests.ttcn:291 : Timeout waiting for RSL bring up" BTS_Tests_VAMOS.ttcn:317 BTS_Tests_VAMOS control part BTS_Tests_VAMOS.ttcn:224 TC_vamos_chan_act_vhh testcase </failure> </testcase> <testcase classname='BTS_Tests_VAMOS' name='TC_vamos_chan_act_hvhh' time='15.029715'> <failure type='fail-verdict'>"BTS_Tests.ttcn:291 : Timeout waiting for RSL bring up" BTS_Tests_VAMOS.ttcn:318 BTS_Tests_VAMOS control part BTS_Tests_VAMOS.ttcn:234 TC_vamos_chan_act_hvhh testcase </failure> </testcase> <testcase classname='BTS_Tests_VAMOS' name='TC_vamos_chan_act_dyn_ipa_vff' time='15.030929'> <failure type='fail-verdict'>"BTS_Tests.ttcn:291 : Timeout waiting for RSL bring up" BTS_Tests_VAMOS.ttcn:319 BTS_Tests_VAMOS control part BTS_Tests_VAMOS.ttcn:214 TC_vamos_chan_act_dyn_ipa_vff testcase </failure> </testcase> <testcase classname='BTS_Tests_VAMOS' name='TC_vamos_chan_act_dyn_osmo_vff' time='15.045851'> <failure type='fail-verdict'>"BTS_Tests.ttcn:291 : Timeout waiting for RSL bring up" BTS_Tests_VAMOS.ttcn:320 BTS_Tests_VAMOS control part BTS_Tests_VAMOS.ttcn:218 TC_vamos_chan_act_dyn_osmo_vff testcase </failure> </testcase> <testcase classname='BTS_Tests_VAMOS' name='TC_vamos_chan_act_dyn_osmo_vhh' time='15.033365'> <failure type='fail-verdict'>"BTS_Tests.ttcn:291 : Timeout waiting for RSL bring up" BTS_Tests_VAMOS.ttcn:321 BTS_Tests_VAMOS control part BTS_Tests_VAMOS.ttcn:228 TC_vamos_chan_act_dyn_osmo_vhh testcase </failure> </testcase> <testcase classname='BTS_Tests_VAMOS' name='TC_vamos_chan_act_dyn_osmo_hvhh' time='15.043349'> <failure type='fail-verdict'>"BTS_Tests.ttcn:291 : Timeout waiting for RSL bring up" BTS_Tests_VAMOS.ttcn:322 BTS_Tests_VAMOS control part BTS_Tests_VAMOS.ttcn:238 TC_vamos_chan_act_dyn_osmo_hvhh testcase </failure> </testcase> <testcase classname='BTS_Tests_VAMOS' name='TC_vamos_chan_mode_modify_vff' time='15.036233'> <failure type='fail-verdict'>"BTS_Tests.ttcn:291 : Timeout waiting for RSL bring up" BTS_Tests_VAMOS.ttcn:325 BTS_Tests_VAMOS control part BTS_Tests_VAMOS.ttcn:283 TC_vamos_chan_mode_modify_vff testcase </failure> </testcase> <testcase classname='BTS_Tests_VAMOS' name='TC_vamos_chan_mode_modify_vhh' time='15.023520'> <failure type='fail-verdict'>"BTS_Tests.ttcn:291 : Timeout waiting for RSL bring up" BTS_Tests_VAMOS.ttcn:326 BTS_Tests_VAMOS control part BTS_Tests_VAMOS.ttcn:297 TC_vamos_chan_mode_modify_vhh testcase </failure> </testcase> <testcase classname='BTS_Tests_VAMOS' name='TC_vamos_chan_mode_modify_hvhh' time='15.038719'> <failure type='fail-verdict'>"BTS_Tests.ttcn:291 : Timeout waiting for RSL bring up" BTS_Tests_VAMOS.ttcn:327 BTS_Tests_VAMOS control part BTS_Tests_VAMOS.ttcn:307 TC_vamos_chan_mode_modify_hvhh testcase </failure> </testcase> <testcase classname='BTS_Tests_VAMOS' name='TC_vamos_chan_mode_modify_dyn_ipa_vff' time='15.030593'> <failure type='fail-verdict'>"BTS_Tests.ttcn:291 : Timeout waiting for RSL bring up" BTS_Tests_VAMOS.ttcn:328 BTS_Tests_VAMOS control part BTS_Tests_VAMOS.ttcn:287 TC_vamos_chan_mode_modify_dyn_ipa_vff testcase </failure> </testcase> <testcase classname='BTS_Tests_VAMOS' name='TC_vamos_chan_mode_modify_dyn_osmo_vff' time='15.026980'> <failure type='fail-verdict'>"BTS_Tests.ttcn:291 : Timeout waiting for RSL bring up" BTS_Tests_VAMOS.ttcn:329 BTS_Tests_VAMOS control part BTS_Tests_VAMOS.ttcn:291 TC_vamos_chan_mode_modify_dyn_osmo_vff testcase </failure> </testcase> <testcase classname='BTS_Tests_VAMOS' name='TC_vamos_chan_mode_modify_dyn_osmo_vhh' time='15.036969'> <failure type='fail-verdict'>"BTS_Tests.ttcn:291 : Timeout waiting for RSL bring up" BTS_Tests_VAMOS.ttcn:330 BTS_Tests_VAMOS control part BTS_Tests_VAMOS.ttcn:301 TC_vamos_chan_mode_modify_dyn_osmo_vhh testcase </failure> </testcase> <testcase classname='BTS_Tests_VAMOS' name='TC_vamos_chan_mode_modify_dyn_osmo_hvhh' time='15.036048'> <failure type='fail-verdict'>"BTS_Tests.ttcn:291 : Timeout waiting for RSL bring up" BTS_Tests_VAMOS.ttcn:331 BTS_Tests_VAMOS control part BTS_Tests_VAMOS.ttcn:311 TC_vamos_chan_mode_modify_dyn_osmo_hvhh testcase </failure> </testcase> <testcase classname='BTS_Tests_ASCI' name='TC_vbs_notification' time='15.040954'> <failure type='fail-verdict'>"BTS_Tests.ttcn:291 : Timeout waiting for RSL bring up" BTS_Tests_ASCI.ttcn:422 BTS_Tests_ASCI control part BTS_Tests_ASCI.ttcn:83 TC_vbs_notification testcase </failure> </testcase> <testcase classname='BTS_Tests_ASCI' name='TC_vgcs_uplink_free_and_busy' time='15.037998'> <failure type='fail-verdict'>"BTS_Tests.ttcn:291 : Timeout waiting for RSL bring up" BTS_Tests_ASCI.ttcn:423 BTS_Tests_ASCI control part BTS_Tests_ASCI.ttcn:190 TC_vgcs_uplink_free_and_busy testcase </failure> </testcase> <testcase classname='BTS_Tests_ASCI' name='TC_vgcs_talker_fail' time='15.028573'> <failure type='fail-verdict'>"BTS_Tests.ttcn:291 : Timeout waiting for RSL bring up" BTS_Tests_ASCI.ttcn:424 BTS_Tests_ASCI control part BTS_Tests_ASCI.ttcn:289 TC_vgcs_talker_fail testcase </failure> </testcase> <testcase classname='BTS_Tests_ASCI' name='TC_vgcs_talker_est_rel' time='15.029821'> <failure type='fail-verdict'>"BTS_Tests.ttcn:291 : Timeout waiting for RSL bring up" BTS_Tests_ASCI.ttcn:425 BTS_Tests_ASCI control part BTS_Tests_ASCI.ttcn:333 TC_vgcs_talker_est_rel testcase </failure> </testcase> <testcase classname='BTS_Tests_ASCI' name='TC_vgcs_listener_det' time='15.026678'> <failure type='fail-verdict'>"BTS_Tests.ttcn:291 : Timeout waiting for RSL bring up" BTS_Tests_ASCI.ttcn:426 BTS_Tests_ASCI control part BTS_Tests_ASCI.ttcn:411 TC_vgcs_listener_det testcase </failure> </testcase> </testsuite> Build step 'Execute shell' marked build as failure Recording test results [Checks API] No suitable checks publisher found.
See https://jenkins.osmocom.org/jenkins/job/ttcn3-bts-test-io_uring/326/display/redirect
Changes:
------------------------------------------ [...truncated 344.27 KiB...] #16 261.8 Setting up python3-pygments (2.14.0+dfsg-1) ... #16 262.2 Setting up libboost-program-options-dev:amd64 (1.74.0.3) ... #16 262.3 Setting up libpython3.11-dev:amd64 (3.11.2-6+deb12u5) ... #16 262.3 Setting up libboost-system1.74-dev:amd64 (1.74.0+ds1-21) ... #16 262.4 Setting up virtualenv (20.17.1+ds-1) ... #16 262.4 Setting up libboost-random1.74-dev:amd64 (1.74.0+ds1-21) ... #16 262.5 Setting up libboost-timer1.74-dev:amd64 (1.74.0+ds1-21) ... #16 262.5 Setting up libelf-dev:amd64 (0.188-2.1) ... #16 262.6 Setting up python3-pip (23.0.1+dfsg-1) ... #16 263.1 Setting up texinfo (6.8-6+b1) ... #16 263.2 Running mktexlsr. This may take some time. ... done. #16 263.4 Setting up cppcheck (2.10-2) ... #16 263.5 Setting up libboost-serialization1.74-dev:amd64 (1.74.0+ds1-21) ... #16 263.5 Setting up libboost-atomic1.74-dev:amd64 (1.74.0+ds1-21) ... #16 263.6 Setting up equivs (2.3.1) ... #16 263.6 Setting up libboost-atomic-dev:amd64 (1.74.0.3) ... #16 263.7 Setting up g++ (4:12.2.0-3) ... #16 263.7 update-alternatives: using /usr/bin/g++ to provide /usr/bin/c++ (c++) in auto mode #16 263.7 Setting up libboost-regex1.74-dev:amd64 (1.74.0+ds1-21) ... #16 263.8 Setting up python3-astroid (2.14.2-1) ... #16 264.0 Setting up libsnmp-dev (5.9.3+dfsg-2) ... #16 264.5 Setting up build-essential (12.9) ... #16 264.5 Setting up libzmq3-dev:amd64 (4.3.4-6) ... #16 264.6 Setting up texlive-xetex (2022.20230122-3) ... #16 264.7 Setting up libboost-dev:amd64 (1.74.0.3) ... #16 264.7 Setting up libboost-math1.74-dev:amd64 (1.74.0+ds1-21) ... #16 264.8 Setting up libboost-filesystem1.74-dev:amd64 (1.74.0+ds1-21) ... #16 264.8 Setting up libopenmpi-dev:amd64 (4.1.4-3+b1) ... #16 264.9 update-alternatives: using /usr/lib/x86_64-linux-gnu/openmpi/include to provide /usr/include/x86_64-linux-gnu/mpi (mpi-x86_64-linux-gnu) in auto mode #16 264.9 Setting up libboost-stacktrace1.74-dev:amd64 (1.74.0+ds1-21) ... #16 264.9 Setting up libboost-test1.74-dev:amd64 (1.74.0+ds1-21) ... #16 265.0 Setting up libboost-regex-dev:amd64 (1.74.0.3) ... #16 265.0 Setting up libmount-dev:amd64 (2.38.1-5+deb12u3) ... #16 265.1 Setting up libboost-timer-dev:amd64 (1.74.0.3) ... #16 265.1 Setting up libboost-filesystem-dev:amd64 (1.74.0.3) ... #16 265.2 Setting up python3-mako (1.2.4+ds-1) ... #16 265.3 Setting up libboost-mpi-python1.74.0 (1.74.0+ds1-21) ... #16 265.5 Setting up libpython3-dev:amd64 (3.11.2-1+b1) ... #16 265.5 Setting up python3-importlib-metadata (4.12.0-1) ... #16 265.7 Setting up libboost-wave1.74-dev:amd64 (1.74.0+ds1-21) ... #16 265.7 Setting up python3-logilab-common (1.9.8-1) ... #16 265.9 Setting up libboost-chrono-dev:amd64 (1.74.0.3) ... #16 265.9 Setting up python3.11-dev (3.11.2-6+deb12u5) ... #16 266.0 Setting up libboost-math-dev:amd64 (1.74.0.3) ... #16 266.0 Setting up libboost-system-dev:amd64 (1.74.0.3) ... #16 266.1 Setting up dahdi-source (1:2.11.1.0.20170917~dfsg-8.4) ... #16 266.1 Setting up libboost-random-dev:amd64 (1.74.0.3) ... #16 266.2 Setting up libboost-wave-dev:amd64 (1.74.0.3) ... #16 266.3 Setting up libboost-test-dev:amd64 (1.74.0.3) ... #16 266.3 Setting up libboost-iostreams1.74-dev:amd64 (1.74.0+ds1-21) ... #16 266.4 Setting up libboost-date-time1.74-dev:amd64 (1.74.0+ds1-21) ... #16 266.4 Setting up texlive-formats-extra (2022.20230122-4) ... #16 266.5 Setting up libglib2.0-dev:amd64 (2.74.6-2+deb12u5) ... #16 266.6 Setting up libboost-graph1.74-dev:amd64 (1.74.0+ds1-21) ... #16 266.6 Setting up python3-dev (3.11.2-1+b1) ... #16 266.7 Setting up libboost-serialization-dev:amd64 (1.74.0.3) ... #16 266.7 Setting up libboost-date-time-dev:amd64 (1.74.0.3) ... #16 266.8 Setting up libboost-graph-parallel1.74-dev (1.74.0+ds1-21) ... #16 266.8 Setting up mpi-default-dev (1.14) ... #16 266.9 Setting up libboost-stacktrace-dev:amd64 (1.74.0.3) ... #16 266.9 Setting up libboost-thread1.74-dev:amd64 (1.74.0+ds1-21) ... #16 267.0 Setting up pylint (2.16.2-2) ... #16 267.2 Setting up libboost-thread-dev:amd64 (1.74.0.3) ... #16 267.3 Setting up libsofia-sip-ua-glib-dev (1.12.11+20110422.1+1e14eea~dfsg-6) ... #16 267.3 Setting up libboost-graph-dev:amd64 (1.74.0.3) ... #16 267.4 Setting up libboost-log1.74-dev (1.74.0+ds1-21) ... #16 267.4 Setting up libboost-mpi1.74-dev (1.74.0+ds1-21) ... #16 267.5 Setting up libboost-mpi-python1.74-dev (1.74.0+ds1-21) ... #16 267.6 Setting up libboost-iostreams-dev:amd64 (1.74.0.3) ... #16 267.6 Setting up libboost-context1.74-dev:amd64 (1.74.0+ds1-21) ... #16 267.7 Setting up libboost-python1.74-dev (1.74.0+ds1-21) ... #16 267.7 Setting up libboost-python-dev (1.74.0.3) ... #16 267.8 Setting up libboost-fiber1.74-dev:amd64 (1.74.0+ds1-21) ... #16 267.8 Setting up libboost-mpi-python-dev (1.74.0.3) ... #16 267.9 Setting up libboost-type-erasure1.74-dev:amd64 (1.74.0+ds1-21) ... #16 267.9 Setting up libboost-mpi-dev (1.74.0.3) ... #16 268.0 Setting up libboost-locale1.74-dev:amd64 (1.74.0+ds1-21) ... #16 268.0 Setting up libboost-graph-parallel-dev (1.74.0.3) ... #16 268.1 Setting up libboost-coroutine1.74-dev:amd64 (1.74.0+ds1-21) ... #16 268.1 Setting up libboost-coroutine-dev:amd64 (1.74.0.3) ... #16 268.2 Setting up libboost-log-dev (1.74.0.3) ... #16 268.2 Setting up libboost-fiber-dev:amd64 (1.74.0.3) ... #16 268.3 Setting up libboost-locale-dev:amd64 (1.74.0.3) ... #16 268.3 Setting up libboost-context-dev:amd64 (1.74.0.3) ... #16 268.4 Setting up libboost-type-erasure-dev:amd64 (1.74.0.3) ... #16 268.4 Setting up libboost-all-dev (1.74.0.3) ... #16 268.5 Setting up libdevmapper1.02.1:amd64 (2:1.02.185-2) ... #16 268.6 Setting up dmsetup (2:1.02.185-2) ... #16 268.6 Setting up libcryptsetup12:amd64 (2:2.6.1-4~deb12u2) ... #16 268.7 Setting up libwww-perl (6.68-1) ... #16 268.7 Setting up systemd (252.36-1~deb12u1) ... #16 268.9 Created symlink /etc/systemd/system/getty.target.wants/getty@tty1.service → /lib/systemd/system/getty@.service. #16 268.9 Created symlink /etc/systemd/system/multi-user.target.wants/remote-fs.target → /lib/systemd/system/remote-fs.target. #16 268.9 Created symlink /etc/systemd/system/sysinit.target.wants/systemd-pstore.service → /lib/systemd/system/systemd-pstore.service. #16 268.9 Initializing machine ID from D-Bus machine ID. #16 269.0 Creating group 'systemd-journal' with GID 999. #16 269.0 Creating group 'systemd-network' with GID 998. #16 269.0 Creating user 'systemd-network' (systemd Network Management) with UID 998 and GID 998. #16 269.1 Setting up devscripts (2.23.4+deb12u2) ... #16 269.3 Setting up liblwp-protocol-https-perl (6.10-1) ... #16 269.4 Processing triggers for libc-bin (2.36-9+deb12u10) ... #16 269.5 Processing triggers for sgml-base (1.31) ... #16 269.6 Setting up libdbus-1-dev:amd64 (1.14.10-1~deb12u1) ... #16 269.7 Setting up docbook-xsl (1.79.2+dfsg-2) ... #16 269.9 Setting up docutils-common (0.19+dfsg-6) ... #16 270.1 Setting up sgml-data (2.0.11+nmu1) ... #16 270.4 Setting up libpcap0.8-dev:amd64 (1.10.3-1) ... #16 270.5 Setting up docbook5-xml (5.0-3) ... #16 270.6 Setting up asciidoc-base (10.2.0-1) ... #16 271.0 Setting up libpcap-dev:amd64 (1.10.3-1) ... #16 271.1 Setting up asciidoc (10.2.0-1) ... #16 271.4 Processing triggers for sgml-base (1.31) ... #16 271.5 Setting up docbook (4.5-10) ... #16 271.8 Setting up python3-docutils (0.19+dfsg-6) ... #16 272.1 Setting up docbook-xml (4.5-12) ... #16 273.0 Setting up python3-blockdiag (2.0.1+dfsg-1) ... #16 273.2 Setting up python3-nwdiag (2.0.0+dfsg-1.1) ... #16 273.3 Processing triggers for sgml-base (1.31) ... #16 273.4 Setting up dblatex (0.3.12py3-2) ... #16 273.6 Setting up docbook-dsssl (1.79-10) ... #16 273.7 Processing triggers for sgml-base (1.31) ... #16 273.8 Setting up docbook-utils (0.6.14-4) ... #16 273.8 Setting up asciidoc-dblatex (10.2.0-1) ... #16 274.0 Processing triggers for dbus (1.14.10-1~deb12u1) ... #16 274.0 Processing triggers for tex-common (6.18) ... #16 274.1 debconf: unable to initialize frontend: Dialog #16 274.1 debconf: (TERM is not set, so the dialog frontend is not usable.) #16 274.1 debconf: falling back to frontend: Readline #16 274.1 debconf: unable to initialize frontend: Readline #16 274.1 debconf: (This frontend requires a controlling tty.) #16 274.1 debconf: falling back to frontend: Teletype #16 274.1 Running updmap-sys. This may take some time... done. #16 274.5 Running mktexlsr /var/lib/texmf ... done. #16 274.7 Building format(s) --all. #16 274.7 This may take some time... done. #16 305.7 + apt-get clean #16 DONE 306.1s
#17 [ 7/16] ADD HTTPS://GITEA.OSMOCOM.ORG/SIM-CARD/PYSIM/RAW/BRANCH/MASTER/REQUIREMENTS.TXT /tmp/pysim_requirements.txt #17 DONE 0.2s
#18 [ 8/16] RUN SET -x && cat /tmp/pysim_requirements.txt && pip3 install --break-system-packages 'git+https://github.com/eriwen/lcov-to-cobertura-xml.git' 'git+https://github.com/osmocom/sphinx-argparse@inside-classes#egg=sphinx-argpars...' 'git+https://github.com/podshumok/python-smpplib.git' 'pydbus' 'pysispm' 'ruff' 'sphinx' 'sphinxcontrib-napoleon' -r /tmp/pysim_requirements.txt #18 0.370 + cat /tmp/pysim_requirements.txt #18 0.370 pyscard #18 0.370 pyserial #18 0.370 pytlv #18 0.370 cmd2>=1.5 #18 0.370 jsonpath-ng #18 0.370 construct>=2.10.70 #18 0.370 bidict #18 0.370 pyosmocom>=0.0.8 #18 0.370 pyyaml>=5.1 #18 0.370 termcolor #18 0.370 colorlog #18 0.370 pycryptodomex #18 0.370 cryptography #18 0.370 git+https://github.com/osmocom/asn1tools #18 0.370 packaging #18 0.370 git+https://github.com/hologram-io/smpp.pdu #18 0.370 + pip3 install --break-system-packages git+https://github.com/eriwen/lcov-to-cobertura-xml.git git+https://github.com/osmocom/sphinx-argparse@inside-classes#egg=sphinx-argpars... git+https://github.com/podshumok/python-smpplib.git pydbus pysispm ruff sphinx sphinxcontrib-napoleon -r /tmp/pysim_requirements.txt #18 0.553 Collecting git+https://github.com/eriwen/lcov-to-cobertura-xml.git #18 0.553 Cloning https://github.com/eriwen/lcov-to-cobertura-xml.git to /tmp/pip-req-build-m81jk1ff #18 0.555 Running command git clone --filter=blob:none --quiet https://github.com/eriwen/lcov-to-cobertura-xml.git /tmp/pip-req-build-m81jk1ff #18 1.350 Resolved https://github.com/eriwen/lcov-to-cobertura-xml.git to commit 85f51dfd646fadf534ce2bd636befeec37148ff9 #18 1.361 Installing build dependencies: started #18 2.580 Installing build dependencies: finished with status 'done' #18 2.581 Getting requirements to build wheel: started #18 2.666 Getting requirements to build wheel: finished with status 'error' #18 2.668 error: subprocess-exited-with-error #18 2.668 #18 2.668 × Getting requirements to build wheel did not run successfully. #18 2.668 │ exit code: 1 #18 2.668 ╰─> [28 lines of output] #18 2.668 Traceback (most recent call last): #18 2.668 File "/usr/lib/python3/dist-packages/pip/_vendor/pyproject_hooks/_in_process/_in_process.py", line 353, in <module> #18 2.668 main() #18 2.668 File "/usr/lib/python3/dist-packages/pip/_vendor/pyproject_hooks/_in_process/_in_process.py", line 335, in main #18 2.668 json_out['return_val'] = hook(**hook_input['kwargs']) #18 2.668 ^^^^^^^^^^^^^^^^^^^^^^^^^^^^ #18 2.668 File "/usr/lib/python3/dist-packages/pip/_vendor/pyproject_hooks/_in_process/_in_process.py", line 118, in get_requires_for_build_wheel #18 2.668 return hook(config_settings) #18 2.668 ^^^^^^^^^^^^^^^^^^^^^ #18 2.668 File "/tmp/pip-build-env-0k6__s0i/overlay/local/lib/python3.11/dist-packages/setuptools/build_meta.py", line 334, in get_requires_for_build_wheel #18 2.668 return self._get_build_requires(config_settings, requirements=[]) #18 2.668 ^^^^^^^^^^^^^^^^^^^^^^^^^^^^^^^^^^^^^^^^^^^^^^^^^^^^^^^^^^ #18 2.668 File "/tmp/pip-build-env-0k6__s0i/overlay/local/lib/python3.11/dist-packages/setuptools/build_meta.py", line 304, in _get_build_requires #18 2.668 self.run_setup() #18 2.668 File "/tmp/pip-build-env-0k6__s0i/overlay/local/lib/python3.11/dist-packages/setuptools/build_meta.py", line 320, in run_setup #18 2.668 exec(code, locals()) #18 2.668 File "<string>", line 3, in <module> #18 2.668 File "/tmp/pip-build-env-0k6__s0i/overlay/local/lib/python3.11/dist-packages/setuptools/__init__.py", line 116, in setup #18 2.668 _install_setup_requires(attrs) #18 2.668 File "/tmp/pip-build-env-0k6__s0i/overlay/local/lib/python3.11/dist-packages/setuptools/__init__.py", line 87, in _install_setup_requires #18 2.668 dist.parse_config_files(ignore_option_errors=True) #18 2.668 File "/tmp/pip-build-env-0k6__s0i/overlay/local/lib/python3.11/dist-packages/setuptools/dist.py", line 759, in parse_config_files #18 2.668 self._finalize_license_expression() #18 2.668 File "/tmp/pip-build-env-0k6__s0i/overlay/local/lib/python3.11/dist-packages/setuptools/dist.py", line 432, in _finalize_license_expression #18 2.668 raise InvalidConfigError( #18 2.668 setuptools.errors.InvalidConfigError: License classifiers have been superseded by license expressions (see https://peps.python.org/pep-0639/). Please remove: #18 2.668 #18 2.668 License :: OSI Approved :: Apache Software License #18 2.668 [end of output] #18 2.668 #18 2.668 note: This error originates from a subprocess, and is likely not a problem with pip. #18 2.669 error: subprocess-exited-with-error #18 2.669 #18 2.669 × Getting requirements to build wheel did not run successfully. #18 2.669 │ exit code: 1 #18 2.669 ╰─> See above for output. #18 2.669 #18 2.669 note: This error originates from a subprocess, and is likely not a problem with pip. #18 ERROR: process "/bin/sh -c set -x && \tcat /tmp/pysim_requirements.txt && \tpip3 install --break-system-packages \t\t'git+https://github.com/eriwen/lcov-to-cobertura-xml.git' \t\t'git+https://github.com/osmocom/sphinx-argparse@inside-classes#egg=sphinx-argpars...' \t\t'git+https://github.com/podshumok/python-smpplib.git' \t\t'pydbus' \t\t'pysispm' \t\t'ruff' \t\t'sphinx' \t\t'sphinxcontrib-napoleon' \t\t-r /tmp/pysim_requirements.txt" did not complete successfully: exit code: 1 ------
[ 8/16] RUN SET -x && cat /tmp/pysim_requirements.txt && pip3 install --break-system-packages 'git+https://github.com/eriwen/lcov-to-cobertura-xml.git' 'git+https://github.com/osmocom/sphinx-argparse@inside-classes#egg=sphinx-argpars...' 'git+https://github.com/podshumok/python-smpplib.git' 'pydbus' 'pysispm' 'ruff' 'sphinx' 'sphinxcontrib-napoleon' -r /tmp/pysim_requirements.txt:
2.668 [end of output] 2.668 2.668 note: This error originates from a subprocess, and is likely not a problem with pip. 2.669 error: subprocess-exited-with-error 2.669 2.669 × Getting requirements to build wheel did not run successfully. 2.669 │ exit code: 1 2.669 ╰─> See above for output. 2.669 2.669 note: This error originates from a subprocess, and is likely not a problem with pip. ------ Dockerfile:177 -------------------- 176 | ADD https://gitea.osmocom.org/sim-card/pysim/raw/branch/master/requirements.txt /tmp/pysim_requirements.txt 177 | >>> RUN set -x && \ 178 | >>> cat /tmp/pysim_requirements.txt && \ 179 | >>> pip3 install --break-system-packages \ 180 | >>> 'git+https://github.com/eriwen/lcov-to-cobertura-xml.git' \ 181 | >>> 'git+https://github.com/osmocom/sphinx-argparse@inside-classes#egg=sphinx-argpars...' \ 182 | >>> 'git+https://github.com/podshumok/python-smpplib.git' \ 183 | >>> 'pydbus' \ 184 | >>> 'pysispm' \ 185 | >>> 'ruff' \ 186 | >>> 'sphinx' \ 187 | >>> 'sphinxcontrib-napoleon' \ 188 | >>> -r /tmp/pysim_requirements.txt 189 | -------------------- ERROR: failed to solve: process "/bin/sh -c set -x && \tcat /tmp/pysim_requirements.txt && \tpip3 install --break-system-packages \t\t'git+https://github.com/eriwen/lcov-to-cobertura-xml.git' \t\t'git+https://github.com/osmocom/sphinx-argparse@inside-classes#egg=sphinx-argpars...' \t\t'git+https://github.com/podshumok/python-smpplib.git' \t\t'pydbus' \t\t'pysispm' \t\t'ruff' \t\t'sphinx' \t\t'sphinxcontrib-napoleon' \t\t-r /tmp/pysim_requirements.txt" did not complete successfully: exit code: 1 make: *** [../make/Makefile:95: docker-build] Error 1 make: Leaving directory 'https://jenkins.osmocom.org/jenkins/job/ttcn3-bts-test-io_uring/ws/debian-bookworm-build' + exit 1 Build step 'Execute shell' marked build as failure Recording test results ERROR: Step ‘Publish JUnit test result report’ failed: No test report files were found. Configuration error?
See https://jenkins.osmocom.org/jenkins/job/ttcn3-bts-test-io_uring/327/display/redirect?page=changes
Changes:
[Oliver Smith] debian-bookworm-build: fix lcov-to-cobertura-xml
------------------------------------------ [...truncated 10.93 MiB...] BTS_Tests_LAPDm.ttcn:1479 BTS_Tests_LAPDm control part BTS_Tests_LAPDm.ttcn:225 TC_sabm_retransmit testcase </failure> </testcase> <testcase classname='BTS_Tests_LAPDm:hopping' name='TC_sabm_retransmit_bts' time='15.043437'> <failure type='fail-verdict'>"BTS_Tests.ttcn:291 : Timeout waiting for RSL bring up" BTS_Tests_LAPDm.ttcn:1480 BTS_Tests_LAPDm control part BTS_Tests_LAPDm.ttcn:315 TC_sabm_retransmit_bts testcase </failure> </testcase> <testcase classname='BTS_Tests_LAPDm:hopping' name='TC_sabm_invalid_resp' time='15.034230'> <failure type='fail-verdict'>"BTS_Tests.ttcn:291 : Timeout waiting for RSL bring up" BTS_Tests_LAPDm.ttcn:1481 BTS_Tests_LAPDm control part BTS_Tests_LAPDm.ttcn:379 TC_sabm_invalid_resp testcase </failure> </testcase> <testcase classname='BTS_Tests_LAPDm:hopping' name='TC_sabm_dm' time='15.029055'> <failure type='fail-verdict'>"BTS_Tests.ttcn:291 : Timeout waiting for RSL bring up" BTS_Tests_LAPDm.ttcn:1482 BTS_Tests_LAPDm control part BTS_Tests_LAPDm.ttcn:425 TC_sabm_dm testcase </failure> </testcase> <testcase classname='BTS_Tests_LAPDm:hopping' name='TC_establish_ign_first_sabm' time='15.030746'> <failure type='fail-verdict'>"BTS_Tests.ttcn:291 : Timeout waiting for RSL bring up" BTS_Tests_LAPDm.ttcn:1483 BTS_Tests_LAPDm control part BTS_Tests_LAPDm.ttcn:488 TC_establish_ign_first_sabm testcase </failure> </testcase> <testcase classname='BTS_Tests_LAPDm:hopping' name='TC_iframe_seq_and_ack' time='15.041196'> <failure type='fail-verdict'>"BTS_Tests.ttcn:291 : Timeout waiting for RSL bring up" BTS_Tests_LAPDm.ttcn:1484 BTS_Tests_LAPDm control part BTS_Tests_LAPDm.ttcn:579 TC_iframe_seq_and_ack testcase </failure> </testcase> <testcase classname='BTS_Tests_LAPDm:hopping' name='TC_iframe_timer_recovery' time='15.039817'> <failure type='fail-verdict'>"BTS_Tests.ttcn:291 : Timeout waiting for RSL bring up" BTS_Tests_LAPDm.ttcn:1485 BTS_Tests_LAPDm control part BTS_Tests_LAPDm.ttcn:685 TC_iframe_timer_recovery testcase </failure> </testcase> <testcase classname='BTS_Tests_LAPDm:hopping' name='TC_ns_seq_error' time='15.037866'> <failure type='fail-verdict'>"BTS_Tests.ttcn:291 : Timeout waiting for RSL bring up" BTS_Tests_LAPDm.ttcn:1486 BTS_Tests_LAPDm control part BTS_Tests_LAPDm.ttcn:768 TC_ns_seq_error testcase </failure> </testcase> <testcase classname='BTS_Tests_LAPDm:hopping' name='TC_nr_seq_error' time='15.024843'> <failure type='fail-verdict'>"BTS_Tests.ttcn:291 : Timeout waiting for RSL bring up" BTS_Tests_LAPDm.ttcn:1487 BTS_Tests_LAPDm control part BTS_Tests_LAPDm.ttcn:831 TC_nr_seq_error testcase </failure> </testcase> <testcase classname='BTS_Tests_LAPDm:hopping' name='TC_rec_invalid_frame' time='15.036457'> <failure type='fail-verdict'>"BTS_Tests.ttcn:291 : Timeout waiting for RSL bring up" BTS_Tests_LAPDm.ttcn:1488 BTS_Tests_LAPDm control part BTS_Tests_LAPDm.ttcn:961 TC_rec_invalid_frame testcase </failure> </testcase> <testcase classname='BTS_Tests_LAPDm:hopping' name='TC_segm_concat_dcch' time='15.038050'> <failure type='fail-verdict'>"BTS_Tests.ttcn:291 : Timeout waiting for RSL bring up" BTS_Tests_LAPDm.ttcn:1489 BTS_Tests_LAPDm control part BTS_Tests_LAPDm.ttcn:1088 TC_segm_concat_dcch testcase </failure> </testcase> <testcase classname='BTS_Tests_LAPDm:hopping' name='TC_segm_concat_sacch' time='15.034244'> <failure type='fail-verdict'>"BTS_Tests.ttcn:291 : Timeout waiting for RSL bring up" BTS_Tests_LAPDm.ttcn:1490 BTS_Tests_LAPDm control part BTS_Tests_LAPDm.ttcn:1093 TC_segm_concat_sacch testcase </failure> </testcase> <testcase classname='BTS_Tests_LAPDm:hopping' name='TC_t200_n200' time='15.039164'> <failure type='fail-verdict'>"BTS_Tests.ttcn:291 : Timeout waiting for RSL bring up" BTS_Tests_LAPDm.ttcn:1491 BTS_Tests_LAPDm control part BTS_Tests_LAPDm.ttcn:1182 TC_t200_n200 testcase </failure> </testcase> <testcase classname='BTS_Tests_LAPDm:hopping' name='TC_rr_response_frame_loss' time='15.046635'> <failure type='fail-verdict'>"BTS_Tests.ttcn:291 : Timeout waiting for RSL bring up" BTS_Tests_LAPDm.ttcn:1492 BTS_Tests_LAPDm control part BTS_Tests_LAPDm.ttcn:1239 TC_rr_response_frame_loss testcase </failure> </testcase> <testcase classname='BTS_Tests_LAPDm:hopping' name='TC_incorrect_cr' time='15.034719'> <failure type='fail-verdict'>"BTS_Tests.ttcn:291 : Timeout waiting for RSL bring up" BTS_Tests_LAPDm.ttcn:1493 BTS_Tests_LAPDm control part BTS_Tests_LAPDm.ttcn:1293 TC_incorrect_cr testcase </failure> </testcase> <testcase classname='BTS_Tests_LAPDm:hopping' name='TC_sabm_incorrect_c' time='15.039505'> <failure type='fail-verdict'>"BTS_Tests.ttcn:291 : Timeout waiting for RSL bring up" BTS_Tests_LAPDm.ttcn:1494 BTS_Tests_LAPDm control part BTS_Tests_LAPDm.ttcn:1341 TC_sabm_incorrect_c testcase </failure> </testcase> <testcase classname='BTS_Tests_LAPDm:hopping' name='TC_normal_reestablishment' time='15.033056'> <failure type='fail-verdict'>"BTS_Tests.ttcn:291 : Timeout waiting for RSL bring up" BTS_Tests_LAPDm.ttcn:1495 BTS_Tests_LAPDm control part BTS_Tests_LAPDm.ttcn:1403 TC_normal_reestablishment testcase </failure> </testcase> <testcase classname='BTS_Tests_LAPDm:hopping' name='TC_normal_reestablishment_state_unacked' time='15.044045'> <failure type='fail-verdict'>"BTS_Tests.ttcn:291 : Timeout waiting for RSL bring up" BTS_Tests_LAPDm.ttcn:1496 BTS_Tests_LAPDm control part BTS_Tests_LAPDm.ttcn:1470 TC_normal_reestablishment_state_unacked testcase </failure> </testcase> <testcase classname='BTS_Tests_VAMOS:hopping' name='TC_vamos_chan_act_vff' time='15.044942'> <failure type='fail-verdict'>"BTS_Tests.ttcn:291 : Timeout waiting for RSL bring up" BTS_Tests_VAMOS.ttcn:316 BTS_Tests_VAMOS control part BTS_Tests_VAMOS.ttcn:210 TC_vamos_chan_act_vff testcase </failure> </testcase> <testcase classname='BTS_Tests_VAMOS:hopping' name='TC_vamos_chan_act_vhh' time='15.028061'> <failure type='fail-verdict'>"BTS_Tests.ttcn:291 : Timeout waiting for RSL bring up" BTS_Tests_VAMOS.ttcn:317 BTS_Tests_VAMOS control part BTS_Tests_VAMOS.ttcn:224 TC_vamos_chan_act_vhh testcase </failure> </testcase> <testcase classname='BTS_Tests_VAMOS:hopping' name='TC_vamos_chan_act_hvhh' time='15.039109'> <failure type='fail-verdict'>"BTS_Tests.ttcn:291 : Timeout waiting for RSL bring up" BTS_Tests_VAMOS.ttcn:318 BTS_Tests_VAMOS control part BTS_Tests_VAMOS.ttcn:234 TC_vamos_chan_act_hvhh testcase </failure> </testcase> <testcase classname='BTS_Tests_VAMOS:hopping' name='TC_vamos_chan_act_dyn_ipa_vff' time='15.028667'> <failure type='fail-verdict'>"BTS_Tests.ttcn:291 : Timeout waiting for RSL bring up" BTS_Tests_VAMOS.ttcn:319 BTS_Tests_VAMOS control part BTS_Tests_VAMOS.ttcn:214 TC_vamos_chan_act_dyn_ipa_vff testcase </failure> </testcase> <testcase classname='BTS_Tests_VAMOS:hopping' name='TC_vamos_chan_act_dyn_osmo_vff' time='15.039463'> <failure type='fail-verdict'>"BTS_Tests.ttcn:291 : Timeout waiting for RSL bring up" BTS_Tests_VAMOS.ttcn:320 BTS_Tests_VAMOS control part BTS_Tests_VAMOS.ttcn:218 TC_vamos_chan_act_dyn_osmo_vff testcase </failure> </testcase> <testcase classname='BTS_Tests_VAMOS:hopping' name='TC_vamos_chan_act_dyn_osmo_vhh' time='15.034685'> <failure type='fail-verdict'>"BTS_Tests.ttcn:291 : Timeout waiting for RSL bring up" BTS_Tests_VAMOS.ttcn:321 BTS_Tests_VAMOS control part BTS_Tests_VAMOS.ttcn:228 TC_vamos_chan_act_dyn_osmo_vhh testcase </failure> </testcase> <testcase classname='BTS_Tests_VAMOS:hopping' name='TC_vamos_chan_act_dyn_osmo_hvhh' time='15.042297'> <failure type='fail-verdict'>"BTS_Tests.ttcn:291 : Timeout waiting for RSL bring up" BTS_Tests_VAMOS.ttcn:322 BTS_Tests_VAMOS control part BTS_Tests_VAMOS.ttcn:238 TC_vamos_chan_act_dyn_osmo_hvhh testcase </failure> </testcase> <testcase classname='BTS_Tests_VAMOS:hopping' name='TC_vamos_chan_mode_modify_vff' time='15.036650'> <failure type='fail-verdict'>"BTS_Tests.ttcn:291 : Timeout waiting for RSL bring up" BTS_Tests_VAMOS.ttcn:325 BTS_Tests_VAMOS control part BTS_Tests_VAMOS.ttcn:283 TC_vamos_chan_mode_modify_vff testcase </failure> </testcase> <testcase classname='BTS_Tests_VAMOS:hopping' name='TC_vamos_chan_mode_modify_vhh' time='15.029889'> <failure type='fail-verdict'>"BTS_Tests.ttcn:291 : Timeout waiting for RSL bring up" BTS_Tests_VAMOS.ttcn:326 BTS_Tests_VAMOS control part BTS_Tests_VAMOS.ttcn:297 TC_vamos_chan_mode_modify_vhh testcase </failure> </testcase> <testcase classname='BTS_Tests_VAMOS:hopping' name='TC_vamos_chan_mode_modify_hvhh' time='15.024462'> <failure type='fail-verdict'>"BTS_Tests.ttcn:291 : Timeout waiting for RSL bring up" BTS_Tests_VAMOS.ttcn:327 BTS_Tests_VAMOS control part BTS_Tests_VAMOS.ttcn:307 TC_vamos_chan_mode_modify_hvhh testcase </failure> </testcase> <testcase classname='BTS_Tests_VAMOS:hopping' name='TC_vamos_chan_mode_modify_dyn_ipa_vff' time='15.038757'> <failure type='fail-verdict'>"BTS_Tests.ttcn:291 : Timeout waiting for RSL bring up" BTS_Tests_VAMOS.ttcn:328 BTS_Tests_VAMOS control part BTS_Tests_VAMOS.ttcn:287 TC_vamos_chan_mode_modify_dyn_ipa_vff testcase </failure> </testcase> <testcase classname='BTS_Tests_VAMOS:hopping' name='TC_vamos_chan_mode_modify_dyn_osmo_vff' time='15.041500'> <failure type='fail-verdict'>"BTS_Tests.ttcn:291 : Timeout waiting for RSL bring up" BTS_Tests_VAMOS.ttcn:329 BTS_Tests_VAMOS control part BTS_Tests_VAMOS.ttcn:291 TC_vamos_chan_mode_modify_dyn_osmo_vff testcase </failure> </testcase> <testcase classname='BTS_Tests_VAMOS:hopping' name='TC_vamos_chan_mode_modify_dyn_osmo_vhh' time='15.034302'> <failure type='fail-verdict'>"BTS_Tests.ttcn:291 : Timeout waiting for RSL bring up" BTS_Tests_VAMOS.ttcn:330 BTS_Tests_VAMOS control part BTS_Tests_VAMOS.ttcn:301 TC_vamos_chan_mode_modify_dyn_osmo_vhh testcase </failure> </testcase> <testcase classname='BTS_Tests_VAMOS:hopping' name='TC_vamos_chan_mode_modify_dyn_osmo_hvhh' time='15.042173'> <failure type='fail-verdict'>"BTS_Tests.ttcn:291 : Timeout waiting for RSL bring up" BTS_Tests_VAMOS.ttcn:331 BTS_Tests_VAMOS control part BTS_Tests_VAMOS.ttcn:311 TC_vamos_chan_mode_modify_dyn_osmo_hvhh testcase </failure> </testcase> <testcase classname='BTS_Tests_ASCI:hopping' name='TC_vbs_notification' time='15.042475'> <failure type='fail-verdict'>"BTS_Tests.ttcn:291 : Timeout waiting for RSL bring up" BTS_Tests_ASCI.ttcn:422 BTS_Tests_ASCI control part BTS_Tests_ASCI.ttcn:83 TC_vbs_notification testcase </failure> </testcase> <testcase classname='BTS_Tests_ASCI:hopping' name='TC_vgcs_uplink_free_and_busy' time='15.026976'> <failure type='fail-verdict'>"BTS_Tests.ttcn:291 : Timeout waiting for RSL bring up" BTS_Tests_ASCI.ttcn:423 BTS_Tests_ASCI control part BTS_Tests_ASCI.ttcn:190 TC_vgcs_uplink_free_and_busy testcase </failure> </testcase> <testcase classname='BTS_Tests_ASCI:hopping' name='TC_vgcs_talker_fail' time='15.041630'> <failure type='fail-verdict'>"BTS_Tests.ttcn:291 : Timeout waiting for RSL bring up" BTS_Tests_ASCI.ttcn:424 BTS_Tests_ASCI control part BTS_Tests_ASCI.ttcn:289 TC_vgcs_talker_fail testcase </failure> </testcase> <testcase classname='BTS_Tests_ASCI:hopping' name='TC_vgcs_talker_est_rel' time='15.041095'> <failure type='fail-verdict'>"BTS_Tests.ttcn:291 : Timeout waiting for RSL bring up" BTS_Tests_ASCI.ttcn:425 BTS_Tests_ASCI control part BTS_Tests_ASCI.ttcn:333 TC_vgcs_talker_est_rel testcase </failure> </testcase> <testcase classname='BTS_Tests_ASCI:hopping' name='TC_vgcs_listener_det' time='15.039383'> <failure type='fail-verdict'>"BTS_Tests.ttcn:291 : Timeout waiting for RSL bring up" BTS_Tests_ASCI.ttcn:426 BTS_Tests_ASCI control part BTS_Tests_ASCI.ttcn:411 TC_vgcs_listener_det testcase </failure> </testcase> </testsuite> <?xml version="1.0"?> <testsuite name='Titan' tests='17' failures='1' errors='0' skipped='0' inconc='0' time='98.00'> <testcase classname='BTS_Tests_OML' name='TC_wrong_mdisc' time='10.744264'/> <testcase classname='BTS_Tests_OML' name='TC_wrong_msgtype' time='0.697007'/> <testcase classname='BTS_Tests_OML' name='TC_short_length' time='0.693029'/> <testcase classname='BTS_Tests_OML' name='TC_long_length' time='0.679206'/> <testcase classname='BTS_Tests_OML' name='TC_wrong_placement' time='0.680009'/> <testcase classname='BTS_Tests_OML' name='TC_wrong_seq' time='0.671836'/> <testcase classname='BTS_Tests_OML' name='TC_wrong_obj_class' time='0.684461'/> <testcase classname='BTS_Tests_OML' name='TC_wrong_bts_nr' time='0.685379'/> <testcase classname='BTS_Tests_OML' name='TC_wrong_trx_nr' time='0.675112'/> <testcase classname='BTS_Tests_OML' name='TC_radio_carrier_opstart_noattr' time='0.696963'/> <testcase classname='BTS_Tests_OML' name='TC_bts_opstart' time='0.699413'/> <testcase classname='BTS_Tests_OML' name='TC_bts_opstart_noattr' time='0.709077'/> <testcase classname='BTS_Tests_OML' name='TC_ts_opstart' time='0.708571'/> <testcase classname='BTS_Tests_OML' name='TC_ts_opstart_noattr' time='0.691503'/> <testcase classname='BTS_Tests_OML' name='TC_initial_state_reports' time='0.701087'/> <testcase classname='BTS_Tests_OML' name='TC_ipa_osmo_pcu_anr_fwd' time='2.734686'> <failure type='fail-verdict'>Timeout waiting for ANR request on PCU inteface BTS_Tests_OML.ttcn:818 BTS_Tests_OML control part BTS_Tests_OML.ttcn:797 TC_ipa_osmo_pcu_anr_fwd testcase </failure> </testcase> <testcase classname='BTS_Tests_OML' name='TC_ipa_rsl_connect_nack' time='0.742957'/> </testsuite> Build step 'Execute shell' marked build as failure Recording test results [Checks API] No suitable checks publisher found.
jenkins-notifications@lists.osmocom.org