See https://jenkins.osmocom.org/jenkins/job/master-dahdi-linux-torvalds-master/41/display/redirect
Changes:
------------------------------------------ Started by timer Running as SYSTEM Building remotely on host2-deb11build-ansible (ttcn3 obs osmocom-gerrit osmocom-master) in workspace https://jenkins.osmocom.org/jenkins/job/master-dahdi-linux-torvalds-master/ws/ The recommended git tool is: NONE No credentials specified
git rev-parse --resolve-git-dir https://jenkins.osmocom.org/jenkins/job/master-dahdi-linux-torvalds-master/ws/linux/.git # timeout=10
Fetching changes from the remote Git repository
git config remote.origin.url https://git.kernel.org/pub/scm/linux/kernel/git/torvalds/linux.git # timeout=10
Cleaning workspace
git rev-parse --verify HEAD # timeout=10
Resetting working tree
git reset --hard # timeout=10 git clean -fdx # timeout=10
Using shallow fetch with depth 1 Fetching upstream changes from https://git.kernel.org/pub/scm/linux/kernel/git/torvalds/linux.git
git --version # timeout=10 git --version # 'git version 2.30.2' git fetch --tags --force --progress --depth=1 -- https://git.kernel.org/pub/scm/linux/kernel/git/torvalds/linux.git master # timeout=10 git rev-parse origin/master^{commit} # timeout=10
Checking out Revision a4d7d701121981e3c3fe69ade376fe9f26324161 (origin/master)
git config core.sparsecheckout # timeout=10 git checkout -f a4d7d701121981e3c3fe69ade376fe9f26324161 # timeout=10
Commit message: "Merge tag 'spi-fix-v6.4-rc5' of git://git.kernel.org/pub/scm/linux/kernel/git/broonie/spi"
git rev-list --no-walk a4d7d701121981e3c3fe69ade376fe9f26324161 # timeout=10
[master-dahdi-linux-torvalds-master] $ /bin/sh -xe /tmp/jenkins1736053849506795022.sh + rm -rf dahdi-linux + git clone --depth=1 https://gerrit.osmocom.org/dahdi-linux Cloning into 'dahdi-linux'... + git -C dahdi-linux log --oneline 2f93092 compatibility with class_create API change in 6.4-rc1 + docker run --rm=true -e KSRC=/linux -v https://jenkins.osmocom.org/jenkins/job/master-dahdi-linux-torvalds-master/ws/dahdi-linux:/build -v https://jenkins.osmocom.org/jenkins/job/master-dahdi-linux-torvalds-master/ws/linux:/linux osmocom-build/debian-bookworm-build timeout 10m su build -c /build/contrib/jenkins.sh + DEFCONFIG=x86_64_defconfig + realpath /build/contrib/jenkins.sh + dirname /build/contrib/jenkins.sh + realpath /build/contrib/.. + TOPDIR=/build + KSRC=/linux + JOBS=9 + [ -d /linux ] + cd /linux + [ -e .config ] + make x86_64_defconfig HOSTCC scripts/basic/fixdep HOSTCC scripts/kconfig/conf.o HOSTCC scripts/kconfig/confdata.o HOSTCC scripts/kconfig/expr.o LEX scripts/kconfig/lexer.lex.c YACC scripts/kconfig/parser.tab.[ch] HOSTCC scripts/kconfig/lexer.lex.o HOSTCC scripts/kconfig/menu.o HOSTCC scripts/kconfig/parser.tab.o HOSTCC scripts/kconfig/preprocess.o HOSTCC scripts/kconfig/symbol.o HOSTCC scripts/kconfig/util.o HOSTLD scripts/kconfig/conf # # configuration written to .config # + [ arch/x86/configs/x86_64_defconfig -nt .config ] + git log -1 --pretty=%t - %s e91fb39cc8f - Merge tag 'spi-fix-v6.4-rc5' of git://git.kernel.org/pub/scm/linux/kernel/git/broonie/spi + make -j 9 modules_prepare WRAP arch/x86/include/generated/uapi/asm/bpf_perf_event.h WRAP arch/x86/include/generated/uapi/asm/errno.h WRAP arch/x86/include/generated/uapi/asm/fcntl.h SYSHDR arch/x86/include/generated/uapi/asm/unistd_32.h WRAP arch/x86/include/generated/uapi/asm/ioctl.h SYSHDR arch/x86/include/generated/uapi/asm/unistd_64.h WRAP arch/x86/include/generated/uapi/asm/ioctls.h SYSHDR arch/x86/include/generated/uapi/asm/unistd_x32.h WRAP arch/x86/include/generated/uapi/asm/ipcbuf.h WRAP arch/x86/include/generated/uapi/asm/param.h SYSTBL arch/x86/include/generated/asm/syscalls_32.h WRAP arch/x86/include/generated/uapi/asm/poll.h WRAP arch/x86/include/generated/uapi/asm/resource.h WRAP arch/x86/include/generated/uapi/asm/socket.h WRAP arch/x86/include/generated/uapi/asm/sockios.h WRAP arch/x86/include/generated/uapi/asm/termbits.h WRAP arch/x86/include/generated/uapi/asm/termios.h SYSHDR arch/x86/include/generated/asm/unistd_32_ia32.h WRAP arch/x86/include/generated/uapi/asm/types.h HOSTCC arch/x86/tools/relocs_32.o SYSHDR arch/x86/include/generated/asm/unistd_64_x32.h SYSTBL arch/x86/include/generated/asm/syscalls_64.h HOSTCC arch/x86/tools/relocs_64.o UPD include/generated/uapi/linux/version.h UPD include/generated/compile.h HOSTCC arch/x86/tools/relocs_common.o WRAP arch/x86/include/generated/asm/early_ioremap.h WRAP arch/x86/include/generated/asm/export.h HOSTCC scripts/kallsyms WRAP arch/x86/include/generated/asm/mcs_spinlock.h HOSTCC scripts/sorttable WRAP arch/x86/include/generated/asm/irq_regs.h WRAP arch/x86/include/generated/asm/kmap_size.h WRAP arch/x86/include/generated/asm/local64.h WRAP arch/x86/include/generated/asm/mmiowb.h WRAP arch/x86/include/generated/asm/module.lds.h WRAP arch/x86/include/generated/asm/rwonce.h WRAP arch/x86/include/generated/asm/unaligned.h HOSTCC scripts/asn1_compiler HOSTCC scripts/selinux/genheaders/genheaders DESCEND objtool UPD include/config/kernel.release UPD include/generated/utsrelease.h HOSTCC scripts/selinux/mdp/mdp HOSTCC /linux/tools/objtool/fixdep.o HOSTLD /linux/tools/objtool/fixdep-in.o LINK /linux/tools/objtool/fixdep INSTALL /linux/tools/objtool/libsubcmd/include/subcmd/exec-cmd.h INSTALL /linux/tools/objtool/libsubcmd/include/subcmd/help.h CC /linux/tools/objtool/libsubcmd/exec-cmd.o INSTALL /linux/tools/objtool/libsubcmd/include/subcmd/pager.h CC /linux/tools/objtool/libsubcmd/help.o INSTALL /linux/tools/objtool/libsubcmd/include/subcmd/parse-options.h CC /linux/tools/objtool/libsubcmd/pager.o CC /linux/tools/objtool/libsubcmd/parse-options.o CC /linux/tools/objtool/libsubcmd/run-command.o INSTALL /linux/tools/objtool/libsubcmd/include/subcmd/run-command.h CC /linux/tools/objtool/libsubcmd/sigchain.o CC /linux/tools/objtool/libsubcmd/subcmd-config.o INSTALL libsubcmd_headers HOSTLD arch/x86/tools/relocs CC scripts/mod/empty.o HOSTCC scripts/mod/mk_elfconfig CC scripts/mod/devicetable-offsets.s UPD scripts/mod/devicetable-offsets.h MKELF scripts/mod/elfconfig.h HOSTCC scripts/mod/modpost.o HOSTCC scripts/mod/file2alias.o HOSTCC scripts/mod/sumversion.o LD /linux/tools/objtool/libsubcmd/libsubcmd-in.o AR /linux/tools/objtool/libsubcmd/libsubcmd.a CC /linux/tools/objtool/weak.o CC /linux/tools/objtool/check.o CC /linux/tools/objtool/special.o CC /linux/tools/objtool/builtin-check.o CC /linux/tools/objtool/elf.o CC /linux/tools/objtool/objtool.o CC /linux/tools/objtool/arch/x86/special.o CC /linux/tools/objtool/orc_gen.o MKDIR /linux/tools/objtool/arch/x86/lib/ GEN /linux/tools/objtool/arch/x86/lib/inat-tables.c CC /linux/tools/objtool/orc_dump.o CC /linux/tools/objtool/arch/x86/decode.o CC /linux/tools/objtool/libstring.o CC /linux/tools/objtool/libctype.o CC /linux/tools/objtool/str_error_r.o CC /linux/tools/objtool/librbtree.o HOSTLD scripts/mod/modpost CC kernel/bounds.s CHKSHA1 include/linux/atomic/atomic-arch-fallback.h CHKSHA1 include/linux/atomic/atomic-instrumented.h CHKSHA1 include/linux/atomic/atomic-long.h UPD include/generated/timeconst.h LD /linux/tools/objtool/arch/x86/objtool-in.o UPD include/generated/bounds.h CC arch/x86/kernel/asm-offsets.s UPD include/generated/asm-offsets.h CALL scripts/checksyscalls.sh LD /linux/tools/objtool/objtool-in.o LINK /linux/tools/objtool/objtool LDS scripts/module.lds + make -j 9 -C /build KSRC=/linux KBUILD_MODPOST_WARN=1 make: Entering directory '/build' make -C drivers/dahdi/firmware firmware-loaders make[1]: Entering directory '/build/drivers/dahdi/firmware' Attempting to download dahdi-fwload-vpmadt032-1.25.0.tar.gz --2023-07-15 02:20:09-- http://downloads.digium.com/pub/telephony/firmware/releases/dahdi-fwload-vpm... Resolving downloads.digium.com (downloads.digium.com)... 165.22.184.19, 2604:a880:400:d0::14:9001 Connecting to downloads.digium.com (downloads.digium.com)|165.22.184.19|:80... connected. HTTP request sent, awaiting response... 200 OK Length: 149360 (146K) [application/octet-stream] Saving to: 'dahdi-fwload-vpmadt032-1.25.0.tar.gz'
0K .......... .......... .......... .......... .......... 34% 297K 0s 50K .......... .......... .......... .......... .......... 68% 597K 0s 100K .......... .......... .......... .......... ..... 100% 546K=0.3s
2023-07-15 02:20:09 (434 KB/s) - 'dahdi-fwload-vpmadt032-1.25.0.tar.gz' saved [149360/149360]
make[1]: Leaving directory '/build/drivers/dahdi/firmware' make -C /linux KBUILD_EXTMOD=/build/drivers/dahdi DAHDI_INCLUDE=/build/include DAHDI_MODULES_EXTRA=" " HOTPLUG_FIRMWARE=yes modules DAHDI_BUILD_ALL=m make[1]: Entering directory '/linux' CC [M] /build/drivers/dahdi/icE1usb/icE1usb.o CC [M] /build/drivers/dahdi/voicebus/voicebus.o CC [M] /build/drivers/dahdi/wctc4xxp/base.o CC [M] /build/drivers/dahdi/wctdm24xxp/base.o CC [M] /build/drivers/dahdi/oct612x/octdeviceapi/oct6100api/oct6100_api/oct6100_adpcm_chan.o CC [M] /build/drivers/dahdi/wcte12xp/base.o CC [M] /build/drivers/dahdi/wcb4xxp/base.o CC [M] /build/drivers/dahdi/xpp/xbus-core.o CC [M] /build/drivers/dahdi/wct4xxp/base.o CC [M] /build/drivers/dahdi/oct612x/octdeviceapi/oct6100api/oct6100_api/oct6100_channel.o /build/drivers/dahdi/xpp/xbus-core.c: In function 'xbus_check_unique': /build/drivers/dahdi/xpp/xbus-core.c:116:13: error: the comparison will always evaluate as 'true' for the address of 'label' will never be NULL [-Werror=address] 116 | if (xbus->label && *(xbus->label)) { | ^~~~ In file included from /build/drivers/dahdi/xpp/xbus-core.c:39: /build/drivers/dahdi/xpp/xbus-core.h:187:14: note: 'label' declared here 187 | char label[LABEL_SIZE]; | ^~~~~ CC [M] /build/drivers/dahdi/voicebus/GpakCust.o CC [M] /build/drivers/dahdi/voicebus/GpakApi.o cc1: all warnings being treated as errors make[3]: *** [scripts/Makefile.build:252: /build/drivers/dahdi/xpp/xbus-core.o] Error 1 make[2]: *** [scripts/Makefile.build:494: /build/drivers/dahdi/xpp] Error 2 make[2]: *** Waiting for unfinished jobs.... CC [M] /build/drivers/dahdi/voicebus/voicebus_net.o LD [M] /build/drivers/dahdi/wcb4xxp/wcb4xxp.o CC [M] /build/drivers/dahdi/voicebus/vpmoct.o CC [M] /build/drivers/dahdi/wctdm24xxp/xhfc.o CC [M] /build/drivers/dahdi/oct612x/octdeviceapi/oct6100api/oct6100_api/oct6100_chip_open.o LD [M] /build/drivers/dahdi/wctc4xxp/wctc4xxp.o CC [M] /build/drivers/dahdi/wct4xxp/vpm450m.o CC [M] /build/drivers/dahdi/oct612x/octdeviceapi/oct6100api/oct6100_api/oct6100_chip_stats.o CC [M] /build/drivers/dahdi/oct612x/octdeviceapi/oct6100api/oct6100_api/oct6100_conf_bridge.o LD [M] /build/drivers/dahdi/wcte12xp/wcte12xp.o CC [M] /build/drivers/dahdi/oct612x/octdeviceapi/oct6100api/oct6100_api/oct6100_debug.o CC [M] /build/drivers/dahdi/oct612x/octdeviceapi/oct6100api/oct6100_api/oct6100_events.o CC [M] /build/drivers/dahdi/oct612x/octdeviceapi/oct6100api/oct6100_api/oct6100_interrupts.o CC [M] /build/drivers/dahdi/oct612x/octdeviceapi/oct6100api/oct6100_api/oct6100_memory.o CC [M] /build/drivers/dahdi/oct612x/octdeviceapi/oct6100api/oct6100_api/oct6100_miscellaneous.o CC [M] /build/drivers/dahdi/oct612x/octdeviceapi/oct6100api/oct6100_api/oct6100_mixer.o CC [M] /build/drivers/dahdi/oct612x/octdeviceapi/oct6100api/oct6100_api/oct6100_phasing_tsst.o CC [M] /build/drivers/dahdi/oct612x/octdeviceapi/oct6100api/oct6100_api/oct6100_playout_buf.o CC [M] /build/drivers/dahdi/oct612x/octdeviceapi/oct6100api/oct6100_api/oct6100_remote_debug.o CC [M] /build/drivers/dahdi/oct612x/octdeviceapi/oct6100api/oct6100_api/oct6100_tlv.o CC [M] /build/drivers/dahdi/oct612x/octdeviceapi/oct6100api/oct6100_api/oct6100_tone_detection.o CC [M] /build/drivers/dahdi/oct612x/octdeviceapi/oct6100api/oct6100_api/oct6100_tsi_cnct.o CC [M] /build/drivers/dahdi/oct612x/octdeviceapi/oct6100api/oct6100_api/oct6100_tsst.o CC [M] /build/drivers/dahdi/oct612x/apilib/bt/octapi_bt0.o CC [M] /build/drivers/dahdi/oct612x/apilib/largmath/octapi_largmath.o LD [M] /build/drivers/dahdi/voicebus/dahdi_voicebus.o CC [M] /build/drivers/dahdi/oct612x/apilib/llman/octapi_llman.o CC [M] /build/drivers/dahdi/oct612x/oct612x-user.o LD [M] /build/drivers/dahdi/wct4xxp/wct4xxp.o LD [M] /build/drivers/dahdi/wctdm24xxp/wctdm24xxp.o LD [M] /build/drivers/dahdi/oct612x/oct612x.o make[1]: Leaving directory '/linux' make[1]: *** [Makefile:2026: /build/drivers/dahdi] Error 2 make: *** [Makefile:74: modules] Error 2 make: Leaving directory '/build' Build step 'Execute shell' marked build as failure Not sending mail to unregistered user torvalds@linux-foundation.org