See https://jenkins.osmocom.org/jenkins/job/Osmocom-build-tags-against-master/2040/display/redirect
Changes:
------------------------------------------ Started by user Oliver Smith Running as SYSTEM Building remotely on build4-deb12build-ansible (ttcn3 obs ttcn3_with_linux_6.1_or_higher qemu io_uring osmocom-gerrit coverity osmocom-master) in workspace https://jenkins.osmocom.org/jenkins/job/Osmocom-build-tags-against-master/ws/ The recommended git tool is: NONE No credentials specified Wiping out workspace first. Cloning the remote Git repository Cloning repository https://gerrit.osmocom.org/osmo-ci
git init https://jenkins.osmocom.org/jenkins/job/Osmocom-build-tags-against-master/ws/ # timeout=10
Fetching upstream changes from https://gerrit.osmocom.org/osmo-ci
git --version # timeout=10 git --version # 'git version 2.39.2' git fetch --tags --force --progress -- https://gerrit.osmocom.org/osmo-ci +refs/heads/*:refs/remotes/origin/* # timeout=10 git config remote.origin.url https://gerrit.osmocom.org/osmo-ci # timeout=10 git config --add remote.origin.fetch +refs/heads/*:refs/remotes/origin/* # timeout=10
Avoid second fetch Seen branch in repository origin/fixeria/fixes Seen branch in repository origin/laforge/dahdi-wip Seen branch in repository origin/lynxis/staging Seen branch in repository origin/master Seen branch in repository origin/neels/obs Seen branch in repository origin/neels/test Seen branch in repository origin/neels/wip Seen branch in repository origin/osmith/centos-install-test Seen branch in repository origin/osmith/dependency-check Seen branch in repository origin/osmith/fix-python3 Seen branch in repository origin/osmith/gerrit-lint Seen branch in repository origin/osmith/gerrit-mail-on-success Seen branch in repository origin/osmith/ggsn-kernel-mod-test Seen branch in repository origin/osmith/obs-2021q1 Seen branch in repository origin/osmith/obs-check-builders Seen branch in repository origin/osmith/obs-fixes Seen branch in repository origin/osmith/obs-latest-fix Seen branch in repository origin/osmith/obs-mirror Seen branch in repository origin/osmith/obs-nftables Seen branch in repository origin/osmith/offline-nodes Seen branch in repository origin/osmith/rpm Seen branch in repository origin/osmith/ttcn3-centos Seen branch in repository origin/osmith/ttcn3-latest Seen branch in repository origin/osmith/wip Seen branch in repository origin/osmith/wip-asan Seen branch in repository origin/osmith/wip-ci-packaging Seen branch in repository origin/osmith/wip-docuum Seen branch in repository origin/osmith/wip-manuals Seen branch in repository origin/osmith/wip-obs Seen branch in repository origin/osmith/wip-obs-asan Seen branch in repository origin/osmith/wip-os-6165 Seen branch in repository origin/osmith/wip-repo-install-qemu Seen branch in repository origin/osmith/wip-testenv Seen branch in repository origin/pespin/limesuite-latest Seen branch in repository origin/pespin/open5gs Seen 35 remote branches
git show-ref --tags -d # timeout=10
Checking out Revision 0b8f91d008d695a3f9fe397b9046de00154e26f0 (origin/master)
git config core.sparsecheckout # timeout=10 git checkout -f 0b8f91d008d695a3f9fe397b9046de00154e26f0 # timeout=10
Commit message: "scripts/build-old-tags: build libosmo-sccp-legacy"
git rev-list --no-walk 0b8f91d008d695a3f9fe397b9046de00154e26f0 # timeout=10
[Osmocom-build-tags-against-master] $ /bin/sh -xe /tmp/jenkins3239927207400078775.sh + docker run --rm=true -e PARALLEL_MAKE=-j8 -u build -v https://jenkins.osmocom.org/jenkins/job/Osmocom-build-tags-against-master/ws/:/build -w /build osmocom-build/debian-bookworm-build scripts/osmocom-build-old-tags-against-master.sh Temp dir: /build/_temp Building libraries from current master... * libosmocore 6e1ebd9a27b1cff04280a1d35410c15e76628162 * libosmo-abis 4bd83dfd71afaf81e826febf79e63dd06abe73a3 * libosmo-netif 89a11fd644dcf9e5741196e4923ec3020c19afd0 * libosmo-sccp fc4caf10de673536d34b5a74e23e916cde1796d3 * libosmo-sccp-legacy e29fdd81afedd2e8597ddbca0c0379264f4cf7a7 * libsmpp34 f1ec51db83de0d20b5ad0f88756016f289d5d268 * libasn1c de520a417a95f47ec13b895b7c129d2969b791d7 * osmo-ggsn 8c015bd89aea69b463bc8e0baba5020a2cc3c832 * osmo-iuh bb71c57a9ca42f74ef8d6a4fe56bef962352671c * osmo-hlr 7c06eea5b2a5c35898f43de50888c890816c9aa3 * osmo-mgw 227a800d2658c5381a098666f6e0203a3eff7057 Building legacy libraries... * osmo-mgw 1.4.0 (provides libosmo-legacy-mgcp) Building old tags against libraries from current master... (ERR: new error, err: known error) * libosmo-abis 1.5.1 1.5.2 1.6.0 * libosmocore 1.9.2 1.9.3 1.10.0 * libosmo-netif 1.4.0 1.5.0 1.5.1 * libosmo-sccp 1.8.1 1.8.2 1.9.0 * osmo-bsc 1.11.1 1.12.0 1.12.1 * osmo-bts 1.7.1 1.7.2 1.8.0 * osmo-ggsn 1.10.2 1.11.0 1.12.0 * osmo-hlr 1.6.2 1.7.0 1.8.0 * osmo-iuh 1.5.0 1.5.1 1.6.0 * osmo-mgw 1.12.1 1.12.2 1.13.0 * osmo-msc 1.11.0 (ERR) 1.11.1 (ERR) 1.12.0 (ERR) * osmo-pcu 1.3.1 1.4.0 1.5.0 * osmo-sgsn 1.11.0 1.11.1 1.12.0 * osmo-sip-connector 1.6.2 1.6.3 1.7.0 * osmo-trx 1.6.1 1.6.2 1.7.0 --- BUILD FAILED: osmo-msc-1.11.0.txt Showing last lines of build log below (full log in temp dir/jenkins artifacts): --- CC vlr_auth_fsm.o CC vlr_access_req_fsm.o CC vlr_lu_fsm.o CC vlr_sgs.o CC vlr_sgs_fsm.o In file included from ../../include/osmocom/msc/gsm_data.h:22, from ../../include/osmocom/msc/gsm_subscriber.h:10, from vlr.c:33: ../../include/osmocom/msc/neighbor_ident.h:9:10: fatal error: osmocom/sigtran/sccp_sap.h: No such file or directory 9 | #include <osmocom/sigtran/sccp_sap.h> | ^~~~~~~~~~~~~~~~~~~~~~~~~~~~ compilation terminated. make[3]: *** [Makefile:451: vlr.o] Error 1 make[3]: *** Waiting for unfinished jobs.... make[3]: Leaving directory '/build/_deps/osmo-msc/src/libvlr' make[2]: *** [Makefile:424: check-recursive] Error 1 make[2]: Leaving directory '/build/_deps/osmo-msc/src' make[1]: *** [Makefile:473: check-recursive] Error 1 make[1]: Leaving directory '/build/_deps/osmo-msc' make: *** [Makefile:772: check] Error 2 --- BUILD FAILED: osmo-msc-1.11.1.txt Showing last lines of build log below (full log in temp dir/jenkins artifacts): --- CC vlr_access_req_fsm.o CC vlr_auth_fsm.o CC vlr_lu_fsm.o CC vlr_sgs.o CC vlr_sgs_fsm.o In file included from ../../include/osmocom/msc/gsm_data.h:22, from ../../include/osmocom/msc/gsm_subscriber.h:10, from vlr.c:33: ../../include/osmocom/msc/neighbor_ident.h:9:10: fatal error: osmocom/sigtran/sccp_sap.h: No such file or directory 9 | #include <osmocom/sigtran/sccp_sap.h> | ^~~~~~~~~~~~~~~~~~~~~~~~~~~~ compilation terminated. make[3]: *** [Makefile:451: vlr.o] Error 1 make[3]: *** Waiting for unfinished jobs.... make[3]: Leaving directory '/build/_deps/osmo-msc/src/libvlr' make[2]: *** [Makefile:424: check-recursive] Error 1 make[2]: Leaving directory '/build/_deps/osmo-msc/src' make[1]: *** [Makefile:473: check-recursive] Error 1 make[1]: Leaving directory '/build/_deps/osmo-msc' make: *** [Makefile:772: check] Error 2 --- BUILD FAILED: osmo-msc-1.12.0.txt Showing last lines of build log below (full log in temp dir/jenkins artifacts): --- CC vlr_access_req_fsm.o CC vlr_auth_fsm.o CC vlr_lu_fsm.o CC vlr_sgs.o CC vlr_sgs_fsm.o In file included from ../../include/osmocom/msc/gsm_data.h:22, from ../../include/osmocom/msc/gsm_subscriber.h:10, from vlr.c:33: ../../include/osmocom/msc/neighbor_ident.h:9:10: fatal error: osmocom/sigtran/sccp_sap.h: No such file or directory 9 | #include <osmocom/sigtran/sccp_sap.h> | ^~~~~~~~~~~~~~~~~~~~~~~~~~~~ compilation terminated. make[3]: *** [Makefile:451: vlr.o] Error 1 make[3]: *** Waiting for unfinished jobs.... make[3]: Leaving directory '/build/_deps/osmo-msc/src/libvlr' make[2]: *** [Makefile:424: check-recursive] Error 1 make[2]: Leaving directory '/build/_deps/osmo-msc/src' make[1]: *** [Makefile:473: check-recursive] Error 1 make[1]: Leaving directory '/build/_deps/osmo-msc' make: *** [Makefile:772: check] Error 2 --- Build step 'Execute shell' marked build as failure Archiving artifacts