See https://jenkins.osmocom.org/jenkins/job/TTCN3-centos-bsc-test/1259/display/redirect
Changes:
------------------------------------------ [...truncated 115.18 KB...] #11 6.542 checking whether gcc understands -c and -o together... yes #11 6.581 checking whether make supports the include directive... yes (GNU style) #11 6.592 checking dependency style of gcc... gcc3 #11 6.633 checking build system type... x86_64-pc-linux-gnu #11 6.684 checking host system type... x86_64-pc-linux-gnu #11 6.685 checking how to print strings... printf #11 6.687 checking for a sed that does not truncate output... /usr/bin/sed #11 6.693 checking for grep that handles long lines and -e... /usr/bin/grep #11 6.695 checking for egrep... /usr/bin/grep -E #11 6.696 checking for fgrep... /usr/bin/grep -F #11 6.697 checking for ld used by gcc... /usr/bin/ld #11 6.701 checking if the linker (/usr/bin/ld) is GNU ld... yes #11 6.703 checking for BSD- or MS-compatible name lister (nm)... /usr/bin/nm -B #11 6.706 checking the name lister (/usr/bin/nm -B) interface... BSD nm #11 6.722 checking whether ln -s works... yes #11 6.722 checking the maximum length of command line arguments... 1572864 #11 6.729 checking how to convert x86_64-pc-linux-gnu file names to x86_64-pc-linux-gnu format... func_convert_file_noop #11 6.730 checking how to convert x86_64-pc-linux-gnu file names to toolchain format... func_convert_file_noop #11 6.730 checking for /usr/bin/ld option to reload object files... -r #11 6.730 checking for objdump... objdump #11 6.730 checking how to recognize dependent libraries... pass_all #11 6.732 checking for dlltool... no #11 6.732 checking how to associate runtime and link libraries... printf %s\n #11 6.732 checking for ar... ar #11 6.733 checking for archiver @FILE support... @ #11 6.757 checking for strip... strip #11 6.758 checking for ranlib... ranlib #11 6.758 checking command to parse /usr/bin/nm -B output from gcc object... ok #11 6.814 checking for sysroot... no #11 6.814 checking for a working dd... ./configure: line 6570: cmp: command not found #11 6.819 ./configure: line 6570: cmp: command not found #11 6.821 #11 6.821 checking how to truncate binary pipes... /usr/bin/sed -e 4q #11 6.837 ./configure: line 6747: /usr/bin/file: No such file or directory #11 6.838 checking for mt... no #11 6.838 checking if : is a manifest tool... no #11 6.843 checking how to run the C preprocessor... gcc -E #11 6.889 checking for ANSI C header files... yes #11 6.981 checking for sys/types.h... yes #11 7.004 checking for sys/stat.h... yes #11 7.032 checking for stdlib.h... yes #11 7.062 checking for string.h... yes #11 7.089 checking for memory.h... yes #11 7.114 checking for strings.h... yes #11 7.139 checking for inttypes.h... yes #11 7.167 checking for stdint.h... yes #11 7.196 checking for unistd.h... yes #11 7.227 checking for dlfcn.h... yes #11 7.252 checking for objdir... .libs #11 7.311 checking if gcc supports -fno-rtti -fno-exceptions... ./configure: line 8499: diff: command not found #11 7.330 no #11 7.330 checking for gcc option to produce PIC... -fPIC -DPIC #11 7.330 checking if gcc PIC flag -fPIC -DPIC works... yes #11 7.351 checking if gcc static flag -static works... no #11 7.370 checking if gcc supports -c -o file.o... yes #11 7.397 checking if gcc supports -c -o file.o... (cached) yes #11 7.397 checking whether the gcc linker (/usr/bin/ld) supports shared libraries... yes #11 7.407 checking whether -lc should be explicitly linked in... no #11 7.433 checking dynamic linker characteristics... GNU/Linux ld.so #11 7.486 checking how to hardcode library paths into programs... immediate #11 7.486 checking whether stripping libraries is possible... yes #11 7.487 checking if libtool supports shared libraries... yes #11 7.487 checking whether to build shared libraries... yes #11 7.487 checking whether to build static libraries... yes #11 7.488 checking for pkg-config... /usr/bin/pkg-config #11 7.489 checking for pkg-config... /usr/bin/pkg-config #11 7.489 checking pkg-config is at least version 0.20... yes #11 7.490 checking for ANSI C header files... (cached) yes #11 7.491 checking for LIBOSMOCORE... yes #11 7.498 checking for LIBOSMOVTY... yes #11 7.505 checking for LIBOSMOGSM... yes #11 7.511 checking for LIBOSMOCTRL... yes #11 7.518 checking for LIBOSMOCODEC... yes #11 7.524 checking for LIBOSMOCODING... yes #11 7.532 checking for LIBOSMOABIS... yes #11 7.538 checking for LIBOSMOTRAU... yes #11 7.544 checking for LIBOSMONETIF... yes #11 7.549 checking whether to enable support for sysmobts calibration tool... no #11 7.549 checking whether to enable support for sysmoBTS L1/PHY support... no #11 7.550 checking whether to enable support for osmo-trx based L1/PHY support... yes #11 7.550 checking whether to enable support for Octasic OCTPHY-2G... no #11 7.551 checking whether to enable NuRAN Wireless Litecell 1.5 hardware support... no #11 7.551 checking whether to enable NuRAN Wireless OC-2G hardware support... no #11 7.552 checking whether to enable VTY/CTRL tests... no #11 7.552 checking whether to include systemtap tracing support... no #11 7.554 CFLAGS=" -std=gnu11" #11 7.554 CPPFLAGS="" #11 7.582 checking that generated files are newer than configure... done #11 7.583 configure: creating ./config.status #11 8.000 config.status: creating src/Makefile #11 8.015 config.status: creating src/common/Makefile #11 8.033 config.status: creating src/osmo-bts-virtual/Makefile #11 8.049 config.status: creating src/osmo-bts-omldummy/Makefile #11 8.066 config.status: creating src/osmo-bts-sysmo/Makefile #11 8.084 config.status: creating src/osmo-bts-lc15/Makefile #11 8.099 config.status: creating src/osmo-bts-oc2g/Makefile #11 8.115 config.status: creating src/osmo-bts-trx/Makefile #11 8.132 config.status: creating src/osmo-bts-octphy/Makefile #11 8.149 config.status: creating include/Makefile #11 8.167 config.status: creating include/osmo-bts/Makefile #11 8.183 config.status: creating tests/Makefile #11 8.199 config.status: creating tests/paging/Makefile #11 8.214 config.status: creating tests/agch/Makefile #11 8.231 config.status: creating tests/cipher/Makefile #11 8.247 config.status: creating tests/sysmobts/Makefile #11 8.263 config.status: creating tests/misc/Makefile #11 8.279 config.status: creating tests/handover/Makefile #11 8.295 config.status: creating tests/ta_control/Makefile #11 8.311 config.status: creating tests/tx_power/Makefile #11 8.327 config.status: creating tests/power/Makefile #11 8.342 config.status: creating tests/meas/Makefile #11 8.358 config.status: creating tests/amr/Makefile #11 8.375 config.status: creating tests/csd/Makefile #11 8.390 config.status: creating doc/Makefile #11 8.407 config.status: creating doc/examples/Makefile #11 8.422 config.status: creating doc/manuals/Makefile #11 8.436 config.status: creating contrib/Makefile #11 8.452 config.status: creating contrib/ber/Makefile #11 8.469 config.status: creating contrib/systemd/Makefile #11 8.486 config.status: creating contrib/osmo-bts.spec #11 8.502 config.status: creating Makefile #11 8.513 config.status: creating btsconfig.h #11 8.526 config.status: executing tests/atconfig commands #11 8.529 config.status: executing depfiles commands #11 9.106 config.status: executing libtool commands #11 9.149 echo 1.7.0.32-791d > .version-t && mv .version-t .version #11 9.151 make install-recursive #11 9.152 make[1]: Entering directory '/tmp/osmo-bts' #11 9.155 Making install in include #11 9.156 make[2]: Entering directory '/tmp/osmo-bts/include' #11 9.159 Making install in osmo-bts #11 9.161 make[3]: Entering directory '/tmp/osmo-bts/include/osmo-bts' #11 9.162 make[4]: Entering directory '/tmp/osmo-bts/include/osmo-bts' #11 9.162 make[4]: Nothing to be done for 'install-exec-am'. #11 9.162 make[4]: Nothing to be done for 'install-data-am'. #11 9.162 make[4]: Leaving directory '/tmp/osmo-bts/include/osmo-bts' #11 9.162 make[3]: Leaving directory '/tmp/osmo-bts/include/osmo-bts' #11 9.164 make[3]: Entering directory '/tmp/osmo-bts/include' #11 9.165 make[4]: Entering directory '/tmp/osmo-bts/include' #11 9.165 make[4]: Nothing to be done for 'install-exec-am'. #11 9.165 make[4]: Nothing to be done for 'install-data-am'. #11 9.165 make[4]: Leaving directory '/tmp/osmo-bts/include' #11 9.165 make[3]: Leaving directory '/tmp/osmo-bts/include' #11 9.165 make[2]: Leaving directory '/tmp/osmo-bts/include' #11 9.166 Making install in src #11 9.167 make[2]: Entering directory '/tmp/osmo-bts/src' #11 9.170 Making install in common #11 9.172 make[3]: Entering directory '/tmp/osmo-bts/src/common' #11 9.172 make install-am #11 9.175 make[4]: Entering directory '/tmp/osmo-bts/src/common' #11 9.176 CC gsm_data.o #11 9.177 CC logging.o #11 9.177 CC sysinfo.o #11 9.177 CC oml.o #11 9.177 CC abis.o #11 9.178 CC abis_osmo.o #11 9.178 CC osmux.o #11 9.178 CC bts_sm.o #11 9.178 CC bts.o #11 9.179 CC rsl.o #11 9.179 CC bts_trx.o #11 9.180 CC rtp_input_preen.o #11 9.180 CC paging.o #11 9.180 CC vty.o #11 9.180 CC measurement.o #11 9.181 CC amr.o #11 9.253 CC asci.o #11 9.253 CC load_indication.o #11 9.253 CC lchan.o #11 9.259 CC pcu_sock.o #11 9.260 CC handover.o #11 9.261 CC msg_utils.o #11 9.261 CC tx_power.o #11 9.265 CC bts_ctrl_commands.o #11 9.287 CC bts_ctrl_lookup.o #11 9.288 CC bts_shutdown_fsm.o #11 9.294 CC csd_v110.o #11 9.294 CC l1sap.o #11 9.301 CC cbch.o #11 9.317 CC power_control.o #11 9.332 CC main.o #11 9.339 CC phy_link.o #11 9.345 CC dtx_dl_amr_fsm.o #11 9.345 CC scheduler_mframe.o #11 9.352 CC ta_control.o #11 9.354 CC nm_common_fsm.o #11 9.355 CC nm_bts_sm_fsm.o #11 9.357 CC nm_bts_fsm.o #11 9.372 CC nm_bb_transc_fsm.o #11 9.376 l1sap.c: In function 'l1sap_uplink_access': #11 9.376 l1sap.c:2465:33: error: 'PRIM_INFO_ACT_UL_ACC' undeclared (first use in this function); did you mean 'PRIM_INFO_ACT_CIPH'? #11 9.376 l1sap.u.info.type = (active) ? PRIM_INFO_ACT_UL_ACC : PRIM_INFO_DEACT_UL_ACC; #11 9.376 ^~~~~~~~~~~~~~~~~~~~ #11 9.376 PRIM_INFO_ACT_CIPH #11 9.376 l1sap.c:2465:33: note: each undeclared identifier is reported only once for each function it appears in #11 9.381 l1sap.c:2465:56: error: 'PRIM_INFO_DEACT_UL_ACC' undeclared (first use in this function); did you mean 'PRIM_INFO_DEACT_CIPH'? #11 9.381 l1sap.u.info.type = (active) ? PRIM_INFO_ACT_UL_ACC : PRIM_INFO_DEACT_UL_ACC; #11 9.381 ^~~~~~~~~~~~~~~~~~~~~~ #11 9.381 PRIM_INFO_DEACT_CIPH #11 9.382 l1sap.c:2466:17: error: 'union <anonymous>' has no member named 'ulacc_req'; did you mean 'act_req'? #11 9.382 l1sap.u.info.u.ulacc_req.chan_nr = chan_nr; #11 9.382 ^~~~~~~~~ #11 9.382 act_req #11 9.385 CC nm_channel_fsm.o #11 9.387 CC nm_gprs_cell_fsm.o #11 9.398 make[4]: *** [Makefile:552: l1sap.o] Error 1 #11 9.398 make[4]: *** Waiting for unfinished jobs.... #11 9.398 CC nm_gprs_nse_fsm.o #11 9.501 make[4]: Leaving directory '/tmp/osmo-bts/src/common' #11 9.502 make[3]: *** [Makefile:669: install] Error 2 #11 9.502 make[3]: Leaving directory '/tmp/osmo-bts/src/common' #11 9.502 make[2]: *** [Makefile:390: install-recursive] Error 1 #11 9.502 make[2]: Leaving directory '/tmp/osmo-bts/src' #11 9.503 make[1]: *** [Makefile:443: install-recursive] Error 1 #11 9.503 make[1]: Leaving directory '/tmp/osmo-bts' #11 9.503 make: *** [Makefile:742: install] Error 2 #11 ERROR: process "/bin/sh -c cd osmo-bts && \tgit fetch && git checkout $OSMO_BTS_BRANCH && \t(git symbolic-ref -q HEAD && git reset --hard origin/$OSMO_BTS_BRANCH || exit 1); \tgit rev-parse --abbrev-ref HEAD && git rev-parse HEAD && \tautoreconf -fi && \t./configure --enable-trx && \tmake "-j$(nproc)" install" did not complete successfully: exit code: 2 ------
[6/8] RUN CD osmo-bts && git fetch && git checkout master && (git symbolic-ref -q HEAD && git reset --hard origin/master || exit 1); git rev-parse --abbrev-ref HEAD && git rev-parse HEAD && autoreconf -fi && ./configure --enable-trx && make "-j$(nproc)" install:
9.398 make[4]: *** Waiting for unfinished jobs.... 9.398 CC nm_gprs_nse_fsm.o 9.501 make[4]: Leaving directory '/tmp/osmo-bts/src/common' 9.502 make[3]: *** [Makefile:669: install] Error 2 9.502 make[3]: Leaving directory '/tmp/osmo-bts/src/common' 9.502 make[2]: *** [Makefile:390: install-recursive] Error 1 9.502 make[2]: Leaving directory '/tmp/osmo-bts/src' 9.503 make[1]: *** [Makefile:443: install-recursive] Error 1 9.503 make[1]: Leaving directory '/tmp/osmo-bts' 9.503 make: *** [Makefile:742: install] Error 2 ------ Dockerfile:41 -------------------- 40 | 41 | >>> RUN cd osmo-bts && \ 42 | >>> git fetch && git checkout $OSMO_BTS_BRANCH && \ 43 | >>> (git symbolic-ref -q HEAD && git reset --hard origin/$OSMO_BTS_BRANCH || exit 1); \ 44 | >>> git rev-parse --abbrev-ref HEAD && git rev-parse HEAD && \ 45 | >>> autoreconf -fi && \ 46 | >>> ./configure --enable-trx && \ 47 | >>> make "-j$(nproc)" install 48 | -------------------- ERROR: failed to solve: process "/bin/sh -c cd osmo-bts && \tgit fetch && git checkout $OSMO_BTS_BRANCH && \t(git symbolic-ref -q HEAD && git reset --hard origin/$OSMO_BTS_BRANCH || exit 1); \tgit rev-parse --abbrev-ref HEAD && git rev-parse HEAD && \tautoreconf -fi && \t./configure --enable-trx && \tmake "-j$(nproc)" install" did not complete successfully: exit code: 2 make: *** [../make/Makefile:92: docker-build] Error 1 make: Leaving directory 'https://jenkins.osmocom.org/jenkins/job/TTCN3-centos-bsc-test/ws/osmo-bts-master' + exit 1 Build step 'Execute shell' marked build as failure Recording test results ERROR: Step ‘Publish JUnit test result report’ failed: No test report files were found. Configuration error?