Changes:
------------------------------------------ [...truncated 808.32 KB...] <param name='[stats]' doc='(null)' />
Documentation error (missing docs): <command id='show ns entities [stats]'> <param name='[stats]' doc='(null)' />
ss -tn
State Recv-Q Send-Q Local Address:Port Peer Address:Port
ss -tln
State Recv-Q Send-Q Local Address:Port Peer Address:Port
ps xua | grep osmo
build 3044 2.0 0.0 53996 21024 ? S 17:46 0:00 /usr/bin/python3 /usr/local/bin/osmotestconfig.py -p /build -w /build -v build 3089 0.0 0.0 21474964008 15312 ? S 17:46 0:00 src/gbproxy/osmo-gbproxy -c /build/writtenconfig/osmo-gbproxy-legacy.cfgkkll369h build 3096 0.0 0.0 4280 744 ? S 17:46 0:00 /bin/sh -c ps xua | grep osmo build 3098 0.0 0.0 12784 956 ? S 17:46 0:00 grep osmo
Socket: in 1 tries, connected to 127.0.0.1:4246 <socket.socket fd=4, family=AddressFamily.AF_INET, type=SocketKind.SOCK_STREAM, proto=0, laddr=('127.0.0.1', 56404), raddr=('127.0.0.1', 4246)> (1 sockets open) Terminating took 0.897s Socket: closing 127.0.0.1:4246 <socket.socket fd=4, family=AddressFamily.AF_INET, type=SocketKind.SOCK_STREAM, proto=0, laddr=('127.0.0.1', 56404), raddr=('127.0.0.1', 4246)> (0 sockets open) Verifying src/gbproxy/osmo-gbproxy -c /build/writtenconfig/osmo-gbproxy-legacy.cfgkkll369h, test token_vty_command Launching: PWD=/build 'src/gbproxy/osmo-gbproxy' '-c' '/build/writtenconfig/osmo-gbproxy-legacy.cfgkkll369h'
ls -l /proc/3044/fd
total 0 lr-x------ 1 build build 64 Dec 1 17:46 0 -> pipe:[1803186002] l-wx------ 1 build build 64 Dec 1 17:46 1 -> pipe:[1803186003] l-wx------ 1 build build 64 Dec 1 17:46 2 -> pipe:[1803186004] l-wx------ 1 build build 64 Dec 1 17:46 3 -> /dev/null
ss -tn
State Recv-Q Send-Q Local Address:Port Peer Address:Port
ss -tln
State Recv-Q Send-Q Local Address:Port Peer Address:Port
ps xua | grep osmo
build 3044 1.8 0.0 53996 21024 ? S 17:46 0:00 /usr/bin/python3 /usr/local/bin/osmotestconfig.py -p /build -w /build -v build 3100 0.0 0.0 21474964008 15128 ? S 17:46 0:00 src/gbproxy/osmo-gbproxy -c /build/writtenconfig/osmo-gbproxy-legacy.cfgkkll369h build 3107 0.0 0.0 4280 712 ? S 17:46 0:00 /bin/sh -c ps xua | grep osmo build 3109 0.0 0.0 12784 960 ? S 17:46 0:00 grep osmo
Socket: in 1 tries, connected to 127.0.0.1:4246 <socket.socket fd=4, family=AddressFamily.AF_INET, type=SocketKind.SOCK_STREAM, proto=0, laddr=('127.0.0.1', 56452), raddr=('127.0.0.1', 4246)> (1 sockets open) Terminating took 0.897s Socket: closing 127.0.0.1:4246 <socket.socket fd=4, family=AddressFamily.AF_INET, type=SocketKind.SOCK_STREAM, proto=0, laddr=('127.0.0.1', 56452), raddr=('127.0.0.1', 4246)> (0 sockets open) Verifying src/sgsn/osmo-sgsn -c /build/doc/examples/osmo-sgsn/osmo-sgsn.cfg, test verify_doc Launching: PWD=/build 'src/sgsn/osmo-sgsn' '-c' '/build/doc/examples/osmo-sgsn/osmo-sgsn.cfg'
ls -l /proc/3044/fd
total 0 lr-x------ 1 build build 64 Dec 1 17:46 0 -> pipe:[1803186002] l-wx------ 1 build build 64 Dec 1 17:46 1 -> pipe:[1803186003] l-wx------ 1 build build 64 Dec 1 17:46 2 -> pipe:[1803186004] l-wx------ 1 build build 64 Dec 1 17:46 3 -> /dev/null
ss -tn
State Recv-Q Send-Q Local Address:Port Peer Address:Port
ss -tln
State Recv-Q Send-Q Local Address:Port Peer Address:Port
ps xua | grep osmo
build 3044 1.4 0.0 53996 21024 ? S 17:46 0:00 /usr/bin/python3 /usr/local/bin/osmotestconfig.py -p /build -w /build -v build 3111 0.0 0.0 21475053144 20004 ? R 17:46 0:00 src/sgsn/osmo-sgsn -c /build/doc/examples/osmo-sgsn/osmo-sgsn.cfg build 3118 0.0 0.0 4280 760 ? S 17:46 0:00 /bin/sh -c ps xua | grep osmo build 3120 0.0 0.0 12784 940 ? S 17:46 0:00 grep osmo
Socket: in 1 tries, connected to 127.0.0.1:4245 <socket.socket fd=4, family=AddressFamily.AF_INET, type=SocketKind.SOCK_STREAM, proto=0, laddr=('127.0.0.1', 54628), raddr=('127.0.0.1', 4245)> (1 sockets open) Terminating took 0.897s Socket: closing 127.0.0.1:4245 <socket.socket fd=4, family=AddressFamily.AF_INET, type=SocketKind.SOCK_STREAM, proto=0, laddr=('127.0.0.1', 54628), raddr=('127.0.0.1', 4245)> (0 sockets open) Verifying src/sgsn/osmo-sgsn -c /build/writtenconfig/osmo-sgsn.cfg_0463lz9, test write_config Launching: PWD=/build 'src/sgsn/osmo-sgsn' '-c' '/build/writtenconfig/osmo-sgsn.cfg_0463lz9'
ls -l /proc/3044/fd
total 0 lr-x------ 1 build build 64 Dec 1 17:46 0 -> pipe:[1803186002] l-wx------ 1 build build 64 Dec 1 17:46 1 -> pipe:[1803186003] l-wx------ 1 build build 64 Dec 1 17:46 2 -> pipe:[1803186004] l-wx------ 1 build build 64 Dec 1 17:46 3 -> /dev/null
ss -tn
State Recv-Q Send-Q Local Address:Port Peer Address:Port
ss -tln
State Recv-Q Send-Q Local Address:Port Peer Address:Port
ps xua | grep osmo
build 3044 1.4 0.0 54152 21204 ? S 17:46 0:00 /usr/bin/python3 /usr/local/bin/osmotestconfig.py -p /build -w /build -v build 3122 0.0 0.0 21475119324 25020 ? R 17:46 0:00 src/sgsn/osmo-sgsn -c /build/writtenconfig/osmo-sgsn.cfg_0463lz9 build 3129 0.0 0.0 4280 716 ? S 17:46 0:00 /bin/sh -c ps xua | grep osmo build 3131 0.0 0.0 12784 932 ? S 17:46 0:00 grep osmo
Socket: in 1 tries, connected to 127.0.0.1:4245 <socket.socket fd=4, family=AddressFamily.AF_INET, type=SocketKind.SOCK_STREAM, proto=0, laddr=('127.0.0.1', 54648), raddr=('127.0.0.1', 4245)> (1 sockets open) Terminating took 0.897s Socket: closing 127.0.0.1:4245 <socket.socket fd=4, family=AddressFamily.AF_INET, type=SocketKind.SOCK_STREAM, proto=0, laddr=('127.0.0.1', 54648), raddr=('127.0.0.1', 4245)> (0 sockets open) Verifying src/sgsn/osmo-sgsn -c /build/writtenconfig/osmo-sgsn.cfg_0463lz9, test token_vty_command Launching: PWD=/build 'src/sgsn/osmo-sgsn' '-c' '/build/writtenconfig/osmo-sgsn.cfg_0463lz9'
ls -l /proc/3044/fd
total 0 lr-x------ 1 build build 64 Dec 1 17:46 0 -> pipe:[1803186002] l-wx------ 1 build build 64 Dec 1 17:46 1 -> pipe:[1803186003] l-wx------ 1 build build 64 Dec 1 17:46 2 -> pipe:[1803186004] l-wx------ 1 build build 64 Dec 1 17:46 3 -> /dev/null
ss -tn
State Recv-Q Send-Q Local Address:Port Peer Address:Port
ss -tln
State Recv-Q Send-Q Local Address:Port Peer Address:Port
ps xua | grep osmo
build 3044 1.3 0.0 54152 21204 ? S 17:46 0:00 /usr/bin/python3 /usr/local/bin/osmotestconfig.py -p /build -w /build -v build 3133 0.0 0.0 21475119324 23224 ? R 17:46 0:00 src/sgsn/osmo-sgsn -c /build/writtenconfig/osmo-sgsn.cfg_0463lz9 build 3140 0.0 0.0 4280 760 ? S 17:46 0:00 /bin/sh -c ps xua | grep osmo build 3142 0.0 0.0 12784 928 ? S 17:46 0:00 grep osmo
Socket: in 1 tries, connected to 127.0.0.1:4245 <socket.socket fd=4, family=AddressFamily.AF_INET, type=SocketKind.SOCK_STREAM, proto=0, laddr=('127.0.0.1', 54670), raddr=('127.0.0.1', 4245)> (1 sockets open) Terminating took 0.897s Socket: closing 127.0.0.1:4245 <socket.socket fd=4, family=AddressFamily.AF_INET, type=SocketKind.SOCK_STREAM, proto=0, laddr=('127.0.0.1', 54670), raddr=('127.0.0.1', 4245)> (0 sockets open) Verifying src/gtphub/osmo-gtphub -c /build/doc/examples/osmo-gtphub/osmo-gtphub-1iface.cfg, test verify_doc Launching: PWD=/build 'src/gtphub/osmo-gtphub' '-c' '/build/doc/examples/osmo-gtphub/osmo-gtphub-1iface.cfg'
ls -l /proc/3044/fd
total 0 lr-x------ 1 build build 64 Dec 1 17:46 0 -> pipe:[1803186002] l-wx------ 1 build build 64 Dec 1 17:46 1 -> pipe:[1803186003] l-wx------ 1 build build 64 Dec 1 17:46 2 -> pipe:[1803186004] l-wx------ 1 build build 64 Dec 1 17:46 3 -> /dev/null
ss -tn
State Recv-Q Send-Q Local Address:Port Peer Address:Port
ss -tln
State Recv-Q Send-Q Local Address:Port Peer Address:Port
ps xua | grep osmo
build 3044 1.1 0.0 54152 21204 ? S 17:46 0:00 /usr/bin/python3 /usr/local/bin/osmotestconfig.py -p /build -w /build -v build 3144 0.0 0.0 21474965988 14404 ? S 17:46 0:00 src/gtphub/osmo-gtphub -c /build/doc/examples/osmo-gtphub/osmo-gtphub-1iface.cfg build 3151 0.0 0.0 4280 704 ? S 17:46 0:00 /bin/sh -c ps xua | grep osmo build 3153 0.0 0.0 12784 988 ? S 17:46 0:00 grep osmo
Socket: in 1 tries, connected to 127.0.0.1:4253 <socket.socket fd=4, family=AddressFamily.AF_INET, type=SocketKind.SOCK_STREAM, proto=0, laddr=('127.0.0.1', 52400), raddr=('127.0.0.1', 4253)> (1 sockets open) Terminating took 0.897s Socket: closing 127.0.0.1:4253 <socket.socket fd=4, family=AddressFamily.AF_INET, type=SocketKind.SOCK_STREAM, proto=0, laddr=('127.0.0.1', 52400), raddr=('127.0.0.1', 4253)> (0 sockets open) Verifying src/gtphub/osmo-gtphub -c /build/writtenconfig/osmo-gtphub-1iface.cfggobv0yiv, test write_config Launching: PWD=/build 'src/gtphub/osmo-gtphub' '-c' '/build/writtenconfig/osmo-gtphub-1iface.cfggobv0yiv'
ls -l /proc/3044/fd
total 0 lr-x------ 1 build build 64 Dec 1 17:46 0 -> pipe:[1803186002] l-wx------ 1 build build 64 Dec 1 17:46 1 -> pipe:[1803186003] l-wx------ 1 build build 64 Dec 1 17:46 2 -> pipe:[1803186004] l-wx------ 1 build build 64 Dec 1 17:46 3 -> /dev/null
ss -tn
State Recv-Q Send-Q Local Address:Port Peer Address:Port
ss -tln
State Recv-Q Send-Q Local Address:Port Peer Address:Port
ps xua | grep osmo
build 3044 1.1 0.0 54152 21204 ? S 17:46 0:00 /usr/bin/python3 /usr/local/bin/osmotestconfig.py -p /build -w /build -v build 3155 0.0 0.0 21474965988 14344 ? S 17:46 0:00 src/gtphub/osmo-gtphub -c /build/writtenconfig/osmo-gtphub-1iface.cfggobv0yiv build 3162 0.0 0.0 4280 760 ? S 17:46 0:00 /bin/sh -c ps xua | grep osmo build 3164 0.0 0.0 12784 956 ? S 17:46 0:00 grep osmo
Socket: in 1 tries, connected to 127.0.0.1:4253 <socket.socket fd=4, family=AddressFamily.AF_INET, type=SocketKind.SOCK_STREAM, proto=0, laddr=('127.0.0.1', 52440), raddr=('127.0.0.1', 4253)> (1 sockets open) Terminating took 0.897s Socket: closing 127.0.0.1:4253 <socket.socket fd=4, family=AddressFamily.AF_INET, type=SocketKind.SOCK_STREAM, proto=0, laddr=('127.0.0.1', 52440), raddr=('127.0.0.1', 4253)> (0 sockets open) Verifying src/gtphub/osmo-gtphub -c /build/writtenconfig/osmo-gtphub-1iface.cfggobv0yiv, test token_vty_command Launching: PWD=/build 'src/gtphub/osmo-gtphub' '-c' '/build/writtenconfig/osmo-gtphub-1iface.cfggobv0yiv'
ls -l /proc/3044/fd
total 0 lr-x------ 1 build build 64 Dec 1 17:46 0 -> pipe:[1803186002] l-wx------ 1 build build 64 Dec 1 17:46 1 -> pipe:[1803186003] l-wx------ 1 build build 64 Dec 1 17:46 2 -> pipe:[1803186004] l-wx------ 1 build build 64 Dec 1 17:46 3 -> /dev/null
ss -tn
State Recv-Q Send-Q Local Address:Port Peer Address:Port
ss -tln
State Recv-Q Send-Q Local Address:Port Peer Address:Port LISTEN 0 10 127.0.0.1:4253 *:*
ps xua | grep osmo
build 3044 1.0 0.0 54152 21204 ? S 17:46 0:00 /usr/bin/python3 /usr/local/bin/osmotestconfig.py -p /build -w /build -v build 3166 0.0 0.0 21474965988 14664 ? S 17:46 0:00 src/gtphub/osmo-gtphub -c /build/writtenconfig/osmo-gtphub-1iface.cfggobv0yiv build 3173 0.0 0.0 4280 756 ? S 17:46 0:00 /bin/sh -c ps xua | grep osmo build 3175 0.0 0.0 12784 932 ? S 17:46 0:00 grep osmo
Socket: in 1 tries, connected to 127.0.0.1:4253 <socket.socket fd=4, family=AddressFamily.AF_INET, type=SocketKind.SOCK_STREAM, proto=0, laddr=('127.0.0.1', 52498), raddr=('127.0.0.1', 4253)> (1 sockets open) Terminating took 0.897s Socket: closing 127.0.0.1:4253 <socket.socket fd=4, family=AddressFamily.AF_INET, type=SocketKind.SOCK_STREAM, proto=0, laddr=('127.0.0.1', 52498), raddr=('127.0.0.1', 4253)> (0 sockets open) ERRORS: 2 make[7]: *** [vty-python-test] Error 2 Makefile:711: recipe for target 'vty-python-test' failed make[7]: Leaving directory '/build/tests' Makefile:728: recipe for target 'vty-test' failed make[6]: Leaving directory '/build/tests' make[6]: *** [vty-test] Error 2 make[5]: *** [python-tests] Error 2 Makefile:705: recipe for target 'python-tests' failed make[5]: Leaving directory '/build/tests' Makefile:736: recipe for target 'check-local' failed make[4]: *** [check-local] Error 2 make[4]: Leaving directory '/build/tests' Makefile:565: recipe for target 'check-am' failed make[3]: *** [check-am] Error 2 make[3]: Leaving directory '/build/tests' make[2]: *** [check-recursive] Error 1 Makefile:417: recipe for target 'check-recursive' failed make[2]: Leaving directory '/build/tests' Makefile:461: recipe for target 'check-recursive' failed make[1]: Leaving directory '/build' make[1]: *** [check-recursive] Error 1 Makefile:752: recipe for target 'check' failed make: *** [check] Error 2 + cat-testlogs.sh Build step 'Execute shell' marked build as failure [WARNINGS]Skipping publisher since build result is FAILURE