See https://jenkins.osmocom.org/jenkins/job/TTCN3-centos7-pcap-client-test/1139/display/redirect
Changes:
------------------------------------------ [...truncated 21.73 KiB...] #7 2.818 Running transaction #7 4.650 Preparing : 1/1 #7 4.660 Installing : osmocom-nightly-202501192026-1.1.x86_64 1/23 #7 4.694 Installing : libmnl-1.0.5-7.1.x86_64 2/23 #7 4.752 Installing : libosmocore22-1.10.0.60.cf0a5.202501192026-1.1.x86 3/23 #7 4.789 Running scriptlet: libosmocore22-1.10.0.60.cf0a5.202501192026-1.1.x86 3/23 #7 4.829 Installing : libosmoisdn0-1.10.0.60.cf0a5.202501192026-1.1.x86_ 4/23 #7 4.872 Running scriptlet: libosmoisdn0-1.10.0.60.cf0a5.202501192026-1.1.x86_ 4/23 #7 4.926 Installing : libosmogsm20-1.10.0.60.cf0a5.202501192026-1.1.x86_ 5/23 #7 4.955 Running scriptlet: libosmogsm20-1.10.0.60.cf0a5.202501192026-1.1.x86_ 5/23 #7 4.989 Installing : libosmovty13-1.10.0.60.cf0a5.202501192026-1.1.x86_ 6/23 #7 5.020 Running scriptlet: libosmovty13-1.10.0.60.cf0a5.202501192026-1.1.x86_ 6/23 #7 5.064 Installing : libunwind-2:1.2-2.el7.x86_64 7/23 #7 5.094 Running scriptlet: libunwind-2:1.2-2.el7.x86_64 7/23 #7 5.133 Installing : libsodium23-1.0.18-2.1.x86_64 8/23 #7 5.178 Running scriptlet: libsodium23-1.0.18-2.1.x86_64 8/23 #7 5.230 Installing : libpgm-5_2-0-5.2.122-3.1.x86_64 9/23 #7 5.266 Running scriptlet: libpgm-5_2-0-5.2.122-3.1.x86_64 9/23 #7 5.312 Installing : libzmq5-4.3.5-1.1.x86_64 10/23 #7 5.348 Running scriptlet: libzmq5-4.3.5-1.1.x86_64 10/23 #7 5.380 Installing : openpgm-devel-5.2.122-3.1.x86_64 11/23 #7 5.443 Installing : libsodium-devel-1.0.18-2.1.x86_64 12/23 #7 5.513 Installing : libunwind-devel-2:1.2-2.el7.x86_64 13/23 #7 5.577 Installing : libosmoctrl0-1.10.0.60.cf0a5.202501192026-1.1.x86_ 14/23 #7 5.620 Running scriptlet: libosmoctrl0-1.10.0.60.cf0a5.202501192026-1.1.x86_ 14/23 #7 5.660 Installing : libosmogb14-1.10.0.60.cf0a5.202501192026-1.1.x86_6 15/23 #7 5.703 Running scriptlet: libosmogb14-1.10.0.60.cf0a5.202501192026-1.1.x86_6 15/23 #7 5.746 Installing : libmnl-devel-1.0.5-7.1.x86_64 16/23 #7 5.797 Installing : libosmocore-devel-1.10.0.60.cf0a5.202501192026-1.1 17/23 #7 5.851 Installing : libosmoisdn-devel-1.10.0.60.cf0a5.202501192026-1.1 18/23 #7 5.916 Installing : libosmogsm-devel-1.10.0.60.cf0a5.202501192026-1.1. 19/23 #7 5.967 Installing : libosmovty-devel-1.10.0.60.cf0a5.202501192026-1.1. 20/23 #7 6.020 Installing : libosmogb-devel-1.10.0.60.cf0a5.202501192026-1.1.x 21/23 #7 6.070 Installing : libosmoctrl-devel-1.10.0.60.cf0a5.202501192026-1.1 22/23 #7 6.185 Installing : zeromq-devel-4.3.5-1.1.x86_64 23/23 #7 6.257 Verifying : libmnl-1.0.5-7.1.x86_64 1/23 #7 6.257 Verifying : libmnl-devel-1.0.5-7.1.x86_64 2/23 #7 6.257 Verifying : libosmocore-devel-1.10.0.60.cf0a5.202501192026-1.1 3/23 #7 6.257 Verifying : libosmocore22-1.10.0.60.cf0a5.202501192026-1.1.x86 4/23 #7 6.257 Verifying : libosmoctrl-devel-1.10.0.60.cf0a5.202501192026-1.1 5/23 #7 6.257 Verifying : libosmoctrl0-1.10.0.60.cf0a5.202501192026-1.1.x86_ 6/23 #7 6.257 Verifying : libosmogb-devel-1.10.0.60.cf0a5.202501192026-1.1.x 7/23 #7 6.257 Verifying : libosmogb14-1.10.0.60.cf0a5.202501192026-1.1.x86_6 8/23 #7 6.257 Verifying : libosmogsm-devel-1.10.0.60.cf0a5.202501192026-1.1. 9/23 #7 6.257 Verifying : libosmogsm20-1.10.0.60.cf0a5.202501192026-1.1.x86_ 10/23 #7 6.257 Verifying : libosmoisdn-devel-1.10.0.60.cf0a5.202501192026-1.1 11/23 #7 6.257 Verifying : libosmoisdn0-1.10.0.60.cf0a5.202501192026-1.1.x86_ 12/23 #7 6.257 Verifying : libosmovty-devel-1.10.0.60.cf0a5.202501192026-1.1. 13/23 #7 6.257 Verifying : libosmovty13-1.10.0.60.cf0a5.202501192026-1.1.x86_ 14/23 #7 6.257 Verifying : libpgm-5_2-0-5.2.122-3.1.x86_64 15/23 #7 6.257 Verifying : libsodium-devel-1.0.18-2.1.x86_64 16/23 #7 6.257 Verifying : libsodium23-1.0.18-2.1.x86_64 17/23 #7 6.257 Verifying : libzmq5-4.3.5-1.1.x86_64 18/23 #7 6.257 Verifying : openpgm-devel-5.2.122-3.1.x86_64 19/23 #7 6.257 Verifying : osmocom-nightly-202501192026-1.1.x86_64 20/23 #7 6.257 Verifying : zeromq-devel-4.3.5-1.1.x86_64 21/23 #7 6.258 Verifying : libunwind-2:1.2-2.el7.x86_64 22/23 #7 6.258 Verifying : libunwind-devel-2:1.2-2.el7.x86_64 23/23 #7 7.050 #7 7.050 Installed: #7 7.050 libosmocore-devel-1.10.0.60.cf0a5.202501192026-1.1.x86_64 #7 7.050 libosmoctrl-devel-1.10.0.60.cf0a5.202501192026-1.1.x86_64 #7 7.050 libosmogb-devel-1.10.0.60.cf0a5.202501192026-1.1.x86_64 #7 7.050 libosmogsm-devel-1.10.0.60.cf0a5.202501192026-1.1.x86_64 #7 7.050 libosmovty-devel-1.10.0.60.cf0a5.202501192026-1.1.x86_64 #7 7.050 zeromq-devel-4.3.5-1.1.x86_64 #7 7.050 libmnl-1.0.5-7.1.x86_64 #7 7.050 libmnl-devel-1.0.5-7.1.x86_64 #7 7.050 libosmocore22-1.10.0.60.cf0a5.202501192026-1.1.x86_64 #7 7.050 libosmoctrl0-1.10.0.60.cf0a5.202501192026-1.1.x86_64 #7 7.050 libosmogb14-1.10.0.60.cf0a5.202501192026-1.1.x86_64 #7 7.050 libosmogsm20-1.10.0.60.cf0a5.202501192026-1.1.x86_64 #7 7.050 libosmoisdn-devel-1.10.0.60.cf0a5.202501192026-1.1.x86_64 #7 7.050 libosmoisdn0-1.10.0.60.cf0a5.202501192026-1.1.x86_64 #7 7.050 libosmovty13-1.10.0.60.cf0a5.202501192026-1.1.x86_64 #7 7.050 libpgm-5_2-0-5.2.122-3.1.x86_64 #7 7.050 libsodium-devel-1.0.18-2.1.x86_64 #7 7.050 libsodium23-1.0.18-2.1.x86_64 #7 7.050 libzmq5-4.3.5-1.1.x86_64 #7 7.050 openpgm-devel-5.2.122-3.1.x86_64 #7 7.050 osmocom-nightly-202501192026-1.1.x86_64 #7 7.050 libunwind-2:1.2-2.el7.x86_64 #7 7.050 libunwind-devel-2:1.2-2.el7.x86_64 #7 7.050 #7 7.050 Complete! #7 DONE 7.2s
#8 [3/8] WORKDIR /TMP #8 DONE 0.1s
#9 [4/8] RUN GIT clone https://gerrit.osmocom.org/osmo-pcap.git #9 0.348 Cloning into 'osmo-pcap'... #9 DONE 0.6s
#10 [5/8] ADD HTTPS://GERRIT.OSMOCOM.ORG/PLUGINS/GITILES/OSMO-PCAP/+/MASTER?FORMAT=TEXT /tmp/commit-osmo-pcap #10 DONE 0.1s
#11 [6/8] RUN CD osmo-pcap && git fetch && git checkout master && (git symbolic-ref -q HEAD && git reset --hard origin/master || exit 1); git rev-parse --abbrev-ref HEAD && git rev-parse HEAD && autoreconf -fi && ./configure && make "-j$(nproc)" install #11 0.453 Already on 'master' #11 0.454 refs/heads/master #11 0.463 HEAD is now at f9eedab server: Correct error check calling osmo_pcap_conn_process_data() #11 0.465 master #11 0.467 f9eedab949e5fd7dcfba728c5d525a0f9d6c4f27 #11 3.212 libtoolize: putting auxiliary files in `.'. #11 3.212 libtoolize: copying file `./ltmain.sh' #11 3.543 libtoolize: Consider adding `AC_CONFIG_MACRO_DIR([m4])' to configure.ac and #11 3.543 libtoolize: rerunning libtoolize, to keep the correct libtool macros in-tree. #11 3.543 libtoolize: Consider adding `-I m4' to ACLOCAL_AMFLAGS in Makefile.am. #11 3.546 libtoolize: `AC_PROG_RANLIB' is rendered obsolete by `LT_INIT' #11 5.696 configure.ac:63: installing './config.guess' #11 5.697 configure.ac:63: installing './config.sub' #11 5.698 configure.ac:6: installing './install-sh' #11 5.699 configure.ac:6: installing './missing' #11 5.797 src/Makefile.am: installing './depcomp' #11 5.872 checking for a BSD-compatible install... /usr/bin/install -c #11 5.879 checking whether build environment is sane... yes #11 5.896 checking for a thread-safe mkdir -p... /usr/bin/mkdir -p #11 5.901 checking for gawk... gawk #11 5.902 checking whether make sets $(MAKE)... yes #11 5.924 checking whether make supports nested variables... yes #11 5.940 checking whether make supports nested variables... (cached) yes #11 5.940 checking whether make sets $(MAKE)... (cached) yes #11 5.946 checking for gcc... gcc #11 6.002 checking whether the C compiler works... yes #11 6.080 checking for C compiler default output file name... a.out #11 6.081 checking for suffix of executables... #11 6.116 checking whether we are cross compiling... no #11 6.149 checking for suffix of object files... o #11 6.175 checking whether we are using the GNU C compiler... yes #11 6.207 checking whether gcc accepts -g... yes #11 6.238 checking for gcc option to accept ISO C89... none needed #11 6.270 checking for style of include used by make... GNU #11 6.275 checking dependency style of gcc... gcc3 #11 6.354 checking for ranlib... ranlib #11 6.380 checking build system type... x86_64-unknown-linux-gnu #11 6.492 checking host system type... x86_64-unknown-linux-gnu #11 6.492 checking how to print strings... printf #11 6.498 checking for a sed that does not truncate output... /usr/bin/sed #11 6.509 checking for grep that handles long lines and -e... /usr/bin/grep #11 6.514 checking for egrep... /usr/bin/grep -E #11 6.518 checking for fgrep... /usr/bin/grep -F #11 6.523 checking for ld used by gcc... /usr/bin/ld #11 6.533 checking if the linker (/usr/bin/ld) is GNU ld... yes #11 6.538 checking for BSD- or MS-compatible name lister (nm)... /usr/bin/nm -B #11 6.545 checking the name lister (/usr/bin/nm -B) interface... BSD nm #11 6.592 checking whether ln -s works... yes #11 6.593 checking the maximum length of command line arguments... 1572864 #11 6.603 checking whether the shell understands some XSI constructs... yes #11 6.605 checking whether the shell understands "+="... yes #11 6.613 checking how to convert x86_64-unknown-linux-gnu file names to x86_64-unknown-linux-gnu format... func_convert_file_noop #11 6.614 checking how to convert x86_64-unknown-linux-gnu file names to toolchain format... func_convert_file_noop #11 6.614 checking for /usr/bin/ld option to reload object files... -r #11 6.615 checking for objdump... objdump #11 6.616 checking how to recognize dependent libraries... pass_all #11 6.618 checking for dlltool... no #11 6.619 checking how to associate runtime and link libraries... printf %s\n #11 6.620 checking for ar... ar #11 6.620 checking for archiver @FILE support... @ #11 6.670 checking for strip... strip #11 6.671 checking for ranlib... (cached) ranlib #11 6.672 checking command to parse /usr/bin/nm -B output from gcc object... ok #11 6.807 checking for sysroot... no #11 6.825 ./configure: line 6418: /usr/bin/file: No such file or directory #11 6.829 checking for mt... no #11 6.830 checking if : is a manifest tool... no #11 6.842 checking how to run the C preprocessor... gcc -E #11 6.936 checking for ANSI C header files... yes #11 7.038 checking for sys/types.h... yes #11 7.066 checking for sys/stat.h... yes #11 7.092 checking for stdlib.h... yes #11 7.110 checking for string.h... yes #11 7.135 checking for memory.h... yes #11 7.167 checking for strings.h... yes #11 7.202 checking for inttypes.h... yes #11 7.237 checking for stdint.h... yes #11 7.261 checking for unistd.h... yes #11 7.288 checking for dlfcn.h... yes #11 7.309 checking for objdir... .libs #11 7.395 checking if gcc supports -fno-rtti -fno-exceptions... no #11 7.416 checking for gcc option to produce PIC... -fPIC -DPIC #11 7.416 checking if gcc PIC flag -fPIC -DPIC works... yes #11 7.451 checking if gcc static flag -static works... no #11 7.491 checking if gcc supports -c -o file.o... yes #11 7.558 checking if gcc supports -c -o file.o... (cached) yes #11 7.558 checking whether the gcc linker (/usr/bin/ld) supports shared libraries... yes #11 7.576 checking whether -lc should be explicitly linked in... no #11 7.638 checking dynamic linker characteristics... GNU/Linux ld.so #11 7.717 checking how to hardcode library paths into programs... immediate #11 7.717 checking whether stripping libraries is possible... yes #11 7.720 checking if libtool supports shared libraries... yes #11 7.720 checking whether to build shared libraries... yes #11 7.720 checking whether to build static libraries... yes #11 7.721 checking for pkg-config... /usr/bin/pkg-config #11 7.723 checking for pkg-config... /usr/bin/pkg-config #11 7.723 checking pkg-config is at least version 0.20... yes #11 7.726 checking for ANSI C header files... (cached) yes #11 7.734 checking whether to enable VTY tests... no #11 7.735 checking for pcap-config... /usr/bin/pcap-config #11 7.743 checking for LIBOSMOCORE... yes #11 7.764 checking for LIBOSMOGB... yes #11 7.787 checking for LIBOSMOGSM... yes #11 7.808 checking for LIBOSMOVTY... yes #11 7.830 checking for LIBOSMONETIF... no #11 7.847 configure: error: Package requirements (libosmo-netif >= 1.5.0) were not met: #11 7.847 #11 7.847 No package 'libosmo-netif' found #11 7.847 #11 7.847 Consider adjusting the PKG_CONFIG_PATH environment variable if you #11 7.847 installed software in a non-standard prefix. #11 7.847 #11 7.847 Alternatively, you may set the environment variables LIBOSMONETIF_CFLAGS #11 7.847 and LIBOSMONETIF_LIBS to avoid the need to call pkg-config. #11 7.847 See the pkg-config man page for more details. #11 ERROR: process "/bin/sh -c cd osmo-pcap && \tgit fetch && git checkout $OSMO_PCAP_BRANCH && \t(git symbolic-ref -q HEAD && git reset --hard origin/$OSMO_PCAP_BRANCH || exit 1); \tgit rev-parse --abbrev-ref HEAD && git rev-parse HEAD && \tautoreconf -fi && \t./configure && \tmake "-j$(nproc)" install" did not complete successfully: exit code: 1 ------
[6/8] RUN CD osmo-pcap && git fetch && git checkout master && (git symbolic-ref -q HEAD && git reset --hard origin/master || exit 1); git rev-parse --abbrev-ref HEAD && git rev-parse HEAD && autoreconf -fi && ./configure && make "-j$(nproc)" install:
7.847 configure: error: Package requirements (libosmo-netif >= 1.5.0) were not met: 7.847 7.847 No package 'libosmo-netif' found 7.847 7.847 Consider adjusting the PKG_CONFIG_PATH environment variable if you 7.847 installed software in a non-standard prefix. 7.847 7.847 Alternatively, you may set the environment variables LIBOSMONETIF_CFLAGS 7.847 and LIBOSMONETIF_LIBS to avoid the need to call pkg-config. 7.847 See the pkg-config man page for more details. ------
[33m1 warning found (use docker --debug to expand): [0m - InvalidDefaultArgInFrom: Default value for ARG $USER/$DISTRO-build results in empty or invalid base image name (line 3) Dockerfile:34 -------------------- 33 | 34 | >>> RUN cd osmo-pcap && \ 35 | >>> git fetch && git checkout $OSMO_PCAP_BRANCH && \ 36 | >>> (git symbolic-ref -q HEAD && git reset --hard origin/$OSMO_PCAP_BRANCH || exit 1); \ 37 | >>> git rev-parse --abbrev-ref HEAD && git rev-parse HEAD && \ 38 | >>> autoreconf -fi && \ 39 | >>> ./configure && \ 40 | >>> make "-j$(nproc)" install 41 | -------------------- ERROR: failed to solve: process "/bin/sh -c cd osmo-pcap && \tgit fetch && git checkout $OSMO_PCAP_BRANCH && \t(git symbolic-ref -q HEAD && git reset --hard origin/$OSMO_PCAP_BRANCH || exit 1); \tgit rev-parse --abbrev-ref HEAD && git rev-parse HEAD && \tautoreconf -fi && \t./configure && \tmake "-j$(nproc)" install" did not complete successfully: exit code: 1 make: *** [../make/Makefile:95: docker-build] Error 1 make: Leaving directory 'https://jenkins.osmocom.org/jenkins/job/TTCN3-centos7-pcap-client-test/ws/osmo-pcap-master' + exit 1 Build step 'Execute shell' marked build as failure Recording test results ERROR: Step ‘Publish JUnit test result report’ failed: No test report files were found. Configuration error?