Changes:
------------------------------------------ [...truncated 724.45 KiB...] contains 411 bytes in 1 blocks (ref 0) 0x55a954a15a30 timer lm (wait_asp_up|wait_notify|wait_notify_rkm|wait_rk_reg_resp) <1-999999> contains 79 bytes in 1 blocks (ref 0) 0x55a954a15970 Configure ASP default timer values Configure ASP default xua timer values Resend ASP Up/Down/Active/Inactive after timeout waiting for ASP Up/Down/Active/Inactive ACK (ASP role)(s) (default: 2) Heartbeat Timer (0 = disabled) (s) (default: 30) Timer value, in seconds contains 268 bytes in 1 blocks (ref 0) 0x55a954a14130 timer xua (ack|beat) <1-999999> contains 32 bytes in 1 blocks (ref 0) 0x55a954a140a0 save_cwd contains 43 bytes in 1 blocks (ref 0) 0x55a9549d6260 vty_command contains 182369 bytes in 9530 blocks (ref 0) 0x55a9549be0a0 vty_vector contains 109090 bytes in 6206 blocks (ref 0) 0x55a9549be030 full talloc report on 'osmo_msc' (total 35595 bytes in 116 blocks) asn1 contains 0 bytes in 1 blocks (ref 0) 0x55a954bd9020 struct osmo_ss7_instance contains 12543 bytes in 44 blocks (ref 0) 0x55a954be1f40 struct osmo_ss7_user contains 37 bytes in 2 blocks (ref 0) 0x55a954bc1370 SCCP contains 5 bytes in 1 blocks (ref 0) 0x55a954bdcca0 struct osmo_sccp_instance contains 1023 bytes in 8 blocks (ref 0) 0x55a954be90d0 struct osmo_sccp_user contains 93 bytes in 2 blocks (ref 0) 0x55a954bf1c10 OsmoMSC-IuCS contains 13 bytes in 1 blocks (ref 0) 0x55a954bf1cd0 struct osmo_sccp_user contains 90 bytes in 2 blocks (ref 0) 0x55a954bf19d0 OsmoMSC-A contains 10 bytes in 1 blocks (ref 0) 0x55a954bf1a90 struct osmo_sccp_user contains 96 bytes in 2 blocks (ref 0) 0x55a954bf51e0 SCCP Management contains 16 bytes in 1 blocks (ref 0) 0x55a954bf1950 sccp_instance.c:313 contains 560 bytes in 1 blocks (ref 0) 0x55a954bf4f40 struct osmo_ss7_asp contains 3331 bytes in 20 blocks (ref 0) 0x55a954a6ef90 struct osmo_stream_cli contains 1002 bytes in 4 blocks (ref 0) 0x55a954bf3e00 localhost contains 10 bytes in 1 blocks (ref 0) 0x55a954bea630 localhost contains 10 bytes in 1 blocks (ref 0) 0x55a954bed660 asp-clnt-OsmoMSC-A-Iu contains 22 bytes in 1 blocks (ref 0) 0x55a954be9390 struct osmo_fsm_inst contains 461 bytes in 4 blocks (ref 0) 0x55a954bbb030 struct xua_asp_fsm_priv contains 192 bytes in 1 blocks (ref 0) 0x55a954bf3cd0 XUA_ASP(asp-clnt-OsmoMSC-A-Iu)[0x55a954bbb030] contains 47 bytes in 1 blocks (ref 0) 0x55a954be55a0 asp-clnt-OsmoMSC-A-Iu contains 22 bytes in 1 blocks (ref 0) 0x55a954bbb160 struct osmo_fsm_inst contains 284 bytes in 4 blocks (ref 0) 0x55a954bbade0 struct lm_fsm_priv contains 8 bytes in 1 blocks (ref 0) 0x55a954bd7bc0 xua_default_lm(asp-clnt-OsmoMSC-A-Iu)[0x55a954bbade0] contains 54 bytes in 1 blocks (ref 0) 0x55a954bbaf90 asp-clnt-OsmoMSC-A-Iu contains 22 bytes in 1 blocks (ref 0) 0x55a954bbaf10 localhost contains 10 bytes in 1 blocks (ref 0) 0x55a954bbad60 localhost contains 10 bytes in 1 blocks (ref 0) 0x55a954be91f0 ss7_asp.c:733 contains 280 bytes in 1 blocks (ref 0) 0x55a954bbabe0 ss7_asp.c:730 contains 168 bytes in 1 blocks (ref 0) 0x55a954be5250 asp-clnt-OsmoMSC-A-Iu contains 22 bytes in 1 blocks (ref 0) 0x55a954bc0fe0 rate_ctr.c:233 contains 302 bytes in 2 blocks (ref 0) 0x55a954bc0e60 asp-clnt-OsmoMSC-A-Iu contains 22 bytes in 1 blocks (ref 0) 0x55a954be5370 struct osmo_ss7_as contains 5556 bytes in 8 blocks (ref 0) 0x55a954bf1f20 struct osmo_fsm_inst contains 370 bytes in 4 blocks (ref 0) 0x55a954bc0c90 struct xua_as_fsm_priv contains 104 bytes in 1 blocks (ref 0) 0x55a954bd7640 XUA_AS(as-clnt-OsmoMSC-A-Iu)[0x55a954bc0c90] contains 45 bytes in 1 blocks (ref 0) 0x55a954bc0dc0 as-clnt-OsmoMSC-A-Iu contains 21 bytes in 1 blocks (ref 0) 0x55a954bdca40 as-clnt-OsmoMSC-A-Iu contains 21 bytes in 1 blocks (ref 0) 0x55a954bd7e60 rate_ctr.c:233 contains 2861 bytes in 2 blocks (ref 0) 0x55a954bf2890 as-clnt-OsmoMSC-A-Iu contains 21 bytes in 1 blocks (ref 0) 0x55a954be2160 struct osmo_ss7_route_table contains 2292 bytes in 5 blocks (ref 0) 0x55a954bd9e10 struct osmo_ss7_combined_linkset contains 2128 bytes in 1 blocks (ref 0) 0x55a954bf3410 struct osmo_ss7_route contains 101 bytes in 2 blocks (ref 0) 0x55a954bd8160 as-clnt-OsmoMSC-A-Iu contains 21 bytes in 1 blocks (ref 0) 0x55a954bd7f20 system contains 7 bytes in 1 blocks (ref 0) 0x55a954bdcba0 telnet_connection contains 1 bytes in 1 blocks (ref 0) 0x55a954bbbf60 struct osmo_stream_srv_link contains 1968 bytes in 2 blocks (ref 0) 0x55a954bba010 0.0.0.0 contains 8 bytes in 1 blocks (ref 0) 0x55a954bba820 struct sgs_state contains 376 bytes in 1 blocks (ref 0) 0x55a954bb9e30 struct smsc contains 152 bytes in 1 blocks (ref 0) 0x55a954a6b720 sms.db contains 7 bytes in 1 blocks (ref 0) 0x55a954ad3270 struct sms_queue_config contains 32 bytes in 1 blocks (ref 0) 0x55a954ad31e0 struct gsm_network contains 11914 bytes in 34 blocks (ref 0) 0x55a954a6df40 struct sccp_ran_inst contains 152 bytes in 1 blocks (ref 0) 0x55a954bf1b10 struct sccp_ran_inst contains 152 bytes in 1 blocks (ref 0) 0x55a954bd8220 struct gsm_sms_queue contains 895 bytes in 6 blocks (ref 0) 0x55a954a90950 struct db_context contains 119 bytes in 2 blocks (ref 0) 0x55a954bbba30 sms.db contains 7 bytes in 1 blocks (ref 0) 0x55a954bbbb10 rate_ctr.c:233 contains 440 bytes in 1 blocks (ref 0) 0x55a954bbcdb0 stat_item.c:195 contains 104 bytes in 2 blocks (ref 0) 0x55a954bbb8f0 struct osmo_stat_item contains 56 bytes in 1 blocks (ref 0) 0x55a954bbb990 struct gsup_client_mux contains 682 bytes in 6 blocks (ref 0) 0x55a954bbb750 struct osmo_gsup_client contains 514 bytes in 4 blocks (ref 0) 0x55a954ab62a0 struct osmo_fd contains 48 bytes in 1 blocks (ref 0) 0x55a954bbcb90 struct ipa_client_conn contains 202 bytes in 2 blocks (ref 0) 0x55a954a702b0 127.0.0.1 contains 10 bytes in 1 blocks (ref 0) 0x55a954bbb820 struct ipaccess_unit contains 64 bytes in 1 blocks (ref 0) 0x55a954bbc280 struct ctrl_handle contains 88 bytes in 1 blocks (ref 0) 0x55a954bbb530 127.0.0.1 contains 10 bytes in 1 blocks (ref 0) 0x55a954bbc4a0 struct vlr_instance contains 2496 bytes in 5 blocks (ref 0) 0x55a954a6c7f0 rate_ctr.c:233 contains 2040 bytes in 1 blocks (ref 0) 0x55a954ba4390 stat_item.c:195 contains 168 bytes in 2 blocks (ref 0) 0x55a954ba4210 struct osmo_stat_item contains 112 bytes in 1 blocks (ref 0) 0x55a954ba42b0 struct osmo_nri_ranges contains 16 bytes in 1 blocks (ref 0) 0x55a954ba4190 struct mgcp_client_conf contains 1088 bytes in 1 blocks (ref 0) 0x55a954ad2d30 struct mgcp_client_pool contains 3165 bytes in 7 blocks (ref 0) 0x55a954ad2ca0 struct mgcp_client_pool_member contains 3004 bytes in 4 blocks (ref 0) 0x55a954bbc6b0 struct mgcp_client contains 1868 bytes in 3 blocks (ref 0) 0x55a954bc0710 struct osmo_io_fd contains 572 bytes in 2 blocks (ref 0) 0x55a954a6e490 r=127.0.0.1:2427<->l=127.0.0.1:2728 contains 36 bytes in 1 blocks (ref 0) 0x55a954bd8360 struct cmd_node contains 121 bytes in 2 blocks (ref 0) 0x55a954a6e710 %s(config-mgw)# contains 17 bytes in 1 blocks (ref 0) 0x55a954af5320 127.0.0.1 contains 10 bytes in 1 blocks (ref 0) 0x55a954ad1dc0 stat_item.c:195 contains 296 bytes in 2 blocks (ref 0) 0x55a954ad2b10 struct osmo_stat_item contains 224 bytes in 1 blocks (ref 0) 0x55a954a93400 rate_ctr.c:233 contains 2520 bytes in 1 blocks (ref 0) 0x55a954ad20d0 struct sched_vty_opts contains 72 bytes in 1 blocks (ref 0) 0x55a954abfa70 utils.c:386 contains 203 bytes in 1 blocks (ref 0) 0x55a9549f25d0 utils.c:386 contains 46 bytes in 1 blocks (ref 0) 0x55a9549f2530 utils.c:386 contains 165 bytes in 1 blocks (ref 0) 0x55a9549f2420 utils.c:386 contains 43 bytes in 1 blocks (ref 0) 0x55a9549f2380 logging contains 7792 bytes in 12 blocks (ref 0) 0x55a9549bb580 vty_logp_doc_str contains 1708 bytes in 1 blocks (ref 0) 0x55a954a93d10 vty_logp_cmd_str contains 303 bytes in 1 blocks (ref 0) 0x55a954a93550 vty_log_level_doc_str contains 1501 bytes in 1 blocks (ref 0) 0x55a954a70aa0 vty_log_level_cmd_str contains 279 bytes in 1 blocks (ref 0) 0x55a954a703e0 vty_log_level_doc_str contains 1636 bytes in 1 blocks (ref 0) 0x55a954a6d670 vty_log_level_cmd_str contains 300 bytes in 1 blocks (ref 0) 0x55a954a6d4d0 struct log_target contains 360 bytes in 3 blocks (ref 0) 0x55a9549bbd70 struct osmo_wqueue contains 96 bytes in 1 blocks (ref 0) 0x7feab310f090 struct log_category contains 104 bytes in 1 blocks (ref 0) 0x55a9549bbe80 struct log_info contains 1704 bytes in 2 blocks (ref 0) 0x55a9549bb5f0 struct log_info_cat contains 1664 bytes in 1 blocks (ref 0) 0x55a9549bb680 transaction contains 0 bytes in 1 blocks (ref 0) 0x55a9549bb510 gsm_call contains 0 bytes in 1 blocks (ref 0) 0x55a9549bb4a0 sms contains 0 bytes in 1 blocks (ref 0) 0x55a9549bb430 osmo_signal contains 280 bytes in 8 blocks (ref 0) 0x55a9549bb3c0 struct signal_handler contains 40 bytes in 1 blocks (ref 0) 0x55a954be54c0 struct signal_handler contains 40 bytes in 1 blocks (ref 0) 0x55a954bdcc10 struct signal_handler contains 40 bytes in 1 blocks (ref 0) 0x55a954bbbed0 struct signal_handler contains 40 bytes in 1 blocks (ref 0) 0x55a954bbbfd0 struct signal_handler contains 40 bytes in 1 blocks (ref 0) 0x55a954bbc410 struct signal_handler contains 40 bytes in 1 blocks (ref 0) 0x55a954bbc5a0 struct signal_handler contains 40 bytes in 1 blocks (ref 0) 0x55a954b696b0 msgb contains 0 bytes in 1 blocks (ref 0) 0x55a9549bb350
ERROR testSmppFirst (__main__.TestVTYMSC.testSmppFirst) ... Launching: PWD=/build/osmo-msc-1.14.0.10-d5956/_build/sub './src/osmo-msc/osmo-msc' '-c' '/build/osmo-msc-1.14.0.10-d5956/tests/../doc/examples/osmo-msc/osmo-msc.cfg'
ls -l /proc/134560/fd
total 0 lr-x------ 1 build build 64 Sep 19 10:55 0 -> pipe:[2742367581] l-wx------ 1 build build 64 Sep 19 10:55 1 -> pipe:[2742367582] l-wx------ 1 build build 64 Sep 19 10:55 2 -> pipe:[2742367583] lrwx------ 1 build build 64 Sep 19 10:55 3 -> /tmp/tmpliijf802 (deleted) lrwx------ 1 build build 64 Sep 19 10:55 4 -> /tmp/tmpt3oafd_c (deleted) lrwx------ 1 build build 64 Sep 19 10:55 5 -> /tmp/tmpjqda7d1s (deleted) lrwx------ 1 build build 64 Sep 19 10:55 6 -> /tmp/tmpczrj18v7 (deleted)
ss -tn
State Recv-Q Send-Q Local Address:Port Peer Address:PortProcess
ss -tln
State Recv-Q Send-Q Local Address:Port Peer Address:PortProcess LISTEN 0 10 127.0.0.1:4255 0.0.0.0:* LISTEN 0 10 127.0.0.1:4254 0.0.0.0:* LISTEN 0 10 0.0.0.0:2775 0.0.0.0:*
ps xua | grep osmo
build 123098 0.0 0.0 3932 3100 ? S 10:55 0:00 /bin/bash -c test -d osmo-msc-1.14.0.10-d5956/_build || exit 0; \ dc_install_base=`CDPATH="${ZSH_VERSION+.}:" && cd osmo-msc-1.14.0.10-d5956/_inst && pwd | sed -e 's,^[^:\/]:[\/],/,'` \ && dc_destdir="${TMPDIR-/tmp}/am-dc-$$/" \ && am__cwd=`pwd` \ && CDPATH="${ZSH_VERSION+.}:" && cd osmo-msc-1.14.0.10-d5956/_build/sub \ && ../../configure \ --with-systemdsystemunitdir=$dc_install_base//lib/systemd/system \ --enable-werror --enable-smpp --enable-iu --enable-external-tests --enable-manuals \ --srcdir=../.. --prefix="$dc_install_base" \ && make \ && make dvi \ && make check \ && make install \ && make installcheck \ && make uninstall \ && make distuninstallcheck_dir="$dc_install_base" \ distuninstallcheck \ && chmod -R a-w "$dc_install_base" \ && ({ \ (cd ../.. && umask 077 && mkdir "$dc_destdir") \ && make DESTDIR="$dc_destdir" install \ && make DESTDIR="$dc_destdir" uninstall \ && make DESTDIR="$dc_destdir" \ distuninstallcheck_dir="$dc_destdir" distuninstallcheck; \ } || { rm -rf "$dc_destdir"; exit 1; }) \ && rm -rf "$dc_destdir" \ && make dist \ && rm -rf osmo-msc-1.14.0.10-d5956.tar.gz osmo-msc-1.14.0.10-d5956.tar.bz2 \ && make distcleancheck \ && cd "$am__cwd" \ || exit 1 build 127587 0.0 0.0 3932 3084 ? S 10:55 0:00 /bin/bash -c fail=; \ if (target_option=k; case ${target_option-} in ?) ;; *) echo "am__make_running_with_option: internal error: invalid" "target option '${target_option-}' specified" >&2; exit 1;; esac; has_opt=no; sane_makeflags=$MAKEFLAGS; if { if test -z '2'; then false; elif test -n 'x86_64-pc-linux-gnu'; then true; elif test -n '4.3' && test -n '/build/osmo-msc-1.14.0.10-d5956/_build/sub'; then true; else false; fi; }; then sane_makeflags=$MFLAGS; else case $MAKEFLAGS in *\[\ ?]*) bs=\; sane_makeflags=`printf '%s\n' "$MAKEFLAGS" | sed "s/$bs$bs[$bs $bs?]*//g"`;; esac; fi; skip_next=no; strip_trailopt () { flg=`printf '%s\n' "$flg" | sed "s/$1.*$//"`; }; for flg in $sane_makeflags; do test $skip_next = yes && { skip_next=no; continue; }; case $flg in *=*|--*) continue;; -*I) strip_trailopt 'I'; skip_next=yes;; -*I?*) strip_trailopt 'I';; -*O) strip_trailopt 'O'; skip_next=yes;; -*O?*) strip_trailopt 'O';; -*l) strip_trailopt 'l'; skip_next=yes;; -*l?*) strip_trailopt 'l';; -[dEDm]) skip_next=yes;; -[JT]) skip_next=yes;; esac; case $flg in *$target_option*) has_opt=yes; break;; esac; done; test $has_opt = yes); then \ failcom='fail=yes'; \ else \ failcom='exit 1'; \ fi; \ dot_seen=no; \ target=`echo check-recursive | sed s/-recursive//`; \ case "check-recursive" in \ distclean-* | maintainer-clean-*) list='include src doc contrib tests ' ;; \ *) list='include src doc contrib tests ' ;; \ esac; \ for subdir in $list; do \ echo "Making $target in $subdir"; \ if test "$subdir" = "."; then \ dot_seen=yes; \ local_target="$target-am"; \ else \ local_target="$target"; \ fi; \ (CDPATH="${ZSH_VERSION+.}:" && cd $subdir && make $local_target) \ || eval $failcom; \ done; \ if test "$dot_seen" = "no"; then \ make "$target-am" || exit 1; \ fi; test -z "$fail" build 127794 0.0 0.0 3932 2944 ? S 10:55 0:00 /bin/bash -c fail=; \ if (target_option=k; case ${target_option-} in ?) ;; *) echo "am__make_running_with_option: internal error: invalid" "target option '${target_option-}' specified" >&2; exit 1;; esac; has_opt=no; sane_makeflags=$MAKEFLAGS; if { if test -z '3'; then false; elif test -n 'x86_64-pc-linux-gnu'; then true; elif test -n '4.3' && test -n '/build/osmo-msc-1.14.0.10-d5956/_build/sub/tests'; then true; else false; fi; }; then sane_makeflags=$MFLAGS; else case $MAKEFLAGS in *\[\ ?]*) bs=\; sane_makeflags=`printf '%s\n' "$MAKEFLAGS" | sed "s/$bs$bs[$bs $bs?]*//g"`;; esac; fi; skip_next=no; strip_trailopt () { flg=`printf '%s\n' "$flg" | sed "s/$1.*$//"`; }; for flg in $sane_makeflags; do test $skip_next = yes && { skip_next=no; continue; }; case $flg in *=*|--*) continue;; -*I) strip_trailopt 'I'; skip_next=yes;; -*I?*) strip_trailopt 'I';; -*O) strip_trailopt 'O'; skip_next=yes;; -*O?*) strip_trailopt 'O';; -*l) strip_trailopt 'l'; skip_next=yes;; -*l?*) strip_trailopt 'l';; -[dEDm]) skip_next=yes;; -[JT]) skip_next=yes;; esac; case $flg in *$target_option*) has_opt=yes; break;; esac; done; test $has_opt = yes); then \ failcom='fail=yes'; \ else \ failcom='exit 1'; \ fi; \ dot_seen=no; \ target=`echo check-recursive | sed s/-recursive//`; \ case "check-recursive" in \ distclean-* | maintainer-clean-*) list='sms_queue msc_vlr db_sms sdp_msg mncc csd smpp' ;; \ *) list='sms_queue msc_vlr db_sms sdp_msg mncc csd smpp ' ;; \ esac; \ for subdir in $list; do \ echo "Making $target in $subdir"; \ if test "$subdir" = "."; then \ dot_seen=yes; \ local_target="$target-am"; \ else \ local_target="$target"; \ fi; \ (CDPATH="${ZSH_VERSION+.}:" && cd $subdir && make $local_target) \ || eval $failcom; \ done; \ if test "$dot_seen" = "no"; then \ make "$target-am" || exit 1; \ fi; test -z "$fail" build 134560 0.6 0.0 19796 14924 ? S 10:55 0:00 python3 ../../../tests/vty_test_runner.py -w /build/osmo-msc-1.14.0.10-d5956/_build/sub -v build 134601 0.0 0.0 21168 13652 ? S 10:55 0:00 ./src/osmo-msc/osmo-msc -c /build/osmo-msc-1.14.0.10-d5956/tests/../doc/examples/osmo-msc/osmo-msc.cfg build 134608 0.0 0.0 2584 900 ? S 10:55 0:00 /bin/sh -c ps xua | grep osmo build 134610 0.0 0.0 3708 1892 ? S 10:55 0:00 grep osmo
Socket: in 1 tries, connected to 127.0.0.1:4254 <socket.socket fd=7, family=2, type=1, proto=0, laddr=('127.0.0.1', 52084), raddr=('127.0.0.1', 4254)> (1 sockets open) Socket: closing 127.0.0.1:4254 <socket.socket fd=7, family=2, type=1, proto=0, laddr=('127.0.0.1', 52084), raddr=('127.0.0.1', 4254)> (0 sockets open) Terminating took 0.897s Process returned code: 0 ok testVtyTree (__main__.TestVTYMSC.testVtyTree) ... Launching: PWD=/build/osmo-msc-1.14.0.10-d5956/_build/sub './src/osmo-msc/osmo-msc' '-c' '/build/osmo-msc-1.14.0.10-d5956/tests/../doc/examples/osmo-msc/osmo-msc.cfg'
ls -l /proc/134560/fd
total 0 lr-x------ 1 build build 64 Sep 19 10:55 0 -> pipe:[2742367581] l-wx------ 1 build build 64 Sep 19 10:55 1 -> pipe:[2742367582] l-wx------ 1 build build 64 Sep 19 10:55 2 -> pipe:[2742367583] lrwx------ 1 build build 64 Sep 19 10:55 3 -> /tmp/tmpliijf802 (deleted) lrwx------ 1 build build 64 Sep 19 10:55 4 -> /tmp/tmpt3oafd_c (deleted) lrwx------ 1 build build 64 Sep 19 10:55 5 -> /tmp/tmprfsvnve_ (deleted) lrwx------ 1 build build 64 Sep 19 10:55 6 -> /tmp/tmp9ihs1wzw (deleted)
ss -tn
State Recv-Q Send-Q Local Address:Port Peer Address:PortProcess
ss -tln
State Recv-Q Send-Q Local Address:Port Peer Address:PortProcess LISTEN 0 10 127.0.0.1:4255 0.0.0.0:* LISTEN 0 10 127.0.0.1:4254 0.0.0.0:* LISTEN 0 10 0.0.0.0:2775 0.0.0.0:*
ps xua | grep osmo
build 123098 0.0 0.0 3932 3100 ? S 10:55 0:00 /bin/bash -c test -d osmo-msc-1.14.0.10-d5956/_build || exit 0; \ dc_install_base=`CDPATH="${ZSH_VERSION+.}:" && cd osmo-msc-1.14.0.10-d5956/_inst && pwd | sed -e 's,^[^:\/]:[\/],/,'` \ && dc_destdir="${TMPDIR-/tmp}/am-dc-$$/" \ && am__cwd=`pwd` \ && CDPATH="${ZSH_VERSION+.}:" && cd osmo-msc-1.14.0.10-d5956/_build/sub \ && ../../configure \ --with-systemdsystemunitdir=$dc_install_base//lib/systemd/system \ --enable-werror --enable-smpp --enable-iu --enable-external-tests --enable-manuals \ --srcdir=../.. --prefix="$dc_install_base" \ && make \ && make dvi \ && make check \ && make install \ && make installcheck \ && make uninstall \ && make distuninstallcheck_dir="$dc_install_base" \ distuninstallcheck \ && chmod -R a-w "$dc_install_base" \ && ({ \ (cd ../.. && umask 077 && mkdir "$dc_destdir") \ && make DESTDIR="$dc_destdir" install \ && make DESTDIR="$dc_destdir" uninstall \ && make DESTDIR="$dc_destdir" \ distuninstallcheck_dir="$dc_destdir" distuninstallcheck; \ } || { rm -rf "$dc_destdir"; exit 1; }) \ && rm -rf "$dc_destdir" \ && make dist \ && rm -rf osmo-msc-1.14.0.10-d5956.tar.gz osmo-msc-1.14.0.10-d5956.tar.bz2 \ && make distcleancheck \ && cd "$am__cwd" \ || exit 1 build 127587 0.0 0.0 3932 3084 ? S 10:55 0:00 /bin/bash -c fail=; \ if (target_option=k; case ${target_option-} in ?) ;; *) echo "am__make_running_with_option: internal error: invalid" "target option '${target_option-}' specified" >&2; exit 1;; esac; has_opt=no; sane_makeflags=$MAKEFLAGS; if { if test -z '2'; then false; elif test -n 'x86_64-pc-linux-gnu'; then true; elif test -n '4.3' && test -n '/build/osmo-msc-1.14.0.10-d5956/_build/sub'; then true; else false; fi; }; then sane_makeflags=$MFLAGS; else case $MAKEFLAGS in *\[\ ?]*) bs=\; sane_makeflags=`printf '%s\n' "$MAKEFLAGS" | sed "s/$bs$bs[$bs $bs?]*//g"`;; esac; fi; skip_next=no; strip_trailopt () { flg=`printf '%s\n' "$flg" | sed "s/$1.*$//"`; }; for flg in $sane_makeflags; do test $skip_next = yes && { skip_next=no; continue; }; case $flg in *=*|--*) continue;; -*I) strip_trailopt 'I'; skip_next=yes;; -*I?*) strip_trailopt 'I';; -*O) strip_trailopt 'O'; skip_next=yes;; -*O?*) strip_trailopt 'O';; -*l) strip_trailopt 'l'; skip_next=yes;; -*l?*) strip_trailopt 'l';; -[dEDm]) skip_next=yes;; -[JT]) skip_next=yes;; esac; case $flg in *$target_option*) has_opt=yes; break;; esac; done; test $has_opt = yes); then \ failcom='fail=yes'; \ else \ failcom='exit 1'; \ fi; \ dot_seen=no; \ target=`echo check-recursive | sed s/-recursive//`; \ case "check-recursive" in \ distclean-* | maintainer-clean-*) list='include src doc contrib tests ' ;; \ *) list='include src doc contrib tests ' ;; \ esac; \ for subdir in $list; do \ echo "Making $target in $subdir"; \ if test "$subdir" = "."; then \ dot_seen=yes; \ local_target="$target-am"; \ else \ local_target="$target"; \ fi; \ (CDPATH="${ZSH_VERSION+.}:" && cd $subdir && make $local_target) \ || eval $failcom; \ done; \ if test "$dot_seen" = "no"; then \ make "$target-am" || exit 1; \ fi; test -z "$fail" build 127794 0.0 0.0 3932 2944 ? S 10:55 0:00 /bin/bash -c fail=; \ if (target_option=k; case ${target_option-} in ?) ;; *) echo "am__make_running_with_option: internal error: invalid" "target option '${target_option-}' specified" >&2; exit 1;; esac; has_opt=no; sane_makeflags=$MAKEFLAGS; if { if test -z '3'; then false; elif test -n 'x86_64-pc-linux-gnu'; then true; elif test -n '4.3' && test -n '/build/osmo-msc-1.14.0.10-d5956/_build/sub/tests'; then true; else false; fi; }; then sane_makeflags=$MFLAGS; else case $MAKEFLAGS in *\[\ ?]*) bs=\; sane_makeflags=`printf '%s\n' "$MAKEFLAGS" | sed "s/$bs$bs[$bs $bs?]*//g"`;; esac; fi; skip_next=no; strip_trailopt () { flg=`printf '%s\n' "$flg" | sed "s/$1.*$//"`; }; for flg in $sane_makeflags; do test $skip_next = yes && { skip_next=no; continue; }; case $flg in *=*|--*) continue;; -*I) strip_trailopt 'I'; skip_next=yes;; -*I?*) strip_trailopt 'I';; -*O) strip_trailopt 'O'; skip_next=yes;; -*O?*) strip_trailopt 'O';; -*l) strip_trailopt 'l'; skip_next=yes;; -*l?*) strip_trailopt 'l';; -[dEDm]) skip_next=yes;; -[JT]) skip_next=yes;; esac; case $flg in *$target_option*) has_opt=yes; break;; esac; done; test $has_opt = yes); then \ failcom='fail=yes'; \ else \ failcom='exit 1'; \ fi; \ dot_seen=no; \ target=`echo check-recursive | sed s/-recursive//`; \ case "check-recursive" in \ distclean-* | maintainer-clean-*) list='sms_queue msc_vlr db_sms sdp_msg mncc csd smpp' ;; \ *) list='sms_queue msc_vlr db_sms sdp_msg mncc csd smpp ' ;; \ esac; \ for subdir in $list; do \ echo "Making $target in $subdir"; \ if test "$subdir" = "."; then \ dot_seen=yes; \ local_target="$target-am"; \ else \ local_target="$target"; \ fi; \ (CDPATH="${ZSH_VERSION+.}:" && cd $subdir && make $local_target) \ || eval $failcom; \ done; \ if test "$dot_seen" = "no"; then \ make "$target-am" || exit 1; \ fi; test -z "$fail" build 134560 0.4 0.0 19796 14924 ? S 10:55 0:00 python3 ../../../tests/vty_test_runner.py -w /build/osmo-msc-1.14.0.10-d5956/_build/sub -v build 134611 0.0 0.0 21036 12952 ? S 10:55 0:00 ./src/osmo-msc/osmo-msc -c /build/osmo-msc-1.14.0.10-d5956/tests/../doc/examples/osmo-msc/osmo-msc.cfg build 134618 0.0 0.0 2584 928 ? S 10:55 0:00 /bin/sh -c ps xua | grep osmo build 134620 0.0 0.0 3708 1856 ? S 10:55 0:00 grep osmo
Socket: in 1 tries, connected to 127.0.0.1:4254 <socket.socket fd=7, family=2, type=1, proto=0, laddr=('127.0.0.1', 52086), raddr=('127.0.0.1', 4254)> (1 sockets open) Socket: closing 127.0.0.1:4254 <socket.socket fd=7, family=2, type=1, proto=0, laddr=('127.0.0.1', 52086), raddr=('127.0.0.1', 4254)> (0 sockets open) Terminating took 0.897s Process returned code: 0 ok
====================================================================== ERROR: testSi2Q (__main__.TestVTYMSC.testSi2Q) ---------------------------------------------------------------------- Traceback (most recent call last): File "/build/osmo-msc-1.14.0.10-d5956/_build/sub/tests/../../../tests/vty_test_runner.py", line 85, in tearDown raise Exception("Process returned %d" % rc) Exception: Process returned -6
---------------------------------------------------------------------- Ran 6 tests in 7.502s
FAILED (errors=1) make[8]: *** [Makefile:723: vty-python-test] Error 1 make[8]: Leaving directory '/build/osmo-msc-1.14.0.10-d5956/_build/sub/tests' make[7]: *** [Makefile:743: vty-test] Error 2 make[7]: Leaving directory '/build/osmo-msc-1.14.0.10-d5956/_build/sub/tests' make[6]: *** [Makefile:713: python-tests] Error 2 make[6]: Leaving directory '/build/osmo-msc-1.14.0.10-d5956/_build/sub/tests' make[5]: Leaving directory '/build/osmo-msc-1.14.0.10-d5956/_build/sub/tests' make[5]: *** [Makefile:767: check-local] Error 2 make[4]: Leaving directory '/build/osmo-msc-1.14.0.10-d5956/_build/sub/tests' make[4]: *** [Makefile:572: check-am] Error 2 make[3]: *** [Makefile:422: check-recursive] Error 1 make[3]: Leaving directory '/build/osmo-msc-1.14.0.10-d5956/_build/sub/tests' make[2]: Leaving directory '/build/osmo-msc-1.14.0.10-d5956/_build/sub' make[2]: *** [Makefile:471: check-recursive] Error 1 make[1]: *** [Makefile:770: check] Error 2 make[1]: Leaving directory '/build/osmo-msc-1.14.0.10-d5956/_build/sub' make: *** [Makefile:690: distcheck] Error 1 + exit_tar_workspace + '[' 1 = 1 ']' + tar -cJf /tmp/workspace.tar.xz /build tar: Removing leading `/' from member names + mv /tmp/workspace.tar.xz /build + cat-testlogs.sh Build step 'Execute shell' marked build as failure $ ssh-agent -k unset SSH_AUTH_SOCK; unset SSH_AGENT_PID; echo Agent pid 2651497 killed; [ssh-agent] Stopped. Archiving artifacts