Changes:
------------------------------------------ [...truncated 149.92 KB...] Making all in amr make[3]: Entering directory '/build/tests/amr' make[3]: Nothing to be done for 'all'. make[3]: Leaving directory '/build/tests/amr' make[3]: Entering directory '/build/tests' make[3]: Nothing to be done for 'all-am'. make[3]: Leaving directory '/build/tests' make[2]: Leaving directory '/build/tests' Making all in doc make[2]: Entering directory '/build/doc' Making all in examples make[3]: Entering directory '/build/doc/examples' make[3]: Nothing to be done for 'all'. make[3]: Leaving directory '/build/doc/examples' Making all in manuals make[3]: Entering directory '/build/doc/manuals' make[3]: Nothing to be done for 'all'. make[3]: Leaving directory '/build/doc/manuals' make[3]: Entering directory '/build/doc' make[3]: Nothing to be done for 'all-am'. make[3]: Leaving directory '/build/doc' make[2]: Leaving directory '/build/doc' Making all in contrib make[2]: Entering directory '/build/contrib' Making all in systemd make[3]: Entering directory '/build/contrib/systemd' make[3]: Nothing to be done for 'all'. make[3]: Leaving directory '/build/contrib/systemd' make[3]: Entering directory '/build/contrib' make[3]: Nothing to be done for 'all-am'. make[3]: Leaving directory '/build/contrib' make[2]: Leaving directory '/build/contrib' make[2]: Entering directory '/build' make[2]: Leaving directory '/build' make[1]: Leaving directory '/build' + make check make check-recursive make[1]: Entering directory '/build' Making check in include make[2]: Entering directory '/build/include' Making check in osmo-bts make[3]: Entering directory '/build/include/osmo-bts' make[3]: Nothing to be done for 'check'. make[3]: Leaving directory '/build/include/osmo-bts' make[3]: Entering directory '/build/include' make[3]: Nothing to be done for 'check-am'. make[3]: Leaving directory '/build/include' make[2]: Leaving directory '/build/include' Making check in src make[2]: Entering directory '/build/src' Making check in common make[3]: Entering directory '/build/src/common' make check-am make[4]: Entering directory '/build/src/common' make[4]: Nothing to be done for 'check-am'. make[4]: Leaving directory '/build/src/common' make[3]: Leaving directory '/build/src/common' Making check in osmo-bts-virtual make[3]: Entering directory '/build/src/osmo-bts-virtual' make[3]: Nothing to be done for 'check'. make[3]: Leaving directory '/build/src/osmo-bts-virtual' Making check in osmo-bts-omldummy make[3]: Entering directory '/build/src/osmo-bts-omldummy' make[3]: Nothing to be done for 'check'. make[3]: Leaving directory '/build/src/osmo-bts-omldummy' Making check in osmo-bts-trx make[3]: Entering directory '/build/src/osmo-bts-trx' make check-am make[4]: Entering directory '/build/src/osmo-bts-trx' make[4]: Nothing to be done for 'check-am'. make[4]: Leaving directory '/build/src/osmo-bts-trx' make[3]: Leaving directory '/build/src/osmo-bts-trx' make[3]: Entering directory '/build/src' make[3]: Nothing to be done for 'check-am'. make[3]: Leaving directory '/build/src' make[2]: Leaving directory '/build/src' Making check in tests make[2]: Entering directory '/build/tests' Making check in paging make[3]: Entering directory '/build/tests/paging' make paging_test make[4]: Entering directory '/build/tests/paging' CC paging_test.o CC stubs.o CCLD paging_test make[4]: Leaving directory '/build/tests/paging' make[3]: Leaving directory '/build/tests/paging' Making check in cipher make[3]: Entering directory '/build/tests/cipher' make cipher_test make[4]: Entering directory '/build/tests/cipher' CC cipher_test.o CC stubs.o CCLD cipher_test make[4]: Leaving directory '/build/tests/cipher' make[3]: Leaving directory '/build/tests/cipher' Making check in agch make[3]: Entering directory '/build/tests/agch' make agch_test make[4]: Entering directory '/build/tests/agch' CC agch_test.o CC stubs.o CCLD agch_test make[4]: Leaving directory '/build/tests/agch' make[3]: Leaving directory '/build/tests/agch' Making check in misc make[3]: Entering directory '/build/tests/misc' make misc_test make[4]: Entering directory '/build/tests/misc' CC misc_test.o CC stubs.o CCLD misc_test make[4]: Leaving directory '/build/tests/misc' make[3]: Leaving directory '/build/tests/misc' Making check in handover make[3]: Entering directory '/build/tests/handover' make handover_test make[4]: Entering directory '/build/tests/handover' CC handover_test.o CC stubs.o CCLD handover_test make[4]: Leaving directory '/build/tests/handover' make[3]: Leaving directory '/build/tests/handover' Making check in tx_power make[3]: Entering directory '/build/tests/tx_power' make tx_power_test make[4]: Entering directory '/build/tests/tx_power' CC tx_power_test.o CC stubs.o CCLD tx_power_test make[4]: Leaving directory '/build/tests/tx_power' make[3]: Leaving directory '/build/tests/tx_power' Making check in power make[3]: Entering directory '/build/tests/power' make ms_power_loop_test bs_power_loop_test make[4]: Entering directory '/build/tests/power' CC ms_power_loop_test.o CC stubs.o CCLD ms_power_loop_test CC bs_power_loop_test.o CCLD bs_power_loop_test make[4]: Leaving directory '/build/tests/power' make[3]: Leaving directory '/build/tests/power' Making check in meas make[3]: Entering directory '/build/tests/meas' make meas_test make[4]: Entering directory '/build/tests/meas' CC meas_test.o CC stubs.o CCLD meas_test make[4]: Leaving directory '/build/tests/meas' make[3]: Leaving directory '/build/tests/meas' Making check in ta_control make[3]: Entering directory '/build/tests/ta_control' make ta_control_test make[4]: Entering directory '/build/tests/ta_control' CC ta_control_test.o CCLD ta_control_test make[4]: Leaving directory '/build/tests/ta_control' make[3]: Leaving directory '/build/tests/ta_control' Making check in amr make[3]: Entering directory '/build/tests/amr' make amr_test make[4]: Entering directory '/build/tests/amr' CC amr_test.o CCLD amr_test make[4]: Leaving directory '/build/tests/amr' make[3]: Leaving directory '/build/tests/amr' make[3]: Entering directory '/build/tests' make check-local make[4]: Entering directory '/build/tests' :;{ \ echo '# Signature of the current package.' && \ echo 'm4_define([AT_PACKAGE_NAME],' && \ echo ' [osmo-bts])' && \ echo 'm4_define([AT_PACKAGE_TARNAME],' && \ echo ' [osmo-bts])' && \ echo 'm4_define([AT_PACKAGE_VERSION],' && \ echo ' [1.5.0.41-77fd0])' && \ echo 'm4_define([AT_PACKAGE_STRING],' && \ echo ' [osmo-bts 1.5.0.41-77fd0])' && \ echo 'm4_define([AT_PACKAGE_BUGREPORT],' && \ echo ' [openbsc@lists.osmocom.org])'; \ echo 'm4_define([AT_PACKAGE_URL],' && \ echo ' [])'; \ } >'./package.m4' /bin/bash ../missing --run autom4te --language=autotest -I '.' -o testsuite.tmp testsuite.at mv testsuite.tmp testsuite /bin/bash './testsuite' ## ----------------------------------- ## ## osmo-bts 1.5.0.41-77fd0 test suite. ## ## ----------------------------------- ##
Regression tests.
1: paging ok 2: agch ok 3: cipher ok 4: misc ok 5: handover ok 6: ms_power_loop ok 7: bs_power_loop ok 8: tx_power ok 9: meas ok 10: ta_control ok 11: amr ok
## ------------- ## ## Test results. ## ## ------------- ##
All 11 tests were successful. make python-tests make[5]: Entering directory '/build/tests' make vty-test make[6]: Entering directory '/build/tests' osmo_verify_transcript_vty.py -v \ -n OsmoBTS -p 4241 \ -r "../src/osmo-bts-virtual/osmo-bts-virtual --vty-test -c ../doc/examples/virtual/osmo-bts-virtual.cfg" \ ./*.vty Launching: cd '/build/tests'; ../src/osmo-bts-virtual/osmo-bts-virtual --vty-test -c ../doc/examples/virtual/osmo-bts-virtual.cfg Traceback (most recent call last): File "/usr/local/lib/python3.7/dist-packages/osmopython-0.2.1-py3.7.egg/osmopy/osmo_interact/common.py", line 356, in verify_application interact.connect() File "/usr/local/lib/python3.7/dist-packages/osmopython-0.2.1-py3.7.egg/osmopy/osmo_interact/vty.py", line 84, in connect super().connect() File "/usr/local/lib/python3.7/dist-packages/osmopython-0.2.1-py3.7.egg/osmopy/osmo_interact/common.py", line 88, in connect self.socket.connect((self.host, int(self.port))) ConnectionRefusedError: [Errno 111] Connection refused
RESULTS: FAIL: ./osmo-bts.vty
make[6]: *** [Makefile:698: vty-test] Error 1 make[6]: Leaving directory '/build/tests' make[5]: *** [Makefile:687: python-tests] Error 2 make[5]: Leaving directory '/build/tests' make[4]: *** [Makefile:705: check-local] Error 2 make[4]: Leaving directory '/build/tests' make[3]: *** [Makefile:547: check-am] Error 2 make[3]: Leaving directory '/build/tests' make[2]: *** [Makefile:396: check-recursive] Error 1 make[2]: Leaving directory '/build/tests' make[1]: *** [Makefile:444: check-recursive] Error 1 make[1]: Leaving directory '/build' make: *** [Makefile:738: check] Error 2 + cat-testlogs.sh Build step 'Execute shell' marked build as failure Archiving artifacts