Changes:
------------------------------------------ [...truncated 380.38 KB...] <param name='[stats]' doc='(null)' />
Documentation error (missing docs): <command id='show ns binds [stats]'> <param name='[stats]' doc='(null)' />
Documentation error (missing docs): <command id='show ns entities [stats]'> <param name='[stats]' doc='(null)' />
State Recv-Q Send-Q Local Address:Port Peer Address:Port
ss -tln
State Recv-Q Send-Q Local Address:Port Peer Address:Port
ps xua | grep osmo
build 12363 2.3 0.0 54000 21108 ? S 17:35 0:00 /usr/bin/python3 /usr/local/bin/osmotestconfig.py -p /build -w /build -v build 12408 0.0 0.0 21474964008 15296 ? S 17:35 0:00 src/gbproxy/osmo-gbproxy -c /build/writtenconfig/osmo-gbproxy-legacy.cfgr1whfl2g build 12415 0.0 0.0 4280 724 ? S 17:35 0:00 /bin/sh -c ps xua | grep osmo build 12417 0.0 0.0 12784 956 ? S 17:35 0:00 grep osmo
Socket: in 1 tries, connected to 127.0.0.1:4246 <socket.socket fd=4, family=AddressFamily.AF_INET, type=SocketKind.SOCK_STREAM, proto=0, laddr=('127.0.0.1', 40722), raddr=('127.0.0.1', 4246)> (1 sockets open) Terminating took 0.897s Socket: closing 127.0.0.1:4246 <socket.socket fd=4, family=AddressFamily.AF_INET, type=SocketKind.SOCK_STREAM, proto=0, laddr=('127.0.0.1', 40722), raddr=('127.0.0.1', 4246)> (0 sockets open) Verifying src/gbproxy/osmo-gbproxy -c /build/writtenconfig/osmo-gbproxy-legacy.cfgr1whfl2g, test token_vty_command Launching: PWD=/build 'src/gbproxy/osmo-gbproxy' '-c' '/build/writtenconfig/osmo-gbproxy-legacy.cfgr1whfl2g'
ls -l /proc/12363/fd
total 0 lr-x------ 1 build build 64 Dec 1 17:35 0 -> pipe:[1802482333] l-wx------ 1 build build 64 Dec 1 17:35 1 -> pipe:[1802482334] l-wx------ 1 build build 64 Dec 1 17:35 2 -> pipe:[1802482335] l-wx------ 1 build build 64 Dec 1 17:35 3 -> /dev/null
ss -tn
State Recv-Q Send-Q Local Address:Port Peer Address:Port
ss -tln
State Recv-Q Send-Q Local Address:Port Peer Address:Port
ps xua | grep osmo
build 12363 1.7 0.0 54000 21108 ? S 17:35 0:00 /usr/bin/python3 /usr/local/bin/osmotestconfig.py -p /build -w /build -v build 12419 0.0 0.0 21474964008 15256 ? S 17:35 0:00 src/gbproxy/osmo-gbproxy -c /build/writtenconfig/osmo-gbproxy-legacy.cfgr1whfl2g build 12426 0.0 0.0 4280 752 ? S 17:35 0:00 /bin/sh -c ps xua | grep osmo build 12428 0.0 0.0 12784 976 ? S 17:35 0:00 grep osmo
Socket: in 1 tries, connected to 127.0.0.1:4246 <socket.socket fd=4, family=AddressFamily.AF_INET, type=SocketKind.SOCK_STREAM, proto=0, laddr=('127.0.0.1', 40760), raddr=('127.0.0.1', 4246)> (1 sockets open) Terminating took 0.897s Socket: closing 127.0.0.1:4246 <socket.socket fd=4, family=AddressFamily.AF_INET, type=SocketKind.SOCK_STREAM, proto=0, laddr=('127.0.0.1', 40760), raddr=('127.0.0.1', 4246)> (0 sockets open) Verifying src/sgsn/osmo-sgsn -c /build/doc/examples/osmo-sgsn/osmo-sgsn.cfg, test verify_doc Launching: PWD=/build 'src/sgsn/osmo-sgsn' '-c' '/build/doc/examples/osmo-sgsn/osmo-sgsn.cfg'
ls -l /proc/12363/fd
total 0 lr-x------ 1 build build 64 Dec 1 17:35 0 -> pipe:[1802482333] l-wx------ 1 build build 64 Dec 1 17:35 1 -> pipe:[1802482334] l-wx------ 1 build build 64 Dec 1 17:35 2 -> pipe:[1802482335] l-wx------ 1 build build 64 Dec 1 17:35 3 -> /dev/null
ss -tn
State Recv-Q Send-Q Local Address:Port Peer Address:Port
ss -tln
State Recv-Q Send-Q Local Address:Port Peer Address:Port
ps xua | grep osmo
build 12363 1.6 0.0 54000 21108 ? S 17:35 0:00 /usr/bin/python3 /usr/local/bin/osmotestconfig.py -p /build -w /build -v build 12430 0.0 0.0 21475109004 17964 ? S 17:35 0:00 src/sgsn/osmo-sgsn -c /build/doc/examples/osmo-sgsn/osmo-sgsn.cfg build 12437 0.0 0.0 4280 716 ? S 17:35 0:00 /bin/sh -c ps xua | grep osmo build 12439 0.0 0.0 12784 948 ? S 17:35 0:00 grep osmo
Socket: in 1 tries, connected to 127.0.0.1:4245 <socket.socket fd=4, family=AddressFamily.AF_INET, type=SocketKind.SOCK_STREAM, proto=0, laddr=('127.0.0.1', 38874), raddr=('127.0.0.1', 4245)> (1 sockets open) Terminating took 0.897s Socket: closing 127.0.0.1:4245 <socket.socket fd=4, family=AddressFamily.AF_INET, type=SocketKind.SOCK_STREAM, proto=0, laddr=('127.0.0.1', 38874), raddr=('127.0.0.1', 4245)> (0 sockets open) Verifying src/sgsn/osmo-sgsn -c /build/writtenconfig/osmo-sgsn.cfgiscqlhnx, test write_config Launching: PWD=/build 'src/sgsn/osmo-sgsn' '-c' '/build/writtenconfig/osmo-sgsn.cfgiscqlhnx'
ls -l /proc/12363/fd
total 0 lr-x------ 1 build build 64 Dec 1 17:35 0 -> pipe:[1802482333] l-wx------ 1 build build 64 Dec 1 17:35 1 -> pipe:[1802482334] l-wx------ 1 build build 64 Dec 1 17:35 2 -> pipe:[1802482335] l-wx------ 1 build build 64 Dec 1 17:35 3 -> /dev/null
ss -tn
State Recv-Q Send-Q Local Address:Port Peer Address:Port
ss -tln
State Recv-Q Send-Q Local Address:Port Peer Address:Port
ps xua | grep osmo
build 12363 1.3 0.0 54000 21180 ? S 17:35 0:00 /usr/bin/python3 /usr/local/bin/osmotestconfig.py -p /build -w /build -v build 12441 1.0 0.0 21475109004 18180 ? S 17:35 0:00 src/sgsn/osmo-sgsn -c /build/writtenconfig/osmo-sgsn.cfgiscqlhnx build 12448 0.0 0.0 4280 724 ? S 17:35 0:00 /bin/sh -c ps xua | grep osmo build 12450 0.0 0.0 12784 972 ? S 17:35 0:00 grep osmo
Socket: in 1 tries, connected to 127.0.0.1:4245 <socket.socket fd=4, family=AddressFamily.AF_INET, type=SocketKind.SOCK_STREAM, proto=0, laddr=('127.0.0.1', 38924), raddr=('127.0.0.1', 4245)> (1 sockets open) Terminating took 0.897s Socket: closing 127.0.0.1:4245 <socket.socket fd=4, family=AddressFamily.AF_INET, type=SocketKind.SOCK_STREAM, proto=0, laddr=('127.0.0.1', 38924), raddr=('127.0.0.1', 4245)> (0 sockets open) Verifying src/sgsn/osmo-sgsn -c /build/writtenconfig/osmo-sgsn.cfgiscqlhnx, test token_vty_command Launching: PWD=/build 'src/sgsn/osmo-sgsn' '-c' '/build/writtenconfig/osmo-sgsn.cfgiscqlhnx'
ls -l /proc/12363/fd
total 0 lr-x------ 1 build build 64 Dec 1 17:35 0 -> pipe:[1802482333] l-wx------ 1 build build 64 Dec 1 17:35 1 -> pipe:[1802482334] l-wx------ 1 build build 64 Dec 1 17:35 2 -> pipe:[1802482335] l-wx------ 1 build build 64 Dec 1 17:35 3 -> /dev/null
ss -tn
State Recv-Q Send-Q Local Address:Port Peer Address:Port
ss -tln
State Recv-Q Send-Q Local Address:Port Peer Address:Port
ps xua | grep osmo
build 12363 1.3 0.0 54000 21180 ? S 17:35 0:00 /usr/bin/python3 /usr/local/bin/osmotestconfig.py -p /build -w /build -v build 12452 0.0 0.0 21475109004 18016 ? R 17:35 0:00 src/sgsn/osmo-sgsn -c /build/writtenconfig/osmo-sgsn.cfgiscqlhnx build 12459 0.0 0.0 4280 712 ? S 17:35 0:00 /bin/sh -c ps xua | grep osmo build 12461 0.0 0.0 12784 936 ? S 17:35 0:00 grep osmo
Socket: in 1 tries, connected to 127.0.0.1:4245 <socket.socket fd=4, family=AddressFamily.AF_INET, type=SocketKind.SOCK_STREAM, proto=0, laddr=('127.0.0.1', 38950), raddr=('127.0.0.1', 4245)> (1 sockets open) Terminating took 0.897s Socket: closing 127.0.0.1:4245 <socket.socket fd=4, family=AddressFamily.AF_INET, type=SocketKind.SOCK_STREAM, proto=0, laddr=('127.0.0.1', 38950), raddr=('127.0.0.1', 4245)> (0 sockets open) Verifying src/gtphub/osmo-gtphub -c /build/doc/examples/osmo-gtphub/osmo-gtphub-1iface.cfg, test verify_doc Launching: PWD=/build 'src/gtphub/osmo-gtphub' '-c' '/build/doc/examples/osmo-gtphub/osmo-gtphub-1iface.cfg'
ls -l /proc/12363/fd
total 0 lr-x------ 1 build build 64 Dec 1 17:35 0 -> pipe:[1802482333] l-wx------ 1 build build 64 Dec 1 17:35 1 -> pipe:[1802482334] l-wx------ 1 build build 64 Dec 1 17:35 2 -> pipe:[1802482335] l-wx------ 1 build build 64 Dec 1 17:35 3 -> /dev/null
ss -tn
State Recv-Q Send-Q Local Address:Port Peer Address:Port
ss -tln
State Recv-Q Send-Q Local Address:Port Peer Address:Port
ps xua | grep osmo
build 12363 1.2 0.0 54000 21180 ? S 17:35 0:00 /usr/bin/python3 /usr/local/bin/osmotestconfig.py -p /build -w /build -v build 12463 0.0 0.0 21474961572 14180 ? S 17:35 0:00 src/gtphub/osmo-gtphub -c /build/doc/examples/osmo-gtphub/osmo-gtphub-1iface.cfg build 12470 0.0 0.0 4280 724 ? S 17:35 0:00 /bin/sh -c ps xua | grep osmo build 12472 0.0 0.0 12784 984 ? S 17:35 0:00 grep osmo
Socket: in 1 tries, connected to 127.0.0.1:4253 <socket.socket fd=4, family=AddressFamily.AF_INET, type=SocketKind.SOCK_STREAM, proto=0, laddr=('127.0.0.1', 36676), raddr=('127.0.0.1', 4253)> (1 sockets open) Terminating took 0.897s Socket: closing 127.0.0.1:4253 <socket.socket fd=4, family=AddressFamily.AF_INET, type=SocketKind.SOCK_STREAM, proto=0, laddr=('127.0.0.1', 36676), raddr=('127.0.0.1', 4253)> (0 sockets open) Verifying src/gtphub/osmo-gtphub -c /build/writtenconfig/osmo-gtphub-1iface.cfgiqmc94z1, test write_config Launching: PWD=/build 'src/gtphub/osmo-gtphub' '-c' '/build/writtenconfig/osmo-gtphub-1iface.cfgiqmc94z1'
ls -l /proc/12363/fd
total 0 lr-x------ 1 build build 64 Dec 1 17:35 0 -> pipe:[1802482333] l-wx------ 1 build build 64 Dec 1 17:35 1 -> pipe:[1802482334] l-wx------ 1 build build 64 Dec 1 17:35 2 -> pipe:[1802482335] l-wx------ 1 build build 64 Dec 1 17:35 3 -> /dev/null
ss -tn
State Recv-Q Send-Q Local Address:Port Peer Address:Port
ss -tln
State Recv-Q Send-Q Local Address:Port Peer Address:Port
ps xua | grep osmo
build 12363 1.0 0.0 54000 21180 ? S 17:35 0:00 /usr/bin/python3 /usr/local/bin/osmotestconfig.py -p /build -w /build -v build 12474 0.0 0.0 21474961572 14280 ? S 17:35 0:00 src/gtphub/osmo-gtphub -c /build/writtenconfig/osmo-gtphub-1iface.cfgiqmc94z1 build 12481 0.0 0.0 4280 748 ? S 17:35 0:00 /bin/sh -c ps xua | grep osmo build 12483 0.0 0.0 12784 932 ? S 17:35 0:00 grep osmo
Socket: in 1 tries, connected to 127.0.0.1:4253 <socket.socket fd=4, family=AddressFamily.AF_INET, type=SocketKind.SOCK_STREAM, proto=0, laddr=('127.0.0.1', 36720), raddr=('127.0.0.1', 4253)> (1 sockets open) Terminating took 0.897s Socket: closing 127.0.0.1:4253 <socket.socket fd=4, family=AddressFamily.AF_INET, type=SocketKind.SOCK_STREAM, proto=0, laddr=('127.0.0.1', 36720), raddr=('127.0.0.1', 4253)> (0 sockets open) Verifying src/gtphub/osmo-gtphub -c /build/writtenconfig/osmo-gtphub-1iface.cfgiqmc94z1, test token_vty_command Launching: PWD=/build 'src/gtphub/osmo-gtphub' '-c' '/build/writtenconfig/osmo-gtphub-1iface.cfgiqmc94z1'
ls -l /proc/12363/fd
total 0 lr-x------ 1 build build 64 Dec 1 17:35 0 -> pipe:[1802482333] l-wx------ 1 build build 64 Dec 1 17:35 1 -> pipe:[1802482334] l-wx------ 1 build build 64 Dec 1 17:35 2 -> pipe:[1802482335] l-wx------ 1 build build 64 Dec 1 17:35 3 -> /dev/null
ss -tn
State Recv-Q Send-Q Local Address:Port Peer Address:Port
ss -tln
State Recv-Q Send-Q Local Address:Port Peer Address:Port
ps xua | grep osmo
build 12363 1.0 0.0 54000 21180 ? S 17:35 0:00 /usr/bin/python3 /usr/local/bin/osmotestconfig.py -p /build -w /build -v build 12485 0.0 0.0 21474961572 14368 ? S 17:35 0:00 src/gtphub/osmo-gtphub -c /build/writtenconfig/osmo-gtphub-1iface.cfgiqmc94z1 build 12492 0.0 0.0 4280 748 ? S 17:35 0:00 /bin/sh -c ps xua | grep osmo build 12494 0.0 0.0 12784 968 ? S 17:35 0:00 grep osmo
ERRORS: 2 Socket: in 1 tries, connected to 127.0.0.1:4253 <socket.socket fd=4, family=AddressFamily.AF_INET, type=SocketKind.SOCK_STREAM, proto=0, laddr=('127.0.0.1', 36810), raddr=('127.0.0.1', 4253)> (1 sockets open) Terminating took 0.897s Socket: closing 127.0.0.1:4253 <socket.socket fd=4, family=AddressFamily.AF_INET, type=SocketKind.SOCK_STREAM, proto=0, laddr=('127.0.0.1', 36810), raddr=('127.0.0.1', 4253)> (0 sockets open) Makefile:711: recipe for target 'vty-python-test' failed make[7]: Leaving directory '/build/tests' make[7]: *** [vty-python-test] Error 2 Makefile:728: recipe for target 'vty-test' failed make[6]: Leaving directory '/build/tests' make[6]: *** [vty-test] Error 2 make[5]: *** [python-tests] Error 2 Makefile:705: recipe for target 'python-tests' failed make[5]: Leaving directory '/build/tests' make[4]: *** [check-local] Error 2 Makefile:736: recipe for target 'check-local' failed make[4]: Leaving directory '/build/tests' Makefile:565: recipe for target 'check-am' failed make[3]: Leaving directory '/build/tests' make[3]: *** [check-am] Error 2 Makefile:417: recipe for target 'check-recursive' failed make[2]: Leaving directory '/build/tests' make[2]: *** [check-recursive] Error 1 make[1]: *** [check-recursive] Error 1 Makefile:461: recipe for target 'check-recursive' failed make[1]: Leaving directory '/build' make: *** [check] Error 2 Makefile:752: recipe for target 'check' failed + cat-testlogs.sh Build step 'Execute shell' marked build as failure [WARNINGS]Skipping publisher since build result is FAILURE