Changes:
------------------------------------------ [...truncated 381.29 KB...] State Recv-Q Send-Q Local Address:Port Peer Address:Port
ss -tln
State Recv-Q Send-Q Local Address:Port Peer Address:Port LISTEN 0 10 127.0.0.1:4263 *:* LISTEN 0 10 127.0.0.1:4246 *:*
ps xua | grep osmo
build 12154 3.0 0.0 54024 21020 ? S 17:56 0:00 /usr/bin/python3 /usr/local/bin/osmotestconfig.py -p /build -w /build -v build 12199 0.0 0.0 21474964008 23560 ? S 17:56 0:00 src/gbproxy/osmo-gbproxy -c /build/writtenconfig/osmo-gbproxy-legacy.cfg66k11h4a build 12206 0.0 0.0 4280 716 ? S 17:56 0:00 /bin/sh -c ps xua | grep osmo build 12208 0.0 0.0 12784 944 ? R 17:56 0:00 grep osmo
Socket: in 1 tries, connected to 127.0.0.1:4246 <socket.socket fd=4, family=AddressFamily.AF_INET, type=SocketKind.SOCK_STREAM, proto=0, laddr=('127.0.0.1', 48190), raddr=('127.0.0.1', 4246)> (1 sockets open) Terminating took 0.897s Socket: closing 127.0.0.1:4246 <socket.socket fd=4, family=AddressFamily.AF_INET, type=SocketKind.SOCK_STREAM, proto=0, laddr=('127.0.0.1', 48190), raddr=('127.0.0.1', 4246)> (0 sockets open) Verifying src/gbproxy/osmo-gbproxy -c /build/writtenconfig/osmo-gbproxy-legacy.cfg66k11h4a, test token_vty_command Launching: PWD=/build 'src/gbproxy/osmo-gbproxy' '-c' '/build/writtenconfig/osmo-gbproxy-legacy.cfg66k11h4a'
ls -l /proc/12154/fd
total 0 lr-x------ 1 build build 64 Dec 1 17:56 0 -> pipe:[192061644] l-wx------ 1 build build 64 Dec 1 17:56 1 -> pipe:[192061645] l-wx------ 1 build build 64 Dec 1 17:56 2 -> pipe:[192061646] l-wx------ 1 build build 64 Dec 1 17:56 3 -> /dev/null
ss -tn
State Recv-Q Send-Q Local Address:Port Peer Address:Port
ss -tln
State Recv-Q Send-Q Local Address:Port Peer Address:Port
ps xua | grep osmo
build 12154 2.2 0.0 54024 21020 ? S 17:56 0:00 /usr/bin/python3 /usr/local/bin/osmotestconfig.py -p /build -w /build -v build 12210 0.0 0.0 21474964008 24372 ? S 17:56 0:00 src/gbproxy/osmo-gbproxy -c /build/writtenconfig/osmo-gbproxy-legacy.cfg66k11h4a build 12217 0.0 0.0 4280 752 ? S 17:56 0:00 /bin/sh -c ps xua | grep osmo build 12219 0.0 0.0 12784 952 ? S 17:56 0:00 grep osmo
Socket: in 1 tries, connected to 127.0.0.1:4246 <socket.socket fd=4, family=AddressFamily.AF_INET, type=SocketKind.SOCK_STREAM, proto=0, laddr=('127.0.0.1', 48192), raddr=('127.0.0.1', 4246)> (1 sockets open) Terminating took 0.897s Socket: closing 127.0.0.1:4246 <socket.socket fd=4, family=AddressFamily.AF_INET, type=SocketKind.SOCK_STREAM, proto=0, laddr=('127.0.0.1', 48192), raddr=('127.0.0.1', 4246)> (0 sockets open) Verifying src/sgsn/osmo-sgsn -c /build/doc/examples/osmo-sgsn/osmo-sgsn.cfg, test verify_doc Launching: PWD=/build 'src/sgsn/osmo-sgsn' '-c' '/build/doc/examples/osmo-sgsn/osmo-sgsn.cfg'
ls -l /proc/12154/fd
total 0 lr-x------ 1 build build 64 Dec 1 17:56 0 -> pipe:[192061644] l-wx------ 1 build build 64 Dec 1 17:56 1 -> pipe:[192061645] l-wx------ 1 build build 64 Dec 1 17:56 2 -> pipe:[192061646] l-wx------ 1 build build 64 Dec 1 17:56 3 -> /dev/null lr-x------ 1 build build 64 Dec 1 17:56 4 -> pipe:[192531170]
ss -tn
State Recv-Q Send-Q Local Address:Port Peer Address:Port
ss -tln
State Recv-Q Send-Q Local Address:Port Peer Address:Port LISTEN 0 10 127.0.0.1:4245 *:* LISTEN 0 10 127.0.0.1:4251 *:*
ps xua | grep osmo
build 12154 1.8 0.0 54024 21020 ? S 17:56 0:00 /usr/bin/python3 /usr/local/bin/osmotestconfig.py -p /build -w /build -v build 12221 0.0 0.0 21475109004 33964 ? S 17:56 0:00 src/sgsn/osmo-sgsn -c /build/doc/examples/osmo-sgsn/osmo-sgsn.cfg build 12228 0.0 0.0 4280 696 ? S 17:56 0:00 /bin/sh -c ps xua | grep osmo build 12230 0.0 0.0 12784 932 ? S 17:56 0:00 grep osmo
Socket: in 1 tries, connected to 127.0.0.1:4245 <socket.socket fd=4, family=AddressFamily.AF_INET, type=SocketKind.SOCK_STREAM, proto=0, laddr=('127.0.0.1', 43968), raddr=('127.0.0.1', 4245)> (1 sockets open) Terminating took 0.897s Socket: closing 127.0.0.1:4245 <socket.socket fd=4, family=AddressFamily.AF_INET, type=SocketKind.SOCK_STREAM, proto=0, laddr=('127.0.0.1', 43968), raddr=('127.0.0.1', 4245)> (0 sockets open) Verifying src/sgsn/osmo-sgsn -c /build/writtenconfig/osmo-sgsn.cfgoak_707f, test write_config Launching: PWD=/build 'src/sgsn/osmo-sgsn' '-c' '/build/writtenconfig/osmo-sgsn.cfgoak_707f'
ls -l /proc/12154/fd
total 0 lr-x------ 1 build build 64 Dec 1 17:56 0 -> pipe:[192061644] l-wx------ 1 build build 64 Dec 1 17:56 1 -> pipe:[192061645] l-wx------ 1 build build 64 Dec 1 17:56 2 -> pipe:[192061646] l-wx------ 1 build build 64 Dec 1 17:56 3 -> /dev/null
ss -tn
State Recv-Q Send-Q Local Address:Port Peer Address:Port
ss -tln
State Recv-Q Send-Q Local Address:Port Peer Address:Port LISTEN 0 10 127.0.0.1:4245 *:* LISTEN 0 10 127.0.0.1:4251 *:*
ps xua | grep osmo
build 12154 1.7 0.0 54024 21096 ? R 17:56 0:00 /usr/bin/python3 /usr/local/bin/osmotestconfig.py -p /build -w /build -v build 12232 0.0 0.0 21475109004 30240 ? S 17:56 0:00 src/sgsn/osmo-sgsn -c /build/writtenconfig/osmo-sgsn.cfgoak_707f build 12239 0.0 0.0 4280 752 ? S 17:56 0:00 /bin/sh -c ps xua | grep osmo build 12241 0.0 0.0 12784 1012 ? R 17:56 0:00 grep osmo
Socket: in 1 tries, connected to 127.0.0.1:4245 <socket.socket fd=4, family=AddressFamily.AF_INET, type=SocketKind.SOCK_STREAM, proto=0, laddr=('127.0.0.1', 43970), raddr=('127.0.0.1', 4245)> (1 sockets open) Terminating took 0.897s Socket: closing 127.0.0.1:4245 <socket.socket fd=4, family=AddressFamily.AF_INET, type=SocketKind.SOCK_STREAM, proto=0, laddr=('127.0.0.1', 43970), raddr=('127.0.0.1', 4245)> (0 sockets open) Verifying src/sgsn/osmo-sgsn -c /build/writtenconfig/osmo-sgsn.cfgoak_707f, test token_vty_command Launching: PWD=/build 'src/sgsn/osmo-sgsn' '-c' '/build/writtenconfig/osmo-sgsn.cfgoak_707f'
ls -l /proc/12154/fd
total 0 lr-x------ 1 build build 64 Dec 1 17:56 0 -> pipe:[192061644] l-wx------ 1 build build 64 Dec 1 17:56 1 -> pipe:[192061645] l-wx------ 1 build build 64 Dec 1 17:56 2 -> pipe:[192061646] l-wx------ 1 build build 64 Dec 1 17:56 3 -> /dev/null
ss -tn
State Recv-Q Send-Q Local Address:Port Peer Address:Port
ss -tln
State Recv-Q Send-Q Local Address:Port Peer Address:Port
ps xua | grep osmo
build 12154 1.5 0.0 54024 21096 ? S 17:56 0:00 /usr/bin/python3 /usr/local/bin/osmotestconfig.py -p /build -w /build -v build 12243 0.0 0.0 21475042824 34012 ? R 17:56 0:00 src/sgsn/osmo-sgsn -c /build/writtenconfig/osmo-sgsn.cfgoak_707f build 12250 0.0 0.0 4280 720 ? S 17:56 0:00 /bin/sh -c ps xua | grep osmo build 12252 0.0 0.0 12784 964 ? S 17:56 0:00 grep osmo
Socket: in 1 tries, connected to 127.0.0.1:4245 <socket.socket fd=4, family=AddressFamily.AF_INET, type=SocketKind.SOCK_STREAM, proto=0, laddr=('127.0.0.1', 43978), raddr=('127.0.0.1', 4245)> (1 sockets open) Terminating took 0.897s Socket: closing 127.0.0.1:4245 <socket.socket fd=4, family=AddressFamily.AF_INET, type=SocketKind.SOCK_STREAM, proto=0, laddr=('127.0.0.1', 43978), raddr=('127.0.0.1', 4245)> (0 sockets open) Verifying src/gtphub/osmo-gtphub -c /build/doc/examples/osmo-gtphub/osmo-gtphub-1iface.cfg, test verify_doc Launching: PWD=/build 'src/gtphub/osmo-gtphub' '-c' '/build/doc/examples/osmo-gtphub/osmo-gtphub-1iface.cfg'
ls -l /proc/12154/fd
total 0 lr-x------ 1 build build 64 Dec 1 17:56 0 -> pipe:[192061644] l-wx------ 1 build build 64 Dec 1 17:56 1 -> pipe:[192061645] l-wx------ 1 build build 64 Dec 1 17:56 2 -> pipe:[192061646] l-wx------ 1 build build 64 Dec 1 17:56 3 -> /dev/null
ss -tn
State Recv-Q Send-Q Local Address:Port Peer Address:Port
ss -tln
State Recv-Q Send-Q Local Address:Port Peer Address:Port LISTEN 0 10 127.0.0.1:4253 *:*
ps xua | grep osmo
build 12154 1.4 0.0 54024 21096 ? S 17:56 0:00 /usr/bin/python3 /usr/local/bin/osmotestconfig.py -p /build -w /build -v build 12254 0.0 0.0 21474961572 23136 ? S 17:56 0:00 src/gtphub/osmo-gtphub -c /build/doc/examples/osmo-gtphub/osmo-gtphub-1iface.cfg build 12261 0.0 0.0 4280 792 ? S 17:56 0:00 /bin/sh -c ps xua | grep osmo build 12263 0.0 0.0 12784 932 ? R 17:56 0:00 grep osmo
Socket: in 1 tries, connected to 127.0.0.1:4253 <socket.socket fd=4, family=AddressFamily.AF_INET, type=SocketKind.SOCK_STREAM, proto=0, laddr=('127.0.0.1', 39546), raddr=('127.0.0.1', 4253)> (1 sockets open) Terminating took 0.897s Socket: closing 127.0.0.1:4253 <socket.socket fd=4, family=AddressFamily.AF_INET, type=SocketKind.SOCK_STREAM, proto=0, laddr=('127.0.0.1', 39546), raddr=('127.0.0.1', 4253)> (0 sockets open) Verifying src/gtphub/osmo-gtphub -c /build/writtenconfig/osmo-gtphub-1iface.cfgv0u50bi2, test write_config Launching: PWD=/build 'src/gtphub/osmo-gtphub' '-c' '/build/writtenconfig/osmo-gtphub-1iface.cfgv0u50bi2'
ls -l /proc/12154/fd
total 0 lr-x------ 1 build build 64 Dec 1 17:56 0 -> pipe:[192061644] l-wx------ 1 build build 64 Dec 1 17:56 1 -> pipe:[192061645] l-wx------ 1 build build 64 Dec 1 17:56 2 -> pipe:[192061646] l-wx------ 1 build build 64 Dec 1 17:56 3 -> /dev/null
ss -tn
State Recv-Q Send-Q Local Address:Port Peer Address:Port
ss -tln
State Recv-Q Send-Q Local Address:Port Peer Address:Port LISTEN 0 10 127.0.0.1:4253 *:*
ps xua | grep osmo
build 12154 1.3 0.0 54024 21096 ? S 17:56 0:00 /usr/bin/python3 /usr/local/bin/osmotestconfig.py -p /build -w /build -v build 12265 0.0 0.0 21474961572 26120 ? S 17:56 0:00 src/gtphub/osmo-gtphub -c /build/writtenconfig/osmo-gtphub-1iface.cfgv0u50bi2 build 12272 0.0 0.0 4280 744 ? S 17:56 0:00 /bin/sh -c ps xua | grep osmo build 12274 0.0 0.0 12784 932 ? S 17:56 0:00 grep osmo
Socket: in 1 tries, connected to 127.0.0.1:4253 <socket.socket fd=4, family=AddressFamily.AF_INET, type=SocketKind.SOCK_STREAM, proto=0, laddr=('127.0.0.1', 39552), raddr=('127.0.0.1', 4253)> (1 sockets open) Terminating took 0.897s Socket: closing 127.0.0.1:4253 <socket.socket fd=4, family=AddressFamily.AF_INET, type=SocketKind.SOCK_STREAM, proto=0, laddr=('127.0.0.1', 39552), raddr=('127.0.0.1', 4253)> (0 sockets open) Verifying src/gtphub/osmo-gtphub -c /build/writtenconfig/osmo-gtphub-1iface.cfgv0u50bi2, test token_vty_command Launching: PWD=/build 'src/gtphub/osmo-gtphub' '-c' '/build/writtenconfig/osmo-gtphub-1iface.cfgv0u50bi2'
ls -l /proc/12154/fd
total 0 lr-x------ 1 build build 64 Dec 1 17:56 0 -> pipe:[192061644] l-wx------ 1 build build 64 Dec 1 17:56 1 -> pipe:[192061645] l-wx------ 1 build build 64 Dec 1 17:56 2 -> pipe:[192061646] l-wx------ 1 build build 64 Dec 1 17:56 3 -> /dev/null
ss -tn
State Recv-Q Send-Q Local Address:Port Peer Address:Port
ss -tln
State Recv-Q Send-Q Local Address:Port Peer Address:Port LISTEN 0 10 127.0.0.1:4253 *:*
ps xua | grep osmo
build 12154 1.2 0.0 54024 21096 ? S 17:56 0:00 /usr/bin/python3 /usr/local/bin/osmotestconfig.py -p /build -w /build -v build 12276 0.0 0.0 21474961572 23552 ? S 17:56 0:00 src/gtphub/osmo-gtphub -c /build/writtenconfig/osmo-gtphub-1iface.cfgv0u50bi2 build 12283 0.0 0.0 4280 752 ? S 17:56 0:00 /bin/sh -c ps xua | grep osmo build 12285 0.0 0.0 12784 944 ? S 17:56 0:00 grep osmo
ERRORS: 2 Socket: in 1 tries, connected to 127.0.0.1:4253 <socket.socket fd=4, family=AddressFamily.AF_INET, type=SocketKind.SOCK_STREAM, proto=0, laddr=('127.0.0.1', 39554), raddr=('127.0.0.1', 4253)> (1 sockets open) Terminating took 0.897s Socket: closing 127.0.0.1:4253 <socket.socket fd=4, family=AddressFamily.AF_INET, type=SocketKind.SOCK_STREAM, proto=0, laddr=('127.0.0.1', 39554), raddr=('127.0.0.1', 4253)> (0 sockets open) Makefile:711: recipe for target 'vty-python-test' failed make[7]: Leaving directory '/build/tests' make[7]: *** [vty-python-test] Error 2 Makefile:728: recipe for target 'vty-test' failed make[6]: *** [vty-test] Error 2 make[6]: Leaving directory '/build/tests' make[5]: *** [python-tests] Error 2 Makefile:705: recipe for target 'python-tests' failed make[5]: Leaving directory '/build/tests' Makefile:736: recipe for target 'check-local' failed make[4]: Leaving directory '/build/tests' make[4]: *** [check-local] Error 2 Makefile:565: recipe for target 'check-am' failed make[3]: Leaving directory '/build/tests' make[3]: *** [check-am] Error 2 Makefile:417: recipe for target 'check-recursive' failed make[2]: Leaving directory '/build/tests' make[2]: *** [check-recursive] Error 1 make[1]: *** [check-recursive] Error 1 Makefile:461: recipe for target 'check-recursive' failed make[1]: Leaving directory '/build' make: *** [check] Error 2 Makefile:752: recipe for target 'check' failed + cat-testlogs.sh Build step 'Execute shell' marked build as failure [WARNINGS]Skipping publisher since build result is FAILURE