Changes:
------------------------------------------ [...truncated 294.55 KiB...] ---------------------------------------------------------------------- Traceback (most recent call last): File "https://jenkins.osmocom.org/jenkins/job/master-pysim/JOB_TYPE=test,a1=default,a3=default,a4=default,label=simtester/ws/tests/pySim-shell_test/utils.py", line 201, in setUp reader = self.__search_card(name, atr, iccid, eid) ^^^^^^^^^^^^^^^^^^^^^^^^^^^^^^^^^^^^^^^^^ File "https://jenkins.osmocom.org/jenkins/job/master-pysim/JOB_TYPE=test,a1=default,a3=default,a4=default,label=simtester/ws/tests/pySim-shell_test/utils.py", line 143, in __search_card raise RuntimeError("missing card %s (atr:%s, eid:%s, iccid:%s), check test setup and configuration file (%s)" % RuntimeError: missing card sysmoISIM-SJA5-S17 (atr:3B9F96801F878031E073FE211B674A357530350265F8, eid:None, iccid:8949440000001155314), check test setup and configuration file (/tests/pySim-shell_test/config.yaml)
====================================================================== ERROR: test_binary_sim (file_content.test.test_case.test_binary_sim) ---------------------------------------------------------------------- Traceback (most recent call last): File "https://jenkins.osmocom.org/jenkins/job/master-pysim/JOB_TYPE=test,a1=default,a3=default,a4=default,label=simtester/ws/tests/pySim-shell_test/utils.py", line 201, in setUp reader = self.__search_card(name, atr, iccid, eid) ^^^^^^^^^^^^^^^^^^^^^^^^^^^^^^^^^^^^^^^^^ File "https://jenkins.osmocom.org/jenkins/job/master-pysim/JOB_TYPE=test,a1=default,a3=default,a4=default,label=simtester/ws/tests/pySim-shell_test/utils.py", line 143, in __search_card raise RuntimeError("missing card %s (atr:%s, eid:%s, iccid:%s), check test setup and configuration file (%s)" % RuntimeError: missing card sysmoISIM-SJA5-S17 (atr:3B9F96801F878031E073FE211B674A357530350265F8, eid:None, iccid:8949440000001155314), check test setup and configuration file (/tests/pySim-shell_test/config.yaml)
====================================================================== ERROR: test_binary_uicc (file_content.test.test_case.test_binary_uicc) ---------------------------------------------------------------------- Traceback (most recent call last): File "https://jenkins.osmocom.org/jenkins/job/master-pysim/JOB_TYPE=test,a1=default,a3=default,a4=default,label=simtester/ws/tests/pySim-shell_test/utils.py", line 201, in setUp reader = self.__search_card(name, atr, iccid, eid) ^^^^^^^^^^^^^^^^^^^^^^^^^^^^^^^^^^^^^^^^^ File "https://jenkins.osmocom.org/jenkins/job/master-pysim/JOB_TYPE=test,a1=default,a3=default,a4=default,label=simtester/ws/tests/pySim-shell_test/utils.py", line 143, in __search_card raise RuntimeError("missing card %s (atr:%s, eid:%s, iccid:%s), check test setup and configuration file (%s)" % RuntimeError: missing card sysmoISIM-SJA5-S17 (atr:3B9F96801F878031E073FE211B674A357530350265F8, eid:None, iccid:8949440000001155314), check test setup and configuration file (/tests/pySim-shell_test/config.yaml)
====================================================================== ERROR: test_record_sim (file_content.test.test_case.test_record_sim) ---------------------------------------------------------------------- Traceback (most recent call last): File "https://jenkins.osmocom.org/jenkins/job/master-pysim/JOB_TYPE=test,a1=default,a3=default,a4=default,label=simtester/ws/tests/pySim-shell_test/utils.py", line 201, in setUp reader = self.__search_card(name, atr, iccid, eid) ^^^^^^^^^^^^^^^^^^^^^^^^^^^^^^^^^^^^^^^^^ File "https://jenkins.osmocom.org/jenkins/job/master-pysim/JOB_TYPE=test,a1=default,a3=default,a4=default,label=simtester/ws/tests/pySim-shell_test/utils.py", line 143, in __search_card raise RuntimeError("missing card %s (atr:%s, eid:%s, iccid:%s), check test setup and configuration file (%s)" % RuntimeError: missing card sysmoISIM-SJA5-S17 (atr:3B9F96801F878031E073FE211B674A357530350265F8, eid:None, iccid:8949440000001155314), check test setup and configuration file (/tests/pySim-shell_test/config.yaml)
====================================================================== ERROR: test_record_uicc (file_content.test.test_case.test_record_uicc) ---------------------------------------------------------------------- Traceback (most recent call last): File "https://jenkins.osmocom.org/jenkins/job/master-pysim/JOB_TYPE=test,a1=default,a3=default,a4=default,label=simtester/ws/tests/pySim-shell_test/utils.py", line 201, in setUp reader = self.__search_card(name, atr, iccid, eid) ^^^^^^^^^^^^^^^^^^^^^^^^^^^^^^^^^^^^^^^^^ File "https://jenkins.osmocom.org/jenkins/job/master-pysim/JOB_TYPE=test,a1=default,a3=default,a4=default,label=simtester/ws/tests/pySim-shell_test/utils.py", line 143, in __search_card raise RuntimeError("missing card %s (atr:%s, eid:%s, iccid:%s), check test setup and configuration file (%s)" % RuntimeError: missing card sysmoISIM-SJA5-S17 (atr:3B9F96801F878031E073FE211B674A357530350265F8, eid:None, iccid:8949440000001155314), check test setup and configuration file (/tests/pySim-shell_test/config.yaml)
====================================================================== ERROR: test_ef_ist (file_specific.test.test_case.test_ef_ist) ---------------------------------------------------------------------- Traceback (most recent call last): File "https://jenkins.osmocom.org/jenkins/job/master-pysim/JOB_TYPE=test,a1=default,a3=default,a4=default,label=simtester/ws/tests/pySim-shell_test/utils.py", line 201, in setUp reader = self.__search_card(name, atr, iccid, eid) ^^^^^^^^^^^^^^^^^^^^^^^^^^^^^^^^^^^^^^^^^ File "https://jenkins.osmocom.org/jenkins/job/master-pysim/JOB_TYPE=test,a1=default,a3=default,a4=default,label=simtester/ws/tests/pySim-shell_test/utils.py", line 143, in __search_card raise RuntimeError("missing card %s (atr:%s, eid:%s, iccid:%s), check test setup and configuration file (%s)" % RuntimeError: missing card sysmoISIM-SJA5-S17 (atr:3B9F96801F878031E073FE211B674A357530350265F8, eid:None, iccid:8949440000001155314), check test setup and configuration file (/tests/pySim-shell_test/config.yaml)
====================================================================== ERROR: test_ef_ust (file_specific.test.test_case.test_ef_ust) ---------------------------------------------------------------------- Traceback (most recent call last): File "https://jenkins.osmocom.org/jenkins/job/master-pysim/JOB_TYPE=test,a1=default,a3=default,a4=default,label=simtester/ws/tests/pySim-shell_test/utils.py", line 201, in setUp reader = self.__search_card(name, atr, iccid, eid) ^^^^^^^^^^^^^^^^^^^^^^^^^^^^^^^^^^^^^^^^^ File "https://jenkins.osmocom.org/jenkins/job/master-pysim/JOB_TYPE=test,a1=default,a3=default,a4=default,label=simtester/ws/tests/pySim-shell_test/utils.py", line 143, in __search_card raise RuntimeError("missing card %s (atr:%s, eid:%s, iccid:%s), check test setup and configuration file (%s)" % RuntimeError: missing card sysmoISIM-SJA5-S17 (atr:3B9F96801F878031E073FE211B674A357530350265F8, eid:None, iccid:8949440000001155314), check test setup and configuration file (/tests/pySim-shell_test/config.yaml)
====================================================================== ERROR: test_update_imsi_plmn (file_specific.test.test_case.test_update_imsi_plmn) ---------------------------------------------------------------------- Traceback (most recent call last): File "https://jenkins.osmocom.org/jenkins/job/master-pysim/JOB_TYPE=test,a1=default,a3=default,a4=default,label=simtester/ws/tests/pySim-shell_test/utils.py", line 201, in setUp reader = self.__search_card(name, atr, iccid, eid) ^^^^^^^^^^^^^^^^^^^^^^^^^^^^^^^^^^^^^^^^^ File "https://jenkins.osmocom.org/jenkins/job/master-pysim/JOB_TYPE=test,a1=default,a3=default,a4=default,label=simtester/ws/tests/pySim-shell_test/utils.py", line 143, in __search_card raise RuntimeError("missing card %s (atr:%s, eid:%s, iccid:%s), check test setup and configuration file (%s)" % RuntimeError: missing card sysmoISIM-SJA5-S17 (atr:3B9F96801F878031E073FE211B674A357530350265F8, eid:None, iccid:8949440000001155314), check test setup and configuration file (/tests/pySim-shell_test/config.yaml)
====================================================================== ERROR: test (fsdump.test.test_case.test) ---------------------------------------------------------------------- Traceback (most recent call last): File "https://jenkins.osmocom.org/jenkins/job/master-pysim/JOB_TYPE=test,a1=default,a3=default,a4=default,label=simtester/ws/tests/pySim-shell_test/utils.py", line 201, in setUp reader = self.__search_card(name, atr, iccid, eid) ^^^^^^^^^^^^^^^^^^^^^^^^^^^^^^^^^^^^^^^^^ File "https://jenkins.osmocom.org/jenkins/job/master-pysim/JOB_TYPE=test,a1=default,a3=default,a4=default,label=simtester/ws/tests/pySim-shell_test/utils.py", line 143, in __search_card raise RuntimeError("missing card %s (atr:%s, eid:%s, iccid:%s), check test setup and configuration file (%s)" % RuntimeError: missing card sysmoISIM-SJA5-S17 (atr:3B9F96801F878031E073FE211B674A357530350265F8, eid:None, iccid:8949440000001155314), check test setup and configuration file (/tests/pySim-shell_test/config.yaml)
====================================================================== ERROR: test (get_identity.test.test_case.test) ---------------------------------------------------------------------- Traceback (most recent call last): File "https://jenkins.osmocom.org/jenkins/job/master-pysim/JOB_TYPE=test,a1=default,a3=default,a4=default,label=simtester/ws/tests/pySim-shell_test/utils.py", line 201, in setUp reader = self.__search_card(name, atr, iccid, eid) ^^^^^^^^^^^^^^^^^^^^^^^^^^^^^^^^^^^^^^^^^ File "https://jenkins.osmocom.org/jenkins/job/master-pysim/JOB_TYPE=test,a1=default,a3=default,a4=default,label=simtester/ws/tests/pySim-shell_test/utils.py", line 143, in __search_card raise RuntimeError("missing card %s (atr:%s, eid:%s, iccid:%s), check test setup and configuration file (%s)" % RuntimeError: missing card sysmoISIM-SJA5-S17 (atr:3B9F96801F878031E073FE211B674A357530350265F8, eid:None, iccid:8949440000001155314), check test setup and configuration file (/tests/pySim-shell_test/config.yaml)
====================================================================== ERROR: test_est_scp02_csv (gp.test.test_case.test_est_scp02_csv) ---------------------------------------------------------------------- Traceback (most recent call last): File "https://jenkins.osmocom.org/jenkins/job/master-pysim/JOB_TYPE=test,a1=default,a3=default,a4=default,label=simtester/ws/tests/pySim-shell_test/utils.py", line 201, in setUp reader = self.__search_card(name, atr, iccid, eid) ^^^^^^^^^^^^^^^^^^^^^^^^^^^^^^^^^^^^^^^^^ File "https://jenkins.osmocom.org/jenkins/job/master-pysim/JOB_TYPE=test,a1=default,a3=default,a4=default,label=simtester/ws/tests/pySim-shell_test/utils.py", line 143, in __search_card raise RuntimeError("missing card %s (atr:%s, eid:%s, iccid:%s), check test setup and configuration file (%s)" % RuntimeError: missing card sysmoISIM-SJA5-S17 (atr:3B9F96801F878031E073FE211B674A357530350265F8, eid:None, iccid:8949440000001155314), check test setup and configuration file (/tests/pySim-shell_test/config.yaml)
====================================================================== ERROR: test_est_scp02_direct (gp.test.test_case.test_est_scp02_direct) ---------------------------------------------------------------------- Traceback (most recent call last): File "https://jenkins.osmocom.org/jenkins/job/master-pysim/JOB_TYPE=test,a1=default,a3=default,a4=default,label=simtester/ws/tests/pySim-shell_test/utils.py", line 201, in setUp reader = self.__search_card(name, atr, iccid, eid) ^^^^^^^^^^^^^^^^^^^^^^^^^^^^^^^^^^^^^^^^^ File "https://jenkins.osmocom.org/jenkins/job/master-pysim/JOB_TYPE=test,a1=default,a3=default,a4=default,label=simtester/ws/tests/pySim-shell_test/utils.py", line 143, in __search_card raise RuntimeError("missing card %s (atr:%s, eid:%s, iccid:%s), check test setup and configuration file (%s)" % RuntimeError: missing card sysmoISIM-SJA5-S17 (atr:3B9F96801F878031E073FE211B674A357530350265F8, eid:None, iccid:8949440000001155314), check test setup and configuration file (/tests/pySim-shell_test/config.yaml)
====================================================================== ERROR: test_est_scp03_csv (gp.test.test_case.test_est_scp03_csv) ---------------------------------------------------------------------- Traceback (most recent call last): File "https://jenkins.osmocom.org/jenkins/job/master-pysim/JOB_TYPE=test,a1=default,a3=default,a4=default,label=simtester/ws/tests/pySim-shell_test/utils.py", line 201, in setUp reader = self.__search_card(name, atr, iccid, eid) ^^^^^^^^^^^^^^^^^^^^^^^^^^^^^^^^^^^^^^^^^ File "https://jenkins.osmocom.org/jenkins/job/master-pysim/JOB_TYPE=test,a1=default,a3=default,a4=default,label=simtester/ws/tests/pySim-shell_test/utils.py", line 143, in __search_card raise RuntimeError("missing card %s (atr:%s, eid:%s, iccid:%s), check test setup and configuration file (%s)" % RuntimeError: missing card sysmoISIM-SJA5-S17 (atr:3B9F96801F878031E073FE211B674A357530350265F8, eid:None, iccid:8949440000001155314), check test setup and configuration file (/tests/pySim-shell_test/config.yaml)
====================================================================== ERROR: test_est_scp03_direct (gp.test.test_case.test_est_scp03_direct) ---------------------------------------------------------------------- Traceback (most recent call last): File "https://jenkins.osmocom.org/jenkins/job/master-pysim/JOB_TYPE=test,a1=default,a3=default,a4=default,label=simtester/ws/tests/pySim-shell_test/utils.py", line 201, in setUp reader = self.__search_card(name, atr, iccid, eid) ^^^^^^^^^^^^^^^^^^^^^^^^^^^^^^^^^^^^^^^^^ File "https://jenkins.osmocom.org/jenkins/job/master-pysim/JOB_TYPE=test,a1=default,a3=default,a4=default,label=simtester/ws/tests/pySim-shell_test/utils.py", line 143, in __search_card raise RuntimeError("missing card %s (atr:%s, eid:%s, iccid:%s), check test setup and configuration file (%s)" % RuntimeError: missing card sysmoISIM-SJA5-S17 (atr:3B9F96801F878031E073FE211B674A357530350265F8, eid:None, iccid:8949440000001155314), check test setup and configuration file (/tests/pySim-shell_test/config.yaml)
====================================================================== ERROR: test_get_status (gp.test.test_case.test_get_status) ---------------------------------------------------------------------- Traceback (most recent call last): File "https://jenkins.osmocom.org/jenkins/job/master-pysim/JOB_TYPE=test,a1=default,a3=default,a4=default,label=simtester/ws/tests/pySim-shell_test/utils.py", line 201, in setUp reader = self.__search_card(name, atr, iccid, eid) ^^^^^^^^^^^^^^^^^^^^^^^^^^^^^^^^^^^^^^^^^ File "https://jenkins.osmocom.org/jenkins/job/master-pysim/JOB_TYPE=test,a1=default,a3=default,a4=default,label=simtester/ws/tests/pySim-shell_test/utils.py", line 143, in __search_card raise RuntimeError("missing card %s (atr:%s, eid:%s, iccid:%s), check test setup and configuration file (%s)" % RuntimeError: missing card sysmoISIM-SJA5-S17 (atr:3B9F96801F878031E073FE211B674A357530350265F8, eid:None, iccid:8949440000001155314), check test setup and configuration file (/tests/pySim-shell_test/config.yaml)
====================================================================== ERROR: test_put_delete_key (gp.test.test_case.test_put_delete_key) ---------------------------------------------------------------------- Traceback (most recent call last): File "https://jenkins.osmocom.org/jenkins/job/master-pysim/JOB_TYPE=test,a1=default,a3=default,a4=default,label=simtester/ws/tests/pySim-shell_test/utils.py", line 201, in setUp reader = self.__search_card(name, atr, iccid, eid) ^^^^^^^^^^^^^^^^^^^^^^^^^^^^^^^^^^^^^^^^^ File "https://jenkins.osmocom.org/jenkins/job/master-pysim/JOB_TYPE=test,a1=default,a3=default,a4=default,label=simtester/ws/tests/pySim-shell_test/utils.py", line 143, in __search_card raise RuntimeError("missing card %s (atr:%s, eid:%s, iccid:%s), check test setup and configuration file (%s)" % RuntimeError: missing card sysmoISIM-SJA5-S17 (atr:3B9F96801F878031E073FE211B674A357530350265F8, eid:None, iccid:8949440000001155314), check test setup and configuration file (/tests/pySim-shell_test/config.yaml)
====================================================================== ERROR: test (lchan.test.test_case.test) ---------------------------------------------------------------------- Traceback (most recent call last): File "https://jenkins.osmocom.org/jenkins/job/master-pysim/JOB_TYPE=test,a1=default,a3=default,a4=default,label=simtester/ws/tests/pySim-shell_test/utils.py", line 201, in setUp reader = self.__search_card(name, atr, iccid, eid) ^^^^^^^^^^^^^^^^^^^^^^^^^^^^^^^^^^^^^^^^^ File "https://jenkins.osmocom.org/jenkins/job/master-pysim/JOB_TYPE=test,a1=default,a3=default,a4=default,label=simtester/ws/tests/pySim-shell_test/utils.py", line 143, in __search_card raise RuntimeError("missing card %s (atr:%s, eid:%s, iccid:%s), check test setup and configuration file (%s)" % RuntimeError: missing card sysmoISIM-SJA5-S17 (atr:3B9F96801F878031E073FE211B674A357530350265F8, eid:None, iccid:8949440000001155314), check test setup and configuration file (/tests/pySim-shell_test/config.yaml)
====================================================================== ERROR: test_sim (navigate_fs.test.test_case.test_sim) ---------------------------------------------------------------------- Traceback (most recent call last): File "https://jenkins.osmocom.org/jenkins/job/master-pysim/JOB_TYPE=test,a1=default,a3=default,a4=default,label=simtester/ws/tests/pySim-shell_test/utils.py", line 201, in setUp reader = self.__search_card(name, atr, iccid, eid) ^^^^^^^^^^^^^^^^^^^^^^^^^^^^^^^^^^^^^^^^^ File "https://jenkins.osmocom.org/jenkins/job/master-pysim/JOB_TYPE=test,a1=default,a3=default,a4=default,label=simtester/ws/tests/pySim-shell_test/utils.py", line 143, in __search_card raise RuntimeError("missing card %s (atr:%s, eid:%s, iccid:%s), check test setup and configuration file (%s)" % RuntimeError: missing card sysmoISIM-SJA5-S17 (atr:3B9F96801F878031E073FE211B674A357530350265F8, eid:None, iccid:8949440000001155314), check test setup and configuration file (/tests/pySim-shell_test/config.yaml)
====================================================================== ERROR: test_uicc (navigate_fs.test.test_case.test_uicc) ---------------------------------------------------------------------- Traceback (most recent call last): File "https://jenkins.osmocom.org/jenkins/job/master-pysim/JOB_TYPE=test,a1=default,a3=default,a4=default,label=simtester/ws/tests/pySim-shell_test/utils.py", line 201, in setUp reader = self.__search_card(name, atr, iccid, eid) ^^^^^^^^^^^^^^^^^^^^^^^^^^^^^^^^^^^^^^^^^ File "https://jenkins.osmocom.org/jenkins/job/master-pysim/JOB_TYPE=test,a1=default,a3=default,a4=default,label=simtester/ws/tests/pySim-shell_test/utils.py", line 143, in __search_card raise RuntimeError("missing card %s (atr:%s, eid:%s, iccid:%s), check test setup and configuration file (%s)" % RuntimeError: missing card sysmoISIM-SJA5-S17 (atr:3B9F96801F878031E073FE211B674A357530350265F8, eid:None, iccid:8949440000001155314), check test setup and configuration file (/tests/pySim-shell_test/config.yaml)
====================================================================== ERROR: test (verify_adm.test.test_case.test) ---------------------------------------------------------------------- Traceback (most recent call last): File "https://jenkins.osmocom.org/jenkins/job/master-pysim/JOB_TYPE=test,a1=default,a3=default,a4=default,label=simtester/ws/tests/pySim-shell_test/utils.py", line 201, in setUp reader = self.__search_card(name, atr, iccid, eid) ^^^^^^^^^^^^^^^^^^^^^^^^^^^^^^^^^^^^^^^^^ File "https://jenkins.osmocom.org/jenkins/job/master-pysim/JOB_TYPE=test,a1=default,a3=default,a4=default,label=simtester/ws/tests/pySim-shell_test/utils.py", line 143, in __search_card raise RuntimeError("missing card %s (atr:%s, eid:%s, iccid:%s), check test setup and configuration file (%s)" % RuntimeError: missing card sysmoISIM-SJA5-S17 (atr:3B9F96801F878031E073FE211B674A357530350265F8, eid:None, iccid:8949440000001155314), check test setup and configuration file (/tests/pySim-shell_test/config.yaml)
====================================================================== FAIL: test (authenticate.test.test_case.test) ---------------------------------------------------------------------- Traceback (most recent call last): File "https://jenkins.osmocom.org/jenkins/job/master-pysim/JOB_TYPE=test,a1=default,a3=default,a4=default,label=simtester/ws/tests/pySim-shell_test/authenticate/test.py", line 31, in test self.assertEqualFiles("auth_result.tmp") File "https://jenkins.osmocom.org/jenkins/job/master-pysim/JOB_TYPE=test,a1=default,a3=default,a4=default,label=simtester/ws/tests/pySim-shell_test/utils.py", line 406, in assertEqualFiles self.assertEqual(ok_file_content, out_file_content, AssertionError: '{\n "successful_3g_authentication": {[179 chars]n}\n' != '' - { - "successful_3g_authentication": { - "res": "13484811d553ab35", - "ck": "0f93c4807f4ff57c6cd348fea590c06d", - "ik": "608e7bff4856c73e363e795b165a4158", - "kc": "35f08eda84d3b377" - } - } : File comparison: content auth_result.tmp does not match content of auth_result.ok -- test failed
---------------------------------------------------------------------- Ran 40 tests in 123.118s
FAILED (failures=1, errors=34) Build step 'Execute shell' marked build as failure $ ssh-agent -k unset SSH_AUTH_SOCK; unset SSH_AGENT_PID; echo Agent pid 28418 killed; [ssh-agent] Stopped. Archiving artifacts Not sending mail to unregistered user ewild@sysmocom.de