See https://jenkins.osmocom.org/jenkins/job/TTCN3-centos7-pcap-client-test/1138/display/redirect
Changes:
------------------------------------------ [...truncated 22.58 KiB...] #7 8.009 Running transaction #7 12.95 Preparing : 1/1 #7 12.98 Installing : osmocom-nightly-202501191809-1.1.x86_64 1/23 #7 13.12 Installing : libmnl-1.0.5-7.1.x86_64 2/23 #7 13.36 Installing : libosmocore22-1.10.0.60.cf0a5.202501191809-1.1.x86 3/23 #7 13.47 Running scriptlet: libosmocore22-1.10.0.60.cf0a5.202501191809-1.1.x86 3/23 #7 13.63 Installing : libosmoisdn0-1.10.0.60.cf0a5.202501191809-1.1.x86_ 4/23 #7 13.77 Running scriptlet: libosmoisdn0-1.10.0.60.cf0a5.202501191809-1.1.x86_ 4/23 #7 13.93 Installing : libosmogsm20-1.10.0.60.cf0a5.202501191809-1.1.x86_ 5/23 #7 14.06 Running scriptlet: libosmogsm20-1.10.0.60.cf0a5.202501191809-1.1.x86_ 5/23 #7 14.21 Installing : libosmovty13-1.10.0.60.cf0a5.202501191809-1.1.x86_ 6/23 #7 14.34 Running scriptlet: libosmovty13-1.10.0.60.cf0a5.202501191809-1.1.x86_ 6/23 #7 14.48 Installing : libunwind-2:1.2-2.el7.x86_64 7/23 #7 14.75 Running scriptlet: libunwind-2:1.2-2.el7.x86_64 7/23 #7 14.98 Installing : libsodium23-1.0.18-2.1.x86_64 8/23 #7 15.08 Running scriptlet: libsodium23-1.0.18-2.1.x86_64 8/23 #7 15.22 Installing : libpgm-5_2-0-5.2.122-3.1.x86_64 9/23 #7 15.36 Running scriptlet: libpgm-5_2-0-5.2.122-3.1.x86_64 9/23 #7 15.52 Installing : libzmq5-4.3.5-1.1.x86_64 10/23 #7 15.70 Running scriptlet: libzmq5-4.3.5-1.1.x86_64 10/23 #7 15.80 Installing : openpgm-devel-5.2.122-3.1.x86_64 11/23 #7 16.01 Installing : libsodium-devel-1.0.18-2.1.x86_64 12/23 #7 16.32 Installing : libunwind-devel-2:1.2-2.el7.x86_64 13/23 #7 16.53 Installing : libosmoctrl0-1.10.0.60.cf0a5.202501191809-1.1.x86_ 14/23 #7 16.69 Running scriptlet: libosmoctrl0-1.10.0.60.cf0a5.202501191809-1.1.x86_ 14/23 #7 16.85 Installing : libosmogb14-1.10.0.60.cf0a5.202501191809-1.1.x86_6 15/23 #7 16.98 Running scriptlet: libosmogb14-1.10.0.60.cf0a5.202501191809-1.1.x86_6 15/23 #7 17.11 Installing : libmnl-devel-1.0.5-7.1.x86_64 16/23 #7 17.58 Installing : libosmocore-devel-1.10.0.60.cf0a5.202501191809-1.1 17/23 #7 17.80 Installing : libosmoisdn-devel-1.10.0.60.cf0a5.202501191809-1.1 18/23 #7 18.08 Installing : libosmogsm-devel-1.10.0.60.cf0a5.202501191809-1.1. 19/23 #7 18.29 Installing : libosmovty-devel-1.10.0.60.cf0a5.202501191809-1.1. 20/23 #7 18.55 Installing : libosmogb-devel-1.10.0.60.cf0a5.202501191809-1.1.x 21/23 #7 18.79 Installing : libosmoctrl-devel-1.10.0.60.cf0a5.202501191809-1.1 22/23 #7 19.24 Installing : zeromq-devel-4.3.5-1.1.x86_64 23/23 #7 19.55 Verifying : libmnl-1.0.5-7.1.x86_64 1/23 #7 19.55 Verifying : libmnl-devel-1.0.5-7.1.x86_64 2/23 #7 19.55 Verifying : libosmocore-devel-1.10.0.60.cf0a5.202501191809-1.1 3/23 #7 19.55 Verifying : libosmocore22-1.10.0.60.cf0a5.202501191809-1.1.x86 4/23 #7 19.55 Verifying : libosmoctrl-devel-1.10.0.60.cf0a5.202501191809-1.1 5/23 #7 19.55 Verifying : libosmoctrl0-1.10.0.60.cf0a5.202501191809-1.1.x86_ 6/23 #7 19.55 Verifying : libosmogb-devel-1.10.0.60.cf0a5.202501191809-1.1.x 7/23 #7 19.55 Verifying : libosmogb14-1.10.0.60.cf0a5.202501191809-1.1.x86_6 8/23 #7 19.55 Verifying : libosmogsm-devel-1.10.0.60.cf0a5.202501191809-1.1. 9/23 #7 19.55 Verifying : libosmogsm20-1.10.0.60.cf0a5.202501191809-1.1.x86_ 10/23 #7 19.55 Verifying : libosmoisdn-devel-1.10.0.60.cf0a5.202501191809-1.1 11/23 #7 19.55 Verifying : libosmoisdn0-1.10.0.60.cf0a5.202501191809-1.1.x86_ 12/23 #7 19.55 Verifying : libosmovty-devel-1.10.0.60.cf0a5.202501191809-1.1. 13/23 #7 19.55 Verifying : libosmovty13-1.10.0.60.cf0a5.202501191809-1.1.x86_ 14/23 #7 19.55 Verifying : libpgm-5_2-0-5.2.122-3.1.x86_64 15/23 #7 19.55 Verifying : libsodium-devel-1.0.18-2.1.x86_64 16/23 #7 19.55 Verifying : libsodium23-1.0.18-2.1.x86_64 17/23 #7 19.55 Verifying : libzmq5-4.3.5-1.1.x86_64 18/23 #7 19.55 Verifying : openpgm-devel-5.2.122-3.1.x86_64 19/23 #7 19.55 Verifying : osmocom-nightly-202501191809-1.1.x86_64 20/23 #7 19.55 Verifying : zeromq-devel-4.3.5-1.1.x86_64 21/23 #7 19.55 Verifying : libunwind-2:1.2-2.el7.x86_64 22/23 #7 19.55 Verifying : libunwind-devel-2:1.2-2.el7.x86_64 23/23 #7 22.01 #7 22.01 Installed: #7 22.01 libosmocore-devel-1.10.0.60.cf0a5.202501191809-1.1.x86_64 #7 22.01 libosmoctrl-devel-1.10.0.60.cf0a5.202501191809-1.1.x86_64 #7 22.01 libosmogb-devel-1.10.0.60.cf0a5.202501191809-1.1.x86_64 #7 22.01 libosmogsm-devel-1.10.0.60.cf0a5.202501191809-1.1.x86_64 #7 22.01 libosmovty-devel-1.10.0.60.cf0a5.202501191809-1.1.x86_64 #7 22.01 zeromq-devel-4.3.5-1.1.x86_64 #7 22.01 libmnl-1.0.5-7.1.x86_64 #7 22.01 libmnl-devel-1.0.5-7.1.x86_64 #7 22.01 libosmocore22-1.10.0.60.cf0a5.202501191809-1.1.x86_64 #7 22.01 libosmoctrl0-1.10.0.60.cf0a5.202501191809-1.1.x86_64 #7 22.01 libosmogb14-1.10.0.60.cf0a5.202501191809-1.1.x86_64 #7 22.01 libosmogsm20-1.10.0.60.cf0a5.202501191809-1.1.x86_64 #7 22.01 libosmoisdn-devel-1.10.0.60.cf0a5.202501191809-1.1.x86_64 #7 22.01 libosmoisdn0-1.10.0.60.cf0a5.202501191809-1.1.x86_64 #7 22.01 libosmovty13-1.10.0.60.cf0a5.202501191809-1.1.x86_64 #7 22.01 libpgm-5_2-0-5.2.122-3.1.x86_64 #7 22.01 libsodium-devel-1.0.18-2.1.x86_64 #7 22.01 libsodium23-1.0.18-2.1.x86_64 #7 22.01 libzmq5-4.3.5-1.1.x86_64 #7 22.01 openpgm-devel-5.2.122-3.1.x86_64 #7 22.01 osmocom-nightly-202501191809-1.1.x86_64 #7 22.01 libunwind-2:1.2-2.el7.x86_64 #7 22.01 libunwind-devel-2:1.2-2.el7.x86_64 #7 22.01 #7 22.01 Complete! #7 DONE 26.6s
#8 [3/8] WORKDIR /TMP #8 DONE 0.6s
#9 [4/8] RUN GIT clone https://gerrit.osmocom.org/osmo-pcap.git #9 0.727 Cloning into 'osmo-pcap'... #9 DONE 1.2s
#10 [5/8] ADD HTTPS://GERRIT.OSMOCOM.ORG/PLUGINS/GITILES/OSMO-PCAP/+/MASTER?FORMAT=TEXT /tmp/commit-osmo-pcap #10 DONE 0.4s
#11 [6/8] RUN CD osmo-pcap && git fetch && git checkout master && (git symbolic-ref -q HEAD && git reset --hard origin/master || exit 1); git rev-parse --abbrev-ref HEAD && git rev-parse HEAD && autoreconf -fi && ./configure && make "-j$(nproc)" install #11 0.925 Already on 'master' #11 0.927 refs/heads/master #11 0.930 HEAD is now at f9eedab server: Correct error check calling osmo_pcap_conn_process_data() #11 0.932 master #11 0.933 f9eedab949e5fd7dcfba728c5d525a0f9d6c4f27 #11 6.374 libtoolize: putting auxiliary files in `.'. #11 6.374 libtoolize: copying file `./ltmain.sh' #11 6.537 libtoolize: Consider adding `AC_CONFIG_MACRO_DIR([m4])' to configure.ac and #11 6.537 libtoolize: rerunning libtoolize, to keep the correct libtool macros in-tree. #11 6.537 libtoolize: Consider adding `-I m4' to ACLOCAL_AMFLAGS in Makefile.am. #11 6.538 libtoolize: `AC_PROG_RANLIB' is rendered obsolete by `LT_INIT' #11 9.539 configure.ac:63: installing './config.guess' #11 9.540 configure.ac:63: installing './config.sub' #11 9.542 configure.ac:6: installing './install-sh' #11 9.543 configure.ac:6: installing './missing' #11 9.676 src/Makefile.am: installing './depcomp' #11 9.765 checking for a BSD-compatible install... /usr/bin/install -c #11 9.769 checking whether build environment is sane... yes #11 9.773 checking for a thread-safe mkdir -p... /usr/bin/mkdir -p #11 9.774 checking for gawk... gawk #11 9.774 checking whether make sets $(MAKE)... yes #11 9.779 checking whether make supports nested variables... yes #11 9.783 checking whether make supports nested variables... (cached) yes #11 9.783 checking whether make sets $(MAKE)... (cached) yes #11 9.784 checking for gcc... gcc #11 9.793 checking whether the C compiler works... yes #11 9.847 checking for C compiler default output file name... a.out #11 9.848 checking for suffix of executables... #11 9.917 checking whether we are cross compiling... no #11 9.936 checking for suffix of object files... o #11 9.946 checking whether we are using the GNU C compiler... yes #11 9.957 checking whether gcc accepts -g... yes #11 9.966 checking for gcc option to accept ISO C89... none needed #11 9.979 checking for style of include used by make... GNU #11 9.981 checking dependency style of gcc... gcc3 #11 9.999 checking for ranlib... ranlib #11 10.00 checking build system type... x86_64-unknown-linux-gnu #11 10.03 checking host system type... x86_64-unknown-linux-gnu #11 10.03 checking how to print strings... printf #11 10.03 checking for a sed that does not truncate output... /usr/bin/sed #11 10.03 checking for grep that handles long lines and -e... /usr/bin/grep #11 10.03 checking for egrep... /usr/bin/grep -E #11 10.03 checking for fgrep... /usr/bin/grep -F #11 10.03 checking for ld used by gcc... /usr/bin/ld #11 10.03 checking if the linker (/usr/bin/ld) is GNU ld... yes #11 10.04 checking for BSD- or MS-compatible name lister (nm)... /usr/bin/nm -B #11 10.04 checking the name lister (/usr/bin/nm -B) interface... BSD nm #11 10.05 checking whether ln -s works... yes #11 10.05 checking the maximum length of command line arguments... 1572864 #11 10.05 checking whether the shell understands some XSI constructs... yes #11 10.05 checking whether the shell understands "+="... yes #11 10.05 checking how to convert x86_64-unknown-linux-gnu file names to x86_64-unknown-linux-gnu format... func_convert_file_noop #11 10.05 checking how to convert x86_64-unknown-linux-gnu file names to toolchain format... func_convert_file_noop #11 10.05 checking for /usr/bin/ld option to reload object files... -r #11 10.05 checking for objdump... objdump #11 10.05 checking how to recognize dependent libraries... pass_all #11 10.05 checking for dlltool... no #11 10.05 checking how to associate runtime and link libraries... printf %s\n #11 10.06 checking for ar... ar #11 10.06 checking for archiver @FILE support... @ #11 10.07 checking for strip... strip #11 10.07 checking for ranlib... (cached) ranlib #11 10.07 checking command to parse /usr/bin/nm -B output from gcc object... ok #11 10.10 checking for sysroot... no #11 10.11 ./configure: line 6418: /usr/bin/file: No such file or directory #11 10.11 checking for mt... no #11 10.11 checking if : is a manifest tool... no #11 10.12 checking how to run the C preprocessor... gcc -E #11 10.14 checking for ANSI C header files... yes #11 10.20 checking for sys/types.h... yes #11 10.22 checking for sys/stat.h... yes #11 10.23 checking for stdlib.h... yes #11 10.25 checking for string.h... yes #11 10.26 checking for memory.h... yes #11 10.28 checking for strings.h... yes #11 10.30 checking for inttypes.h... yes #11 10.32 checking for stdint.h... yes #11 10.34 checking for unistd.h... yes #11 10.35 checking for dlfcn.h... yes #11 10.37 checking for objdir... .libs #11 10.45 checking if gcc supports -fno-rtti -fno-exceptions... no #11 10.48 checking for gcc option to produce PIC... -fPIC -DPIC #11 10.48 checking if gcc PIC flag -fPIC -DPIC works... yes #11 10.50 checking if gcc static flag -static works... no #11 10.52 checking if gcc supports -c -o file.o... yes #11 10.54 checking if gcc supports -c -o file.o... (cached) yes #11 10.54 checking whether the gcc linker (/usr/bin/ld) supports shared libraries... yes #11 10.54 checking whether -lc should be explicitly linked in... no #11 10.57 checking dynamic linker characteristics... GNU/Linux ld.so #11 10.60 checking how to hardcode library paths into programs... immediate #11 10.60 checking whether stripping libraries is possible... yes #11 10.61 checking if libtool supports shared libraries... yes #11 10.61 checking whether to build shared libraries... yes #11 10.61 checking whether to build static libraries... yes #11 10.61 checking for pkg-config... /usr/bin/pkg-config #11 10.61 checking for pkg-config... /usr/bin/pkg-config #11 10.61 checking pkg-config is at least version 0.20... yes #11 10.61 checking for ANSI C header files... (cached) yes #11 10.61 checking whether to enable VTY tests... no #11 10.61 checking for pcap-config... /usr/bin/pcap-config #11 10.61 checking for LIBOSMOCORE... yes #11 10.62 checking for LIBOSMOGB... yes #11 10.62 checking for LIBOSMOGSM... yes #11 10.63 checking for LIBOSMOVTY... yes #11 10.63 checking for LIBOSMONETIF... no #11 10.64 configure: error: Package requirements (libosmo-netif >= 1.5.0) were not met: #11 10.64 #11 10.64 No package 'libosmo-netif' found #11 10.64 #11 10.64 Consider adjusting the PKG_CONFIG_PATH environment variable if you #11 10.64 installed software in a non-standard prefix. #11 10.64 #11 10.64 Alternatively, you may set the environment variables LIBOSMONETIF_CFLAGS #11 10.64 and LIBOSMONETIF_LIBS to avoid the need to call pkg-config. #11 10.64 See the pkg-config man page for more details. #11 ERROR: process "/bin/sh -c cd osmo-pcap && \tgit fetch && git checkout $OSMO_PCAP_BRANCH && \t(git symbolic-ref -q HEAD && git reset --hard origin/$OSMO_PCAP_BRANCH || exit 1); \tgit rev-parse --abbrev-ref HEAD && git rev-parse HEAD && \tautoreconf -fi && \t./configure && \tmake "-j$(nproc)" install" did not complete successfully: exit code: 1 ------
[6/8] RUN CD osmo-pcap && git fetch && git checkout master && (git symbolic-ref -q HEAD && git reset --hard origin/master || exit 1); git rev-parse --abbrev-ref HEAD && git rev-parse HEAD && autoreconf -fi && ./configure && make "-j$(nproc)" install:
10.64 configure: error: Package requirements (libosmo-netif >= 1.5.0) were not met: 10.64 10.64 No package 'libosmo-netif' found 10.64 10.64 Consider adjusting the PKG_CONFIG_PATH environment variable if you 10.64 installed software in a non-standard prefix. 10.64 10.64 Alternatively, you may set the environment variables LIBOSMONETIF_CFLAGS 10.64 and LIBOSMONETIF_LIBS to avoid the need to call pkg-config. 10.64 See the pkg-config man page for more details. ------
[33m1 warning found (use docker --debug to expand): [0m - InvalidDefaultArgInFrom: Default value for ARG $USER/$DISTRO-build results in empty or invalid base image name (line 3) Dockerfile:34 -------------------- 33 | 34 | >>> RUN cd osmo-pcap && \ 35 | >>> git fetch && git checkout $OSMO_PCAP_BRANCH && \ 36 | >>> (git symbolic-ref -q HEAD && git reset --hard origin/$OSMO_PCAP_BRANCH || exit 1); \ 37 | >>> git rev-parse --abbrev-ref HEAD && git rev-parse HEAD && \ 38 | >>> autoreconf -fi && \ 39 | >>> ./configure && \ 40 | >>> make "-j$(nproc)" install 41 | -------------------- ERROR: failed to solve: process "/bin/sh -c cd osmo-pcap && \tgit fetch && git checkout $OSMO_PCAP_BRANCH && \t(git symbolic-ref -q HEAD && git reset --hard origin/$OSMO_PCAP_BRANCH || exit 1); \tgit rev-parse --abbrev-ref HEAD && git rev-parse HEAD && \tautoreconf -fi && \t./configure && \tmake "-j$(nproc)" install" did not complete successfully: exit code: 1 make: *** [../make/Makefile:95: docker-build] Error 1 make: Leaving directory 'https://jenkins.osmocom.org/jenkins/job/TTCN3-centos7-pcap-client-test/ws/osmo-pcap-master' + exit 1 Build step 'Execute shell' marked build as failure Recording test results ERROR: Step ‘Publish JUnit test result report’ failed: No test report files were found. Configuration error?