See https://jenkins.osmocom.org/jenkins/job/ttcn3-asterisk-ims-ue-test/559/display/redirect
Changes:
------------------------------------------ [...truncated 216.82 KiB...] #18 99.24 Installing file configs/samples/rtp.conf.sample #18 99.24 Installing file configs/samples/say.conf.sample #18 99.25 Installing file configs/samples/sip.conf.sample #18 99.25 Installing file configs/samples/sip_notify.conf.sample #18 99.25 Installing file configs/samples/skinny.conf.sample #18 99.25 Installing file configs/samples/sla.conf.sample #18 99.25 Installing file configs/samples/smdi.conf.sample #18 99.25 Installing file configs/samples/sorcery.conf.sample #18 99.25 Installing file configs/samples/ss7.timers.sample #18 99.25 Installing file configs/samples/stasis.conf.sample #18 99.25 Installing file configs/samples/statsd.conf.sample #18 99.25 Installing file configs/samples/stir_shaken.conf.sample #18 99.25 Installing file configs/samples/test_sorcery.conf.sample #18 99.25 Installing file configs/samples/udptl.conf.sample #18 99.26 Installing file configs/samples/unistim.conf.sample #18 99.26 Installing file configs/samples/users.conf.sample #18 99.26 Installing file configs/samples/voicemail.conf.sample #18 99.26 Installing file configs/samples/xmpp.conf.sample #18 99.26 Updating asterisk.conf #18 99.26 /usr/bin/install -c -d "/var/spool/asterisk/voicemail/default/1234/INBOX" #18 99.26 build_tools/make_sample_voicemail "//var/lib/asterisk" "//var/spool/asterisk" #18 99.28 Installing file phoneprov/000000000000-directory.xml #18 99.28 Installing file phoneprov/000000000000-phone.cfg #18 99.28 Installing file phoneprov/000000000000.cfg #18 99.28 Installing file phoneprov/polycom.xml #18 99.28 Installing file phoneprov/polycom_line.xml #18 99.29 Installing file phoneprov/snom-mac.xml #18 DONE 99.7s
#19 [14/15] RUN SETCAP 'cap_net_admin,cap_sys_resource=ep' /usr/sbin/asterisk #19 DONE 0.6s
#20 [15/15] RUN CD asterisk/codec_server && make "-j$(nproc)" && cp cserver /usr/bin/cserver #20 0.363 cc -O3 -ggdb -pthread cserver.c -o cserver #20 DONE 0.5s
#21 exporting to image #21 exporting layers #21 exporting layers 3.2s done #21 writing image sha256:4bb8c34028ab0b504c43db7093996c090f9aac2b886d8b15c93d043749047395 done #21 naming to docker.io/osmocom-build/asterisk-master:latest 0.0s done #21 DONE 3.3s
[33m1 warning found (use docker --debug to expand): [0m - InvalidDefaultArgInFrom: Default value for ARG $USER/$DISTRO-build results in empty or invalid base image name (line 4) rm -rf .common make: Leaving directory 'https://jenkins.osmocom.org/jenkins/job/ttcn3-asterisk-ims-ue-test/ws/asterisk-master' + docker_image_exists asterisk-master + docker images -q osmocom-build/asterisk-master + test -n 4bb8c34028ab + list_osmo_packages debian-bookworm asterisk-master + local distro=debian-bookworm + local image=asterisk-master + local docker_run_sh=docker run --rm --entrypoint=/bin/sh osmocom-build/asterisk-master -c + [ -n ] + return + [ registry.osmocom.org = registry.osmocom.org ] + docker_depends ttcn3-asterisk-ims-ue-test + local feed + echo debian-bookworm-titan + depends=debian-bookworm-titan + [ -n debian-bookworm-titan ] + docker_images_require debian-bookworm-titan + local i + local from_line + local pull_arg + local upstream_distro_arg + local distro_arg + local depends + local dir + [ registry.osmocom.org = registry.osmocom.org ] + docker pull registry.osmocom.org/osmocom-build/debian-bookworm-titan Using default tag: latest latest: Pulling from osmocom-build/debian-bookworm-titan Digest: sha256:2b3c045a0787e82aa55f625a5cc48bf746193e4e5c7dd90bb463d5995d0ba55a Status: Image is up to date for registry.osmocom.org/osmocom-build/debian-bookworm-titan:latest registry.osmocom.org/osmocom-build/debian-bookworm-titan:latest + continue + docker_distro_from_image_name ttcn3-asterisk-ims-ue-test + echo debian-bookworm + distro_arg=debian-bookworm + [ -z ] + docker_upstream_distro_from_image_name ttcn3-asterisk-ims-ue-test + echo debian:bookworm + upstream_distro_arg=debian:bookworm + docker_dir_from_image_name ttcn3-asterisk-ims-ue-test + echo ttcn3-asterisk-ims-ue-test + dir=ttcn3-asterisk-ims-ue-test + [ -z ] + pull_arg=--pull + grep ^FROM ../ttcn3-asterisk-ims-ue-test/Dockerfile + from_line=FROM $REGISTRY/$USER/debian-bookworm-titan + echo FROM $REGISTRY/$USER/debian-bookworm-titan + grep -q $USER + pull_arg= + set +x Building image: ttcn3-asterisk-ims-ue-test (export NO_DOCKER_IMAGE_BUILD=1 to prevent this) + docker_osmo_ttcn3_branch + [ -n ] + echo master + make -C ../ttcn3-asterisk-ims-ue-test BUILD_ARGS= UPSTREAM_DISTRO=debian:bookworm DISTRO=debian-bookworm IMAGE=osmocom-build/ttcn3-asterisk-ims-ue-test OSMO_TTCN3_BRANCH=master make: Entering directory 'https://jenkins.osmocom.org/jenkins/job/ttcn3-asterisk-ims-ue-test/ws/ttcn3-asterisk-ims-ue-test' awk: fatal: cannot open file `.release' for reading: No such file or directory awk: fatal: cannot open file `.release' for reading: No such file or directory awk: fatal: cannot open file `.release' for reading: No such file or directory rm -rf .common cp -r https://jenkins.osmocom.org/jenkins/job/ttcn3-asterisk-ims-ue-test/ws/common .common INFO: .release created release=0.0.0 docker build \ --build-arg USER=osmocom-build \ --build-arg UID=1000 \ --build-arg REGISTRY=registry.osmocom.org \ --build-arg OSMO_TTCN3_BRANCH=master \ --build-arg UPSTREAM_DISTRO=debian:bookworm \ --build-arg DISTRO=debian-bookworm \ --build-arg OSMOCOM_REPO_MIRROR=https://downloads.osmocom.org \ --build-arg OSMOCOM_REPO_PATH=packages/osmocom: \ --build-arg OSMOCOM_REPO_VERSION=latest \ --build-arg OSMOCOM_REPO_TESTSUITE_MIRROR=https://downloads.osmocom.org \ --build-arg ASTERISK_BRANCH=sysmocom/20.7.0 \ --build-arg LIBOSMOCORE_BRANCH=master \ --build-arg OSMO_BB_BRANCH=master \ --build-arg OSMO_BSC_BRANCH=master \ --build-arg OSMO_BTS_BRANCH=master \ --build-arg OSMO_CBC_BRANCH=master \ --build-arg OSMO_DIA2GSUP_BRANCH=master \ --build-arg OSMO_EPDG_BRANCH=master \ --build-arg OSMO_GBPROXY_BRANCH=master \ --build-arg OSMO_GGSN_BRANCH=master \ --build-arg OSMO_GSM_TESTER_BRANCH=master \ --build-arg OSMO_HLR_BRANCH=master \ --build-arg OSMO_HNBGW_BRANCH=master \ --build-arg OSMO_HNODEB_BRANCH=master \ --build-arg OSMO_IUH_BRANCH=master \ --build-arg OSMO_MGW_BRANCH=master \ --build-arg OSMO_MSC_BRANCH=master \ --build-arg OSMO_NITB_BRANCH=master \ --build-arg OSMO_PCU_BRANCH=master \ --build-arg OSMO_REMSIM_BRANCH=master \ --build-arg OSMO_S1GW_BRANCH=master \ --build-arg OSMO_SGSN_BRANCH=master \ --build-arg OSMO_SIP_BRANCH=master \ --build-arg OSMO_STP_BRANCH=master \ --build-arg OSMO_UECUPS_BRANCH=master \ --build-arg OPEN5GS_BRANCH=main \ --build-arg PJPROJECT_BRANCH=sysmocom/2.14 \ -t osmocom-build/ttcn3-asterisk-ims-ue-test:latest . #0 building with "default" instance using docker driver
#1 [internal] load build definition from Dockerfile #1 transferring dockerfile: 461B done #1 WARN: InvalidDefaultArgInFrom: Default value for ARG $REGISTRY/$USER/debian-bookworm-titan results in empty or invalid base image name (line 3) #1 DONE 0.1s
#2 [internal] load metadata for registry.osmocom.org/osmocom-build/debian-bookworm-titan:latest #2 DONE 0.0s
#3 [internal] load .dockerignore #3 transferring context: #3 transferring context: 2B done #3 DONE 0.1s
#4 [1/5] FROM registry.osmocom.org/osmocom-build/debian-bookworm-titan:latest #4 DONE 0.0s
#5 [2/5] ADD HTTPS://GERRIT.OSMOCOM.ORG/PLUGINS/GITILES/OSMO-TTCN3-HACKS/+/MASTER?FORMAT=TEXT /tmp/commit #5 DONE 0.1s
#6 [internal] load build context #6 transferring context: 2.21kB done #6 DONE 0.1s
#7 [2/5] ADD HTTPS://GERRIT.OSMOCOM.ORG/PLUGINS/GITILES/OSMO-TTCN3-HACKS/+/MASTER?FORMAT=TEXT /tmp/commit #7 CACHED
#8 [3/5] RUN TTCN3-DOCKER-PREPARE "master" asterisk #8 0.302 + OSMO_TTCN3_BRANCH=master #8 0.302 + shift #8 0.302 + cd /osmo-ttcn3-hacks #8 0.302 + git fetch #8 0.341 + git checkout master #8 0.377 Already on 'master' #8 0.377 Your branch is up to date with 'origin/master'. #8 0.377 + git symbolic-ref -q HEAD #8 0.377 refs/heads/master #8 0.377 + git reset --hard origin/master #8 0.380 HEAD is now at 589f2aac mme: Split ConnHdlr to its own file #8 0.381 + git rev-parse --abbrev-ref HEAD #8 0.381 master #8 0.381 + git rev-parse HEAD #8 0.382 589f2aacdd3dc4a1a08a2614c57ac349e00550ba #8 0.382 + diff -q /tmp/deps-Makefile deps/Makefile #8 0.382 Files /tmp/deps-Makefile and deps/Makefile differ #8 0.382 + make -j8 deps #8 0.457 make: Nothing to be done for 'deps'. #8 0.458 + ln -sv /osmo-ttcn3-hacks/ttcn3-dumpcap-start.sh /ttcn3-dumpcap-start.sh #8 0.460 '/ttcn3-dumpcap-start.sh' -> '/osmo-ttcn3-hacks/ttcn3-dumpcap-start.sh' #8 0.460 + ln -sv /osmo-ttcn3-hacks/ttcn3-tcpdump-start.sh /ttcn3-tcpdump-start.sh #8 0.461 '/ttcn3-tcpdump-start.sh' -> '/osmo-ttcn3-hacks/ttcn3-tcpdump-start.sh' #8 0.462 + ln -sv /osmo-ttcn3-hacks/ttcn3-dumpcap-stop.sh /ttcn3-dumpcap-stop.sh #8 0.463 '/ttcn3-dumpcap-stop.sh' -> '/osmo-ttcn3-hacks/ttcn3-dumpcap-stop.sh' #8 0.463 + ln -sv /osmo-ttcn3-hacks/ttcn3-tcpdump-stop.sh /ttcn3-tcpdump-stop.sh #8 0.464 '/ttcn3-tcpdump-stop.sh' -> '/osmo-ttcn3-hacks/ttcn3-tcpdump-stop.sh' #8 0.465 + ln -sv /osmo-ttcn3-hacks/_scripts /_scripts #8 0.466 '/_scripts' -> '/osmo-ttcn3-hacks/_scripts' #8 0.466 + make asterisk #8 0.581 (cd asterisk && ./gen_links.sh && ./regen_makefile.sh) #8 0.627 ttcn3_makefilegen: error: Cannot find any source file for argument `PIPEasp_Templates.ttcn'. #8 0.631 ttcn3_makefilegen: warning: TTCN-3 preprocessing (option `-p') is enabled, but no TTCN-3 files to be preprocessed were given for the Makefile. #8 0.632 make: *** [Makefile:131: _build/asterisk/Makefile] Error 1 #8 ERROR: process "/bin/sh -c ttcn3-docker-prepare "$OSMO_TTCN3_BRANCH" asterisk" did not complete successfully: exit code: 2 ------
[3/5] RUN TTCN3-DOCKER-PREPARE "master" asterisk:
0.463 '/ttcn3-dumpcap-stop.sh' -> '/osmo-ttcn3-hacks/ttcn3-dumpcap-stop.sh' 0.463 + ln -sv /osmo-ttcn3-hacks/ttcn3-tcpdump-stop.sh /ttcn3-tcpdump-stop.sh 0.464 '/ttcn3-tcpdump-stop.sh' -> '/osmo-ttcn3-hacks/ttcn3-tcpdump-stop.sh' 0.465 + ln -sv /osmo-ttcn3-hacks/_scripts /_scripts 0.466 '/_scripts' -> '/osmo-ttcn3-hacks/_scripts' 0.466 + make asterisk 0.581 (cd asterisk && ./gen_links.sh && ./regen_makefile.sh) 0.627 ttcn3_makefilegen: error: Cannot find any source file for argument `PIPEasp_Templates.ttcn'. 0.631 ttcn3_makefilegen: warning: TTCN-3 preprocessing (option `-p') is enabled, but no TTCN-3 files to be preprocessed were given for the Makefile. 0.632 make: *** [Makefile:131: _build/asterisk/Makefile] Error 1 ------
[33m2 warnings found (use docker --debug to expand): [0m - InvalidDefaultArgInFrom: Default value for ARG $REGISTRY/$USER/debian-bookworm-titan results in empty or invalid base image name (line 3) - JSONArgsRecommended: JSON arguments recommended for CMD to prevent unintended behavior related to OS signals (line 14) Dockerfile:7 -------------------- 5 | 6 | ADD https://gerrit.osmocom.org/plugins/gitiles/osmo-ttcn3-hacks/+/$OSMO_TTCN3_BR... /tmp/commit 7 | >>> RUN ttcn3-docker-prepare "$OSMO_TTCN3_BRANCH" asterisk 8 | 9 | VOLUME /data -------------------- ERROR: failed to solve: process "/bin/sh -c ttcn3-docker-prepare "$OSMO_TTCN3_BRANCH" asterisk" did not complete successfully: exit code: 2 make: *** [../make/Makefile:96: docker-build] Error 1 make: Leaving directory 'https://jenkins.osmocom.org/jenkins/job/ttcn3-asterisk-ims-ue-test/ws/ttcn3-asterisk-ims-ue-test' + exit 1 + RC=1 + uptime + grep --color=always -o load.* [01;31m[Kload average: 4.81, 2.83, 2.11[m[K + exit 1 Build step 'Execute shell' marked build as failure Recording test results ERROR: Step ‘Publish JUnit test result report’ failed: No test report files were found. Configuration error?