Changes:
------------------------------------------ [...truncated 832.20 KB...] vlr-name vlr.example.net smsc queue max-pending 20 queue max-failure 1 database delete-delivered 1 database delete-expired 1 validity-period minimum 1 validity-period default 10080
State Recv-Q Send-Q Local Address:Port Peer Address:Port
ss -tln
State Recv-Q Send-Q Local Address:Port Peer Address:Port
ps xua | grep osmo
build 221710 1.1 0.0 27968 21512 ? S 14:31 0:00 /usr/bin/python3 /usr/local/bin/osmotestconfig.py -p /build -w /build -v build 221777 0.0 0.0 21474938900 30736 ? R 14:31 0:00 src/osmo-msc/osmo-msc -c /build/doc/examples/osmo-msc/osmo-msc_multi-cs7.cfg build 221784 0.0 0.0 2388 760 ? S 14:31 0:00 /bin/sh -c ps xua | grep osmo build 221786 0.0 0.0 6076 892 ? S 14:31 0:00 grep osmo
Connecting socket failed, retrying... Socket: in 2 tries, connected to 127.0.0.1:4254 <socket.socket fd=5, family=AddressFamily.AF_INET, type=SocketKind.SOCK_STREAM, proto=0, laddr=('127.0.0.1', 57788), raddr=('127.0.0.1', 4254)> (1 sockets open) Terminating took 0.897s Socket: closing 127.0.0.1:4254 <socket.socket fd=5, family=AddressFamily.AF_INET, type=SocketKind.SOCK_STREAM, proto=0, laddr=('127.0.0.1', 57788), raddr=('127.0.0.1', 4254)> (0 sockets open) Verifying src/osmo-msc/osmo-msc -c /build/writtenconfig/osmo-msc_multi-cs7.cfg68dunye0, test write_config Launching: PWD=/build 'src/osmo-msc/osmo-msc' '-c' '/build/writtenconfig/osmo-msc_multi-cs7.cfg68dunye0'
ls -l /proc/221710/fd
total 0 lr-x------ 1 build build 64 Oct 19 14:31 0 -> pipe:[29006181] l-wx------ 1 build build 64 Oct 19 14:31 1 -> pipe:[29006182] l-wx------ 1 build build 64 Oct 19 14:31 2 -> pipe:[29006183] l-wx------ 1 build build 64 Oct 19 14:31 3 -> /dev/null
ss -tn
State Recv-Q Send-Q Local Address:Port Peer Address:Port
ss -tln
State Recv-Q Send-Q Local Address:Port Peer Address:Port
ps xua | grep osmo
build 221710 1.2 0.0 27516 21104 ? S 14:31 0:00 /usr/bin/python3 /usr/local/bin/osmotestconfig.py -p /build -w /build -v build 221788 0.0 0.0 21474938900 30732 ? R 14:31 0:00 src/osmo-msc/osmo-msc -c /build/writtenconfig/osmo-msc_multi-cs7.cfg68dunye0 build 221795 0.0 0.0 2388 764 ? S 14:31 0:00 /bin/sh -c ps xua | grep osmo build 221797 0.0 0.0 6076 828 ? S 14:31 0:00 grep osmo
Connecting socket failed, retrying... Socket: in 2 tries, connected to 127.0.0.1:4254 <socket.socket fd=5, family=AddressFamily.AF_INET, type=SocketKind.SOCK_STREAM, proto=0, laddr=('127.0.0.1', 57806), raddr=('127.0.0.1', 4254)> (1 sockets open) Terminating took 0.475s Socket: closing 127.0.0.1:4254 <socket.socket fd=5, family=AddressFamily.AF_INET, type=SocketKind.SOCK_STREAM, proto=0, laddr=('127.0.0.1', 57806), raddr=('127.0.0.1', 4254)> (0 sockets open) Verifying src/osmo-msc/osmo-msc -c /build/writtenconfig/osmo-msc_multi-cs7.cfg68dunye0, test token_vty_command Launching: PWD=/build 'src/osmo-msc/osmo-msc' '-c' '/build/writtenconfig/osmo-msc_multi-cs7.cfg68dunye0'
ls -l /proc/221710/fd
total 0 lr-x------ 1 build build 64 Oct 19 14:31 0 -> pipe:[29006181] l-wx------ 1 build build 64 Oct 19 14:31 1 -> pipe:[29006182] l-wx------ 1 build build 64 Oct 19 14:31 2 -> pipe:[29006183] l-wx------ 1 build build 64 Oct 19 14:31 3 -> /dev/null
ss -tn
State Recv-Q Send-Q Local Address:Port Peer Address:Port
ss -tln
State Recv-Q Send-Q Local Address:Port Peer Address:Port
ps xua | grep osmo
build 221710 1.1 0.0 27516 21104 ? S 14:31 0:00 /usr/bin/python3 /usr/local/bin/osmotestconfig.py -p /build -w /build -v build 221799 1.0 0.0 21474938548 25588 ? R 14:31 0:00 src/osmo-msc/osmo-msc -c /build/writtenconfig/osmo-msc_multi-cs7.cfg68dunye0 build 221806 0.0 0.0 2388 764 ? S 14:31 0:00 /bin/sh -c ps xua | grep osmo build 221808 0.0 0.0 6076 888 ? S 14:31 0:00 grep osmo
Connecting socket failed, retrying... Connecting socket failed, retrying... Connecting socket failed, retrying... Connecting socket failed, retrying... Connecting socket failed, retrying... Connecting socket failed, retrying... Connecting socket failed, retrying... Connecting socket failed, retrying... Connecting socket failed, retrying... Connecting socket failed, retrying... Connecting socket failed, retrying... Connecting socket failed, retrying... Connecting socket failed, retrying... Connecting socket failed, retrying... Connecting socket failed, retrying... Connecting socket failed, retrying... Connecting socket failed, retrying... Connecting socket failed, retrying... Connecting socket failed, retrying... Connecting socket failed, retrying... Connecting socket failed, retrying... Connecting socket failed, retrying... Connecting socket failed, retrying... Connecting socket failed, retrying... Connecting socket failed, retrying... Connecting socket failed, retrying... Connecting socket failed, retrying... Connecting socket failed, retrying... Connecting socket failed, retrying... Socket: closing 127.0.0.1:4254 <socket.socket fd=5, family=AddressFamily.AF_INET, type=SocketKind.SOCK_STREAM, proto=0, laddr=('0.0.0.0', 58136)> (0 sockets open) Failed to verify src/osmo-msc/osmo-msc -c /build/writtenconfig/osmo-msc_multi-cs7.cfg68dunye0 Current directory: /build Error was [Errno 111] Connection refused Config was ! ! OsmoMSC (1.9.0.27-9683) configuration saved from vty !! ! log stderr blocking-io logging filter all 1 logging color 1 logging print category-hex 1 logging print category 0 logging print thread-id 0 logging timestamp 0 logging print file 1 logging level rll notice logging level cc notice logging level mm notice logging level rr notice logging level mncc notice logging level pag notice logging level msc notice logging level mgcp notice logging level ho notice logging level db notice logging level ref notice logging level ctrl notice logging level smpp notice logging level ranap notice logging level vlr notice logging level iucs notice logging level bssap notice logging level sgs notice logging level ss notice logging level lglobal notice logging level llapd notice logging level linp notice logging level lmux notice logging level lmi notice logging level lmib notice logging level lsms notice logging level lctrl notice logging level lgtp notice logging level lstats notice logging level lgsup notice logging level loap notice logging level lss7 notice logging level lsccp notice logging level lsua notice logging level lm3ua notice logging level lmgcp notice logging level ljibuf notice logging level lrspro notice logging level lns notice logging level lbssgp notice logging level lnsdata notice logging level lnssignal notice logging level liuup notice logging level lpfcp notice logging level lcsn1 notice ! stats interval 5 ! line vty no login ! cs7 instance 0 point-code 0.23.1 asp asp-clnt-OsmoMSC-A 2905 0 m3ua local-ip 0.0.0.0 remote-ip 127.0.0.5 sctp-role client cs7 instance 1 point-code 0.23.2 asp asp-clnt-OsmoMSC-Iu 2905 0 m3ua local-ip 0.0.0.0 remote-ip 127.0.0.6 sctp-role client network network country code 001 mobile network code 01 short name OsmoMSC long name OsmoMSC encryption a5 0 encryption uea 1 2 authentication optional rrlp mode none mm info 1 msc mncc guard-timeout 180 ncss guard-timeout 30 assign-tmsi cs7-instance-a 0 cs7-instance-iu 1 local-port 2728 remote-ip 127.0.0.1 remote-port 2427 mncc-int default-codec tch-f fr default-codec tch-h hr smpp local-tcp-port 2775 policy closed no smpp-first hlr remote-ip 127.0.0.1 remote-port 4222 sgs local-port 29118 local-ip 0.0.0.0 vlr-name vlr.example.net smsc queue max-pending 20 queue max-failure 1 database delete-delivered 1 database delete-expired 1 validity-period minimum 1 validity-period default 10080
ERRORS: 3 make[7]: *** [Makefile:724: vty-python-test] Error 3 make[7]: Leaving directory '/build/tests' make[6]: Leaving directory '/build/tests' make[6]: *** [Makefile:745: vty-test] Error 2 make[5]: Leaving directory '/build/tests' make[5]: *** [Makefile:715: python-tests] Error 2 make[4]: *** [Makefile:769: check-local] Error 2 make[4]: Leaving directory '/build/tests' make[3]: *** [Makefile:574: check-am] Error 2 make[3]: Leaving directory '/build/tests' make[2]: *** [Makefile:423: check-recursive] Error 1 make[2]: Leaving directory '/build/tests' make[1]: *** [Makefile:471: check-recursive] Error 1 make[1]: Leaving directory '/build' make: *** [Makefile:765: check] Error 2 + cat-testlogs.sh Build step 'Execute shell' marked build as failure Archiving artifacts