Changes:
------------------------------------------ [...truncated 412.58 KB...] <param name='[stats]' doc='(null)' />
ss -tn
State Recv-Q Send-Q Local Address:Port Peer Address:Port
ss -tln
State Recv-Q Send-Q Local Address:Port Peer Address:Port
ps xua | grep osmo
build 12134 2.3 0.0 54012 20916 ? S 00:55 0:00 /usr/bin/python3 /usr/local/bin/osmotestconfig.py -p /build -w /build -v build 12179 0.0 0.0 21474964008 26424 ? S 00:55 0:00 src/gbproxy/osmo-gbproxy -c /build/writtenconfig/osmo-gbproxy-legacy.cfghtbu0udd build 12186 0.0 0.0 4280 704 ? S 00:55 0:00 /bin/sh -c ps xua | grep osmo build 12188 0.0 0.0 12784 988 ? S 00:55 0:00 grep osmo
Socket: in 1 tries, connected to 127.0.0.1:4246 <socket.socket fd=4, family=AddressFamily.AF_INET, type=SocketKind.SOCK_STREAM, proto=0, laddr=('127.0.0.1', 47950), raddr=('127.0.0.1', 4246)> (1 sockets open) Terminating took 0.897s Socket: closing 127.0.0.1:4246 <socket.socket fd=4, family=AddressFamily.AF_INET, type=SocketKind.SOCK_STREAM, proto=0, laddr=('127.0.0.1', 47950), raddr=('127.0.0.1', 4246)> (0 sockets open) Verifying src/gbproxy/osmo-gbproxy -c /build/writtenconfig/osmo-gbproxy-legacy.cfghtbu0udd, test token_vty_command Launching: PWD=/build 'src/gbproxy/osmo-gbproxy' '-c' '/build/writtenconfig/osmo-gbproxy-legacy.cfghtbu0udd'
ls -l /proc/12134/fd
total 0 lr-x------ 1 build build 64 Dec 2 00:55 0 -> pipe:[4605999] l-wx------ 1 build build 64 Dec 2 00:55 1 -> pipe:[4606000] l-wx------ 1 build build 64 Dec 2 00:55 2 -> pipe:[4606001] l-wx------ 1 build build 64 Dec 2 00:55 3 -> /dev/null
ss -tn
State Recv-Q Send-Q Local Address:Port Peer Address:Port
ss -tln
State Recv-Q Send-Q Local Address:Port Peer Address:Port
ps xua | grep osmo
build 12134 1.6 0.0 54012 20916 ? S 00:55 0:00 /usr/bin/python3 /usr/local/bin/osmotestconfig.py -p /build -w /build -v build 12190 0.0 0.0 21474964008 27804 ? S 00:55 0:00 src/gbproxy/osmo-gbproxy -c /build/writtenconfig/osmo-gbproxy-legacy.cfghtbu0udd build 12197 0.0 0.0 4280 700 ? S 00:55 0:00 /bin/sh -c ps xua | grep osmo build 12199 0.0 0.0 12784 956 ? S 00:55 0:00 grep osmo
Socket: in 1 tries, connected to 127.0.0.1:4246 <socket.socket fd=4, family=AddressFamily.AF_INET, type=SocketKind.SOCK_STREAM, proto=0, laddr=('127.0.0.1', 47952), raddr=('127.0.0.1', 4246)> (1 sockets open) Terminating took 0.897s Socket: closing 127.0.0.1:4246 <socket.socket fd=4, family=AddressFamily.AF_INET, type=SocketKind.SOCK_STREAM, proto=0, laddr=('127.0.0.1', 47952), raddr=('127.0.0.1', 4246)> (0 sockets open) Verifying src/sgsn/osmo-sgsn -c /build/doc/examples/osmo-sgsn/osmo-sgsn.cfg, test verify_doc Launching: PWD=/build 'src/sgsn/osmo-sgsn' '-c' '/build/doc/examples/osmo-sgsn/osmo-sgsn.cfg'
ls -l /proc/12134/fd
total 0 lr-x------ 1 build build 64 Dec 2 00:55 0 -> pipe:[4605999] l-wx------ 1 build build 64 Dec 2 00:55 1 -> pipe:[4606000] l-wx------ 1 build build 64 Dec 2 00:55 2 -> pipe:[4606001] l-wx------ 1 build build 64 Dec 2 00:55 3 -> /dev/null
ss -tn
State Recv-Q Send-Q Local Address:Port Peer Address:Port
ss -tln
State Recv-Q Send-Q Local Address:Port Peer Address:Port
ps xua | grep osmo
build 12134 1.6 0.0 54012 20916 ? S 00:55 0:00 /usr/bin/python3 /usr/local/bin/osmotestconfig.py -p /build -w /build -v build 12201 0.0 0.1 21475042824 37292 ? R 00:55 0:00 src/sgsn/osmo-sgsn -c /build/doc/examples/osmo-sgsn/osmo-sgsn.cfg build 12208 0.0 0.0 4280 740 ? S 00:55 0:00 /bin/sh -c ps xua | grep osmo build 12210 0.0 0.0 12784 976 ? S 00:55 0:00 grep osmo
Socket: in 1 tries, connected to 127.0.0.1:4245 <socket.socket fd=4, family=AddressFamily.AF_INET, type=SocketKind.SOCK_STREAM, proto=0, laddr=('127.0.0.1', 41526), raddr=('127.0.0.1', 4245)> (1 sockets open) Terminating took 0.897s Socket: closing 127.0.0.1:4245 <socket.socket fd=4, family=AddressFamily.AF_INET, type=SocketKind.SOCK_STREAM, proto=0, laddr=('127.0.0.1', 41526), raddr=('127.0.0.1', 4245)> (0 sockets open) Verifying src/sgsn/osmo-sgsn -c /build/writtenconfig/osmo-sgsn.cfge6rbwjlr, test write_config Launching: PWD=/build 'src/sgsn/osmo-sgsn' '-c' '/build/writtenconfig/osmo-sgsn.cfge6rbwjlr'
ls -l /proc/12134/fd
total 0 lr-x------ 1 build build 64 Dec 2 00:55 0 -> pipe:[4605999] l-wx------ 1 build build 64 Dec 2 00:55 1 -> pipe:[4606000] l-wx------ 1 build build 64 Dec 2 00:55 2 -> pipe:[4606001] l-wx------ 1 build build 64 Dec 2 00:55 3 -> /dev/null
ss -tn
State Recv-Q Send-Q Local Address:Port Peer Address:Port
ss -tln
State Recv-Q Send-Q Local Address:Port Peer Address:Port
ps xua | grep osmo
build 12134 1.4 0.0 54012 20988 ? S 00:55 0:00 /usr/bin/python3 /usr/local/bin/osmotestconfig.py -p /build -w /build -v build 12212 0.0 0.0 21474972416 25280 ? R 00:55 0:00 src/sgsn/osmo-sgsn -c /build/writtenconfig/osmo-sgsn.cfge6rbwjlr build 12219 0.0 0.0 4280 716 ? S 00:55 0:00 /bin/sh -c ps xua | grep osmo build 12221 0.0 0.0 12784 924 ? S 00:55 0:00 grep osmo
Connecting socket failed, retrying... Socket: in 2 tries, connected to 127.0.0.1:4245 <socket.socket fd=5, family=AddressFamily.AF_INET, type=SocketKind.SOCK_STREAM, proto=0, laddr=('127.0.0.1', 41532), raddr=('127.0.0.1', 4245)> (1 sockets open) Terminating took 0.897s Socket: closing 127.0.0.1:4245 <socket.socket fd=5, family=AddressFamily.AF_INET, type=SocketKind.SOCK_STREAM, proto=0, laddr=('127.0.0.1', 41532), raddr=('127.0.0.1', 4245)> (0 sockets open) Verifying src/sgsn/osmo-sgsn -c /build/writtenconfig/osmo-sgsn.cfge6rbwjlr, test token_vty_command Launching: PWD=/build 'src/sgsn/osmo-sgsn' '-c' '/build/writtenconfig/osmo-sgsn.cfge6rbwjlr'
ls -l /proc/12134/fd
total 0 lr-x------ 1 build build 64 Dec 2 00:55 0 -> pipe:[4605999] l-wx------ 1 build build 64 Dec 2 00:55 1 -> pipe:[4606000] l-wx------ 1 build build 64 Dec 2 00:55 2 -> pipe:[4606001] l-wx------ 1 build build 64 Dec 2 00:55 3 -> /dev/null
ss -tn
State Recv-Q Send-Q Local Address:Port Peer Address:Port
ss -tln
State Recv-Q Send-Q Local Address:Port Peer Address:Port LISTEN 0 10 127.0.0.1:4251 *:* LISTEN 0 10 127.0.0.1:4245 *:*
ps xua | grep osmo
build 12134 1.2 0.0 54012 21052 ? S 00:55 0:00 /usr/bin/python3 /usr/local/bin/osmotestconfig.py -p /build -w /build -v build 12223 0.0 0.0 21475109004 31700 ? S 00:55 0:00 src/sgsn/osmo-sgsn -c /build/writtenconfig/osmo-sgsn.cfge6rbwjlr build 12230 0.0 0.0 4280 736 ? S 00:55 0:00 /bin/sh -c ps xua | grep osmo build 12232 0.0 0.0 12784 944 ? S 00:55 0:00 grep osmo
Socket: in 1 tries, connected to 127.0.0.1:4245 <socket.socket fd=4, family=AddressFamily.AF_INET, type=SocketKind.SOCK_STREAM, proto=0, laddr=('127.0.0.1', 41534), raddr=('127.0.0.1', 4245)> (1 sockets open) Terminating took 0.897s Socket: closing 127.0.0.1:4245 <socket.socket fd=4, family=AddressFamily.AF_INET, type=SocketKind.SOCK_STREAM, proto=0, laddr=('127.0.0.1', 41534), raddr=('127.0.0.1', 4245)> (0 sockets open) Verifying src/gtphub/osmo-gtphub -c /build/doc/examples/osmo-gtphub/osmo-gtphub-1iface.cfg, test verify_doc Launching: PWD=/build 'src/gtphub/osmo-gtphub' '-c' '/build/doc/examples/osmo-gtphub/osmo-gtphub-1iface.cfg'
ls -l /proc/12134/fd
total 0 lr-x------ 1 build build 64 Dec 2 00:55 0 -> pipe:[4605999] l-wx------ 1 build build 64 Dec 2 00:55 1 -> pipe:[4606000] l-wx------ 1 build build 64 Dec 2 00:55 2 -> pipe:[4606001] l-wx------ 1 build build 64 Dec 2 00:55 3 -> /dev/null
ss -tn
State Recv-Q Send-Q Local Address:Port Peer Address:Port
ss -tln
State Recv-Q Send-Q Local Address:Port Peer Address:Port LISTEN 0 10 127.0.0.1:4253 *:*
ps xua | grep osmo
build 12134 1.1 0.0 54012 21052 ? S 00:55 0:00 /usr/bin/python3 /usr/local/bin/osmotestconfig.py -p /build -w /build -v build 12234 0.0 0.0 21474961572 24612 ? S 00:55 0:00 src/gtphub/osmo-gtphub -c /build/doc/examples/osmo-gtphub/osmo-gtphub-1iface.cfg build 12241 0.0 0.0 4280 712 ? S 00:55 0:00 /bin/sh -c ps xua | grep osmo build 12243 0.0 0.0 12784 1012 ? S 00:55 0:00 grep osmo
Socket: in 1 tries, connected to 127.0.0.1:4253 <socket.socket fd=4, family=AddressFamily.AF_INET, type=SocketKind.SOCK_STREAM, proto=0, laddr=('127.0.0.1', 60684), raddr=('127.0.0.1', 4253)> (1 sockets open) Terminating took 0.897s Socket: closing 127.0.0.1:4253 <socket.socket fd=4, family=AddressFamily.AF_INET, type=SocketKind.SOCK_STREAM, proto=0, laddr=('127.0.0.1', 60684), raddr=('127.0.0.1', 4253)> (0 sockets open) Verifying src/gtphub/osmo-gtphub -c /build/writtenconfig/osmo-gtphub-1iface.cfgzlepwosk, test write_config Launching: PWD=/build 'src/gtphub/osmo-gtphub' '-c' '/build/writtenconfig/osmo-gtphub-1iface.cfgzlepwosk'
ls -l /proc/12134/fd
total 0 lr-x------ 1 build build 64 Dec 2 00:55 0 -> pipe:[4605999] l-wx------ 1 build build 64 Dec 2 00:55 1 -> pipe:[4606000] l-wx------ 1 build build 64 Dec 2 00:55 2 -> pipe:[4606001] l-wx------ 1 build build 64 Dec 2 00:55 3 -> /dev/null
ss -tn
State Recv-Q Send-Q Local Address:Port Peer Address:Port
ss -tln
State Recv-Q Send-Q Local Address:Port Peer Address:Port
ps xua | grep osmo
build 12134 1.0 0.0 54012 21052 ? S 00:55 0:00 /usr/bin/python3 /usr/local/bin/osmotestconfig.py -p /build -w /build -v build 12245 0.0 0.0 21474961572 26132 ? S 00:55 0:00 src/gtphub/osmo-gtphub -c /build/writtenconfig/osmo-gtphub-1iface.cfgzlepwosk build 12252 0.0 0.0 4280 748 ? S 00:55 0:00 /bin/sh -c ps xua | grep osmo build 12254 0.0 0.0 4280 84 ? R 00:55 0:00 /bin/sh -c ps xua | grep osmo
Socket: in 1 tries, connected to 127.0.0.1:4253 <socket.socket fd=4, family=AddressFamily.AF_INET, type=SocketKind.SOCK_STREAM, proto=0, laddr=('127.0.0.1', 60686), raddr=('127.0.0.1', 4253)> (1 sockets open) Terminating took 0.897s Socket: closing 127.0.0.1:4253 <socket.socket fd=4, family=AddressFamily.AF_INET, type=SocketKind.SOCK_STREAM, proto=0, laddr=('127.0.0.1', 60686), raddr=('127.0.0.1', 4253)> (0 sockets open) Verifying src/gtphub/osmo-gtphub -c /build/writtenconfig/osmo-gtphub-1iface.cfgzlepwosk, test token_vty_command Launching: PWD=/build 'src/gtphub/osmo-gtphub' '-c' '/build/writtenconfig/osmo-gtphub-1iface.cfgzlepwosk'
ls -l /proc/12134/fd
total 0 lr-x------ 1 build build 64 Dec 2 00:55 0 -> pipe:[4605999] l-wx------ 1 build build 64 Dec 2 00:55 1 -> pipe:[4606000] l-wx------ 1 build build 64 Dec 2 00:55 2 -> pipe:[4606001] l-wx------ 1 build build 64 Dec 2 00:55 3 -> /dev/null
ss -tn
State Recv-Q Send-Q Local Address:Port Peer Address:Port
ss -tln
State Recv-Q Send-Q Local Address:Port Peer Address:Port LISTEN 0 10 127.0.0.1:4253 *:*
ps xua | grep osmo
build 12134 0.9 0.0 54012 21052 ? S 00:55 0:00 /usr/bin/python3 /usr/local/bin/osmotestconfig.py -p /build -w /build -v build 12256 0.0 0.0 21474961572 26408 ? S 00:55 0:00 src/gtphub/osmo-gtphub -c /build/writtenconfig/osmo-gtphub-1iface.cfgzlepwosk build 12263 0.0 0.0 4280 760 ? S 00:55 0:00 /bin/sh -c ps xua | grep osmo build 12265 0.0 0.0 12784 936 ? S 00:55 0:00 grep osmo
ERRORS: 2 Socket: in 1 tries, connected to 127.0.0.1:4253 <socket.socket fd=4, family=AddressFamily.AF_INET, type=SocketKind.SOCK_STREAM, proto=0, laddr=('127.0.0.1', 60690), raddr=('127.0.0.1', 4253)> (1 sockets open) Terminating took 0.897s Socket: closing 127.0.0.1:4253 <socket.socket fd=4, family=AddressFamily.AF_INET, type=SocketKind.SOCK_STREAM, proto=0, laddr=('127.0.0.1', 60690), raddr=('127.0.0.1', 4253)> (0 sockets open) Makefile:711: recipe for target 'vty-python-test' failed make[7]: Leaving directory '/build/tests' make[7]: *** [vty-python-test] Error 2 Makefile:728: recipe for target 'vty-test' failed make[6]: Leaving directory '/build/tests' make[6]: *** [vty-test] Error 2 Makefile:705: recipe for target 'python-tests' failed make[5]: Leaving directory '/build/tests' make[5]: *** [python-tests] Error 2 Makefile:736: recipe for target 'check-local' failed make[4]: Leaving directory '/build/tests' make[4]: *** [check-local] Error 2 Makefile:565: recipe for target 'check-am' failed make[3]: Leaving directory '/build/tests' make[3]: *** [check-am] Error 2 make[2]: *** [check-recursive] Error 1 Makefile:417: recipe for target 'check-recursive' failed make[2]: Leaving directory '/build/tests' Makefile:461: recipe for target 'check-recursive' failed make[1]: Leaving directory '/build' make[1]: *** [check-recursive] Error 1 Makefile:752: recipe for target 'check' failed make: *** [check] Error 2 + cat-testlogs.sh Build step 'Execute shell' marked build as failure [WARNINGS]Skipping publisher since build result is FAILURE