See https://jenkins.osmocom.org/jenkins/job/TTCN3-centos7-pcap-client-test/1135/display/redirect
Changes:
------------------------------------------ [...truncated 21.91 KiB...] #7 2.472 Running transaction #7 4.286 Preparing : 1/1 #7 4.297 Installing : osmocom-nightly-202501162026-1.1.x86_64 1/23 #7 4.326 Installing : libmnl-1.0.5-7.1.x86_64 2/23 #7 4.368 Installing : libosmocore22-1.10.0.58.6cd7a.202501162026-1.1.x86 3/23 #7 4.403 Running scriptlet: libosmocore22-1.10.0.58.6cd7a.202501162026-1.1.x86 3/23 #7 4.415 Installing : libosmoisdn0-1.10.0.58.6cd7a.202501162026-1.1.x86_ 4/23 #7 4.450 Running scriptlet: libosmoisdn0-1.10.0.58.6cd7a.202501162026-1.1.x86_ 4/23 #7 4.473 Installing : libosmogsm20-1.10.0.58.6cd7a.202501162026-1.1.x86_ 5/23 #7 4.503 Running scriptlet: libosmogsm20-1.10.0.58.6cd7a.202501162026-1.1.x86_ 5/23 #7 4.519 Installing : libosmovty13-1.10.0.58.6cd7a.202501162026-1.1.x86_ 6/23 #7 4.548 Running scriptlet: libosmovty13-1.10.0.58.6cd7a.202501162026-1.1.x86_ 6/23 #7 4.570 Installing : libunwind-2:1.2-2.el7.x86_64 7/23 #7 4.600 Running scriptlet: libunwind-2:1.2-2.el7.x86_64 7/23 #7 4.620 Installing : libsodium23-1.0.18-2.1.x86_64 8/23 #7 4.655 Running scriptlet: libsodium23-1.0.18-2.1.x86_64 8/23 #7 4.677 Installing : libpgm-5_2-0-5.2.122-3.1.x86_64 9/23 #7 4.717 Running scriptlet: libpgm-5_2-0-5.2.122-3.1.x86_64 9/23 #7 4.746 Installing : libzmq5-4.3.5-1.1.x86_64 10/23 #7 4.781 Running scriptlet: libzmq5-4.3.5-1.1.x86_64 10/23 #7 4.796 Installing : openpgm-devel-5.2.122-3.1.x86_64 11/23 #7 4.840 Installing : libsodium-devel-1.0.18-2.1.x86_64 12/23 #7 4.890 Installing : libunwind-devel-2:1.2-2.el7.x86_64 13/23 #7 4.942 Installing : libosmoctrl0-1.10.0.58.6cd7a.202501162026-1.1.x86_ 14/23 #7 4.982 Running scriptlet: libosmoctrl0-1.10.0.58.6cd7a.202501162026-1.1.x86_ 14/23 #7 5.002 Installing : libosmogb14-1.10.0.58.6cd7a.202501162026-1.1.x86_6 15/23 #7 5.059 Running scriptlet: libosmogb14-1.10.0.58.6cd7a.202501162026-1.1.x86_6 15/23 #7 5.074 Installing : libmnl-devel-1.0.5-7.1.x86_64 16/23 #7 5.134 Installing : libosmocore-devel-1.10.0.58.6cd7a.202501162026-1.1 17/23 #7 5.180 Installing : libosmoisdn-devel-1.10.0.58.6cd7a.202501162026-1.1 18/23 #7 5.229 Installing : libosmogsm-devel-1.10.0.58.6cd7a.202501162026-1.1. 19/23 #7 5.290 Installing : libosmovty-devel-1.10.0.58.6cd7a.202501162026-1.1. 20/23 #7 5.337 Installing : libosmogb-devel-1.10.0.58.6cd7a.202501162026-1.1.x 21/23 #7 5.402 Installing : libosmoctrl-devel-1.10.0.58.6cd7a.202501162026-1.1 22/23 #7 5.504 Installing : zeromq-devel-4.3.5-1.1.x86_64 23/23 #7 5.566 Verifying : libmnl-1.0.5-7.1.x86_64 1/23 #7 5.566 Verifying : libmnl-devel-1.0.5-7.1.x86_64 2/23 #7 5.566 Verifying : libosmocore-devel-1.10.0.58.6cd7a.202501162026-1.1 3/23 #7 5.566 Verifying : libosmocore22-1.10.0.58.6cd7a.202501162026-1.1.x86 4/23 #7 5.566 Verifying : libosmoctrl-devel-1.10.0.58.6cd7a.202501162026-1.1 5/23 #7 5.566 Verifying : libosmoctrl0-1.10.0.58.6cd7a.202501162026-1.1.x86_ 6/23 #7 5.567 Verifying : libosmogb-devel-1.10.0.58.6cd7a.202501162026-1.1.x 7/23 #7 5.567 Verifying : libosmogb14-1.10.0.58.6cd7a.202501162026-1.1.x86_6 8/23 #7 5.567 Verifying : libosmogsm-devel-1.10.0.58.6cd7a.202501162026-1.1. 9/23 #7 5.567 Verifying : libosmogsm20-1.10.0.58.6cd7a.202501162026-1.1.x86_ 10/23 #7 5.567 Verifying : libosmoisdn-devel-1.10.0.58.6cd7a.202501162026-1.1 11/23 #7 5.567 Verifying : libosmoisdn0-1.10.0.58.6cd7a.202501162026-1.1.x86_ 12/23 #7 5.567 Verifying : libosmovty-devel-1.10.0.58.6cd7a.202501162026-1.1. 13/23 #7 5.567 Verifying : libosmovty13-1.10.0.58.6cd7a.202501162026-1.1.x86_ 14/23 #7 5.567 Verifying : libpgm-5_2-0-5.2.122-3.1.x86_64 15/23 #7 5.567 Verifying : libsodium-devel-1.0.18-2.1.x86_64 16/23 #7 5.567 Verifying : libsodium23-1.0.18-2.1.x86_64 17/23 #7 5.567 Verifying : libzmq5-4.3.5-1.1.x86_64 18/23 #7 5.567 Verifying : openpgm-devel-5.2.122-3.1.x86_64 19/23 #7 5.567 Verifying : osmocom-nightly-202501162026-1.1.x86_64 20/23 #7 5.567 Verifying : zeromq-devel-4.3.5-1.1.x86_64 21/23 #7 5.567 Verifying : libunwind-2:1.2-2.el7.x86_64 22/23 #7 5.567 Verifying : libunwind-devel-2:1.2-2.el7.x86_64 23/23 #7 6.336 #7 6.336 Installed: #7 6.336 libosmocore-devel-1.10.0.58.6cd7a.202501162026-1.1.x86_64 #7 6.336 libosmoctrl-devel-1.10.0.58.6cd7a.202501162026-1.1.x86_64 #7 6.336 libosmogb-devel-1.10.0.58.6cd7a.202501162026-1.1.x86_64 #7 6.336 libosmogsm-devel-1.10.0.58.6cd7a.202501162026-1.1.x86_64 #7 6.336 libosmovty-devel-1.10.0.58.6cd7a.202501162026-1.1.x86_64 #7 6.336 zeromq-devel-4.3.5-1.1.x86_64 #7 6.336 libmnl-1.0.5-7.1.x86_64 #7 6.336 libmnl-devel-1.0.5-7.1.x86_64 #7 6.336 libosmocore22-1.10.0.58.6cd7a.202501162026-1.1.x86_64 #7 6.336 libosmoctrl0-1.10.0.58.6cd7a.202501162026-1.1.x86_64 #7 6.336 libosmogb14-1.10.0.58.6cd7a.202501162026-1.1.x86_64 #7 6.336 libosmogsm20-1.10.0.58.6cd7a.202501162026-1.1.x86_64 #7 6.336 libosmoisdn-devel-1.10.0.58.6cd7a.202501162026-1.1.x86_64 #7 6.336 libosmoisdn0-1.10.0.58.6cd7a.202501162026-1.1.x86_64 #7 6.336 libosmovty13-1.10.0.58.6cd7a.202501162026-1.1.x86_64 #7 6.336 libpgm-5_2-0-5.2.122-3.1.x86_64 #7 6.336 libsodium-devel-1.0.18-2.1.x86_64 #7 6.336 libsodium23-1.0.18-2.1.x86_64 #7 6.336 libzmq5-4.3.5-1.1.x86_64 #7 6.336 openpgm-devel-5.2.122-3.1.x86_64 #7 6.336 osmocom-nightly-202501162026-1.1.x86_64 #7 6.336 libunwind-2:1.2-2.el7.x86_64 #7 6.336 libunwind-devel-2:1.2-2.el7.x86_64 #7 6.336 #7 6.337 Complete! #7 DONE 6.5s
#8 [3/8] WORKDIR /TMP #8 DONE 0.2s
#9 [4/8] RUN GIT clone https://gerrit.osmocom.org/osmo-pcap.git #9 0.282 Cloning into 'osmo-pcap'... #9 DONE 0.5s
#10 [5/8] ADD HTTPS://GERRIT.OSMOCOM.ORG/PLUGINS/GITILES/OSMO-PCAP/+/MASTER?FORMAT=TEXT /tmp/commit-osmo-pcap #10 DONE 0.2s
#11 [6/8] RUN CD osmo-pcap && git fetch && git checkout master && (git symbolic-ref -q HEAD && git reset --hard origin/master || exit 1); git rev-parse --abbrev-ref HEAD && git rev-parse HEAD && autoreconf -fi && ./configure && make "-j$(nproc)" install #11 0.400 Already on 'master' #11 0.401 refs/heads/master #11 0.402 HEAD is now at 4bf57c2 server: Use osmo_stream_srv_link on tcp listen socket #11 0.403 master #11 0.403 4bf57c2fe5cbf6622a19a2dd1764ebac178fc0c2 #11 3.002 libtoolize: putting auxiliary files in `.'. #11 3.002 libtoolize: copying file `./ltmain.sh' #11 3.072 libtoolize: Consider adding `AC_CONFIG_MACRO_DIR([m4])' to configure.ac and #11 3.072 libtoolize: rerunning libtoolize, to keep the correct libtool macros in-tree. #11 3.072 libtoolize: Consider adding `-I m4' to ACLOCAL_AMFLAGS in Makefile.am. #11 3.072 libtoolize: `AC_PROG_RANLIB' is rendered obsolete by `LT_INIT' #11 5.001 configure.ac:63: installing './config.guess' #11 5.002 configure.ac:63: installing './config.sub' #11 5.003 configure.ac:6: installing './install-sh' #11 5.004 configure.ac:6: installing './missing' #11 5.115 src/Makefile.am: installing './depcomp' #11 5.187 checking for a BSD-compatible install... /usr/bin/install -c #11 5.191 checking whether build environment is sane... yes #11 5.195 checking for a thread-safe mkdir -p... /usr/bin/mkdir -p #11 5.196 checking for gawk... gawk #11 5.196 checking whether make sets $(MAKE)... yes #11 5.200 checking whether make supports nested variables... yes #11 5.202 checking whether make supports nested variables... (cached) yes #11 5.202 checking whether make sets $(MAKE)... (cached) yes #11 5.203 checking for gcc... gcc #11 5.211 checking whether the C compiler works... yes #11 5.230 checking for C compiler default output file name... a.out #11 5.231 checking for suffix of executables... #11 5.245 checking whether we are cross compiling... no #11 5.261 checking for suffix of object files... o #11 5.270 checking whether we are using the GNU C compiler... yes #11 5.277 checking whether gcc accepts -g... yes #11 5.285 checking for gcc option to accept ISO C89... none needed #11 5.296 checking for style of include used by make... GNU #11 5.297 checking dependency style of gcc... gcc3 #11 5.312 checking for ranlib... ranlib #11 5.317 checking build system type... x86_64-unknown-linux-gnu #11 5.337 checking host system type... x86_64-unknown-linux-gnu #11 5.337 checking how to print strings... printf #11 5.338 checking for a sed that does not truncate output... /usr/bin/sed #11 5.340 checking for grep that handles long lines and -e... /usr/bin/grep #11 5.340 checking for egrep... /usr/bin/grep -E #11 5.341 checking for fgrep... /usr/bin/grep -F #11 5.342 checking for ld used by gcc... /usr/bin/ld #11 5.343 checking if the linker (/usr/bin/ld) is GNU ld... yes #11 5.344 checking for BSD- or MS-compatible name lister (nm)... /usr/bin/nm -B #11 5.345 checking the name lister (/usr/bin/nm -B) interface... BSD nm #11 5.355 checking whether ln -s works... yes #11 5.355 checking the maximum length of command line arguments... 1572864 #11 5.357 checking whether the shell understands some XSI constructs... yes #11 5.357 checking whether the shell understands "+="... yes #11 5.358 checking how to convert x86_64-unknown-linux-gnu file names to x86_64-unknown-linux-gnu format... func_convert_file_noop #11 5.358 checking how to convert x86_64-unknown-linux-gnu file names to toolchain format... func_convert_file_noop #11 5.358 checking for /usr/bin/ld option to reload object files... -r #11 5.358 checking for objdump... objdump #11 5.359 checking how to recognize dependent libraries... pass_all #11 5.359 checking for dlltool... no #11 5.359 checking how to associate runtime and link libraries... printf %s\n #11 5.359 checking for ar... ar #11 5.359 checking for archiver @FILE support... @ #11 5.370 checking for strip... strip #11 5.370 checking for ranlib... (cached) ranlib #11 5.370 checking command to parse /usr/bin/nm -B output from gcc object... ok #11 5.399 checking for sysroot... no #11 5.405 ./configure: line 6418: /usr/bin/file: No such file or directory #11 5.406 checking for mt... no #11 5.406 checking if : is a manifest tool... no #11 5.408 checking how to run the C preprocessor... gcc -E #11 5.424 checking for ANSI C header files... yes #11 5.470 checking for sys/types.h... yes #11 5.483 checking for sys/stat.h... yes #11 5.496 checking for stdlib.h... yes #11 5.509 checking for string.h... yes #11 5.523 checking for memory.h... yes #11 5.536 checking for strings.h... yes #11 5.550 checking for inttypes.h... yes #11 5.564 checking for stdint.h... yes #11 5.578 checking for unistd.h... yes #11 5.592 checking for dlfcn.h... yes #11 5.604 checking for objdir... .libs #11 5.631 checking if gcc supports -fno-rtti -fno-exceptions... no #11 5.641 checking for gcc option to produce PIC... -fPIC -DPIC #11 5.641 checking if gcc PIC flag -fPIC -DPIC works... yes #11 5.650 checking if gcc static flag -static works... no #11 5.658 checking if gcc supports -c -o file.o... yes #11 5.670 checking if gcc supports -c -o file.o... (cached) yes #11 5.670 checking whether the gcc linker (/usr/bin/ld) supports shared libraries... yes #11 5.674 checking whether -lc should be explicitly linked in... no #11 5.696 checking dynamic linker characteristics... GNU/Linux ld.so #11 5.719 checking how to hardcode library paths into programs... immediate #11 5.719 checking whether stripping libraries is possible... yes #11 5.720 checking if libtool supports shared libraries... yes #11 5.721 checking whether to build shared libraries... yes #11 5.721 checking whether to build static libraries... yes #11 5.721 checking for pkg-config... /usr/bin/pkg-config #11 5.722 checking for pkg-config... /usr/bin/pkg-config #11 5.722 checking pkg-config is at least version 0.20... yes #11 5.722 checking for ANSI C header files... (cached) yes #11 5.724 checking whether to enable VTY tests... no #11 5.724 checking for pcap-config... /usr/bin/pcap-config #11 5.726 checking for LIBOSMOCORE... yes #11 5.729 checking for LIBOSMOGB... yes #11 5.733 checking for LIBOSMOGSM... yes #11 5.737 checking for LIBOSMOVTY... yes #11 5.740 checking for LIBOSMONETIF... no #11 5.743 configure: error: Package requirements (libosmo-netif >= 1.5.0) were not met: #11 5.743 #11 5.743 No package 'libosmo-netif' found #11 5.743 #11 5.743 Consider adjusting the PKG_CONFIG_PATH environment variable if you #11 5.743 installed software in a non-standard prefix. #11 5.743 #11 5.743 Alternatively, you may set the environment variables LIBOSMONETIF_CFLAGS #11 5.743 and LIBOSMONETIF_LIBS to avoid the need to call pkg-config. #11 5.743 See the pkg-config man page for more details. #11 ERROR: process "/bin/sh -c cd osmo-pcap && \tgit fetch && git checkout $OSMO_PCAP_BRANCH && \t(git symbolic-ref -q HEAD && git reset --hard origin/$OSMO_PCAP_BRANCH || exit 1); \tgit rev-parse --abbrev-ref HEAD && git rev-parse HEAD && \tautoreconf -fi && \t./configure && \tmake "-j$(nproc)" install" did not complete successfully: exit code: 1 ------
[6/8] RUN CD osmo-pcap && git fetch && git checkout master && (git symbolic-ref -q HEAD && git reset --hard origin/master || exit 1); git rev-parse --abbrev-ref HEAD && git rev-parse HEAD && autoreconf -fi && ./configure && make "-j$(nproc)" install:
5.743 configure: error: Package requirements (libosmo-netif >= 1.5.0) were not met: 5.743 5.743 No package 'libosmo-netif' found 5.743 5.743 Consider adjusting the PKG_CONFIG_PATH environment variable if you 5.743 installed software in a non-standard prefix. 5.743 5.743 Alternatively, you may set the environment variables LIBOSMONETIF_CFLAGS 5.743 and LIBOSMONETIF_LIBS to avoid the need to call pkg-config. 5.743 See the pkg-config man page for more details. ------
[33m1 warning found (use docker --debug to expand): [0m - InvalidDefaultArgInFrom: Default value for ARG $USER/$DISTRO-build results in empty or invalid base image name (line 3) Dockerfile:34 -------------------- 33 | 34 | >>> RUN cd osmo-pcap && \ 35 | >>> git fetch && git checkout $OSMO_PCAP_BRANCH && \ 36 | >>> (git symbolic-ref -q HEAD && git reset --hard origin/$OSMO_PCAP_BRANCH || exit 1); \ 37 | >>> git rev-parse --abbrev-ref HEAD && git rev-parse HEAD && \ 38 | >>> autoreconf -fi && \ 39 | >>> ./configure && \ 40 | >>> make "-j$(nproc)" install 41 | -------------------- ERROR: failed to solve: process "/bin/sh -c cd osmo-pcap && \tgit fetch && git checkout $OSMO_PCAP_BRANCH && \t(git symbolic-ref -q HEAD && git reset --hard origin/$OSMO_PCAP_BRANCH || exit 1); \tgit rev-parse --abbrev-ref HEAD && git rev-parse HEAD && \tautoreconf -fi && \t./configure && \tmake "-j$(nproc)" install" did not complete successfully: exit code: 1 make: *** [../make/Makefile:95: docker-build] Error 1 make: Leaving directory 'https://jenkins.osmocom.org/jenkins/job/TTCN3-centos7-pcap-client-test/ws/osmo-pcap-master' + exit 1 Build step 'Execute shell' marked build as failure Recording test results ERROR: Step ‘Publish JUnit test result report’ failed: No test report files were found. Configuration error?