See https://jenkins.osmocom.org/jenkins/job/TTCN3-centos7-pcap-client-test/1140/display/redirect
Changes:
------------------------------------------ [...truncated 21.61 KiB...] #7 4.907 Running transaction #7 6.668 Preparing : 1/1 #7 6.687 Installing : osmocom-nightly-202501202026-1.1.x86_64 1/23 #7 6.720 Installing : libmnl-1.0.5-7.1.x86_64 2/23 #7 6.775 Installing : libosmocore22-1.10.0.61.4dbbd.202501202026-1.1.x86 3/23 #7 6.811 Running scriptlet: libosmocore22-1.10.0.61.4dbbd.202501202026-1.1.x86 3/23 #7 6.852 Installing : libosmoisdn0-1.10.0.61.4dbbd.202501202026-1.1.x86_ 4/23 #7 6.888 Running scriptlet: libosmoisdn0-1.10.0.61.4dbbd.202501202026-1.1.x86_ 4/23 #7 6.930 Installing : libosmogsm20-1.10.0.61.4dbbd.202501202026-1.1.x86_ 5/23 #7 6.959 Running scriptlet: libosmogsm20-1.10.0.61.4dbbd.202501202026-1.1.x86_ 5/23 #7 6.992 Installing : libosmovty13-1.10.0.61.4dbbd.202501202026-1.1.x86_ 6/23 #7 7.024 Running scriptlet: libosmovty13-1.10.0.61.4dbbd.202501202026-1.1.x86_ 6/23 #7 7.067 Installing : libunwind-2:1.2-2.el7.x86_64 7/23 #7 7.104 Running scriptlet: libunwind-2:1.2-2.el7.x86_64 7/23 #7 7.154 Installing : libsodium23-1.0.18-2.1.x86_64 8/23 #7 7.192 Running scriptlet: libsodium23-1.0.18-2.1.x86_64 8/23 #7 7.243 Installing : libpgm-5_2-0-5.2.122-3.1.x86_64 9/23 #7 7.277 Running scriptlet: libpgm-5_2-0-5.2.122-3.1.x86_64 9/23 #7 7.324 Installing : libzmq5-4.3.5-1.1.x86_64 10/23 #7 7.359 Running scriptlet: libzmq5-4.3.5-1.1.x86_64 10/23 #7 7.391 Installing : openpgm-devel-5.2.122-3.1.x86_64 11/23 #7 7.450 Installing : libsodium-devel-1.0.18-2.1.x86_64 12/23 #7 7.524 Installing : libunwind-devel-2:1.2-2.el7.x86_64 13/23 #7 7.583 Installing : libosmoctrl0-1.10.0.61.4dbbd.202501202026-1.1.x86_ 14/23 #7 7.624 Running scriptlet: libosmoctrl0-1.10.0.61.4dbbd.202501202026-1.1.x86_ 14/23 #7 7.672 Installing : libosmogb14-1.10.0.61.4dbbd.202501202026-1.1.x86_6 15/23 #7 7.712 Running scriptlet: libosmogb14-1.10.0.61.4dbbd.202501202026-1.1.x86_6 15/23 #7 7.746 Installing : libmnl-devel-1.0.5-7.1.x86_64 16/23 #7 7.809 Installing : libosmocore-devel-1.10.0.61.4dbbd.202501202026-1.1 17/23 #7 7.859 Installing : libosmoisdn-devel-1.10.0.61.4dbbd.202501202026-1.1 18/23 #7 7.909 Installing : libosmogsm-devel-1.10.0.61.4dbbd.202501202026-1.1. 19/23 #7 7.950 Installing : libosmovty-devel-1.10.0.61.4dbbd.202501202026-1.1. 20/23 #7 7.988 Installing : libosmogb-devel-1.10.0.61.4dbbd.202501202026-1.1.x 21/23 #7 8.032 Installing : libosmoctrl-devel-1.10.0.61.4dbbd.202501202026-1.1 22/23 #7 8.131 Installing : zeromq-devel-4.3.5-1.1.x86_64 23/23 #7 8.196 Verifying : libmnl-1.0.5-7.1.x86_64 1/23 #7 8.196 Verifying : libmnl-devel-1.0.5-7.1.x86_64 2/23 #7 8.197 Verifying : libosmocore-devel-1.10.0.61.4dbbd.202501202026-1.1 3/23 #7 8.197 Verifying : libosmocore22-1.10.0.61.4dbbd.202501202026-1.1.x86 4/23 #7 8.197 Verifying : libosmoctrl-devel-1.10.0.61.4dbbd.202501202026-1.1 5/23 #7 8.197 Verifying : libosmoctrl0-1.10.0.61.4dbbd.202501202026-1.1.x86_ 6/23 #7 8.197 Verifying : libosmogb-devel-1.10.0.61.4dbbd.202501202026-1.1.x 7/23 #7 8.197 Verifying : libosmogb14-1.10.0.61.4dbbd.202501202026-1.1.x86_6 8/23 #7 8.197 Verifying : libosmogsm-devel-1.10.0.61.4dbbd.202501202026-1.1. 9/23 #7 8.197 Verifying : libosmogsm20-1.10.0.61.4dbbd.202501202026-1.1.x86_ 10/23 #7 8.197 Verifying : libosmoisdn-devel-1.10.0.61.4dbbd.202501202026-1.1 11/23 #7 8.197 Verifying : libosmoisdn0-1.10.0.61.4dbbd.202501202026-1.1.x86_ 12/23 #7 8.197 Verifying : libosmovty-devel-1.10.0.61.4dbbd.202501202026-1.1. 13/23 #7 8.197 Verifying : libosmovty13-1.10.0.61.4dbbd.202501202026-1.1.x86_ 14/23 #7 8.197 Verifying : libpgm-5_2-0-5.2.122-3.1.x86_64 15/23 #7 8.197 Verifying : libsodium-devel-1.0.18-2.1.x86_64 16/23 #7 8.197 Verifying : libsodium23-1.0.18-2.1.x86_64 17/23 #7 8.197 Verifying : libzmq5-4.3.5-1.1.x86_64 18/23 #7 8.197 Verifying : openpgm-devel-5.2.122-3.1.x86_64 19/23 #7 8.197 Verifying : osmocom-nightly-202501202026-1.1.x86_64 20/23 #7 8.197 Verifying : zeromq-devel-4.3.5-1.1.x86_64 21/23 #7 8.197 Verifying : libunwind-2:1.2-2.el7.x86_64 22/23 #7 8.198 Verifying : libunwind-devel-2:1.2-2.el7.x86_64 23/23 #7 8.937 #7 8.937 Installed: #7 8.937 libosmocore-devel-1.10.0.61.4dbbd.202501202026-1.1.x86_64 #7 8.937 libosmoctrl-devel-1.10.0.61.4dbbd.202501202026-1.1.x86_64 #7 8.937 libosmogb-devel-1.10.0.61.4dbbd.202501202026-1.1.x86_64 #7 8.937 libosmogsm-devel-1.10.0.61.4dbbd.202501202026-1.1.x86_64 #7 8.937 libosmovty-devel-1.10.0.61.4dbbd.202501202026-1.1.x86_64 #7 8.937 zeromq-devel-4.3.5-1.1.x86_64 #7 8.937 libmnl-1.0.5-7.1.x86_64 #7 8.937 libmnl-devel-1.0.5-7.1.x86_64 #7 8.937 libosmocore22-1.10.0.61.4dbbd.202501202026-1.1.x86_64 #7 8.937 libosmoctrl0-1.10.0.61.4dbbd.202501202026-1.1.x86_64 #7 8.937 libosmogb14-1.10.0.61.4dbbd.202501202026-1.1.x86_64 #7 8.937 libosmogsm20-1.10.0.61.4dbbd.202501202026-1.1.x86_64 #7 8.937 libosmoisdn-devel-1.10.0.61.4dbbd.202501202026-1.1.x86_64 #7 8.937 libosmoisdn0-1.10.0.61.4dbbd.202501202026-1.1.x86_64 #7 8.937 libosmovty13-1.10.0.61.4dbbd.202501202026-1.1.x86_64 #7 8.937 libpgm-5_2-0-5.2.122-3.1.x86_64 #7 8.937 libsodium-devel-1.0.18-2.1.x86_64 #7 8.937 libsodium23-1.0.18-2.1.x86_64 #7 8.937 libzmq5-4.3.5-1.1.x86_64 #7 8.937 openpgm-devel-5.2.122-3.1.x86_64 #7 8.937 osmocom-nightly-202501202026-1.1.x86_64 #7 8.937 libunwind-2:1.2-2.el7.x86_64 #7 8.937 libunwind-devel-2:1.2-2.el7.x86_64 #7 8.937 #7 8.937 Complete! #7 DONE 9.1s
#8 [3/8] WORKDIR /TMP #8 DONE 0.1s
#9 [4/8] RUN GIT clone https://gerrit.osmocom.org/osmo-pcap.git #9 0.322 Cloning into 'osmo-pcap'... #9 DONE 0.6s
#10 [5/8] ADD HTTPS://GERRIT.OSMOCOM.ORG/PLUGINS/GITILES/OSMO-PCAP/+/MASTER?FORMAT=TEXT /tmp/commit-osmo-pcap #10 DONE 0.2s
#11 [6/8] RUN CD osmo-pcap && git fetch && git checkout master && (git symbolic-ref -q HEAD && git reset --hard origin/master || exit 1); git rev-parse --abbrev-ref HEAD && git rev-parse HEAD && autoreconf -fi && ./configure && make "-j$(nproc)" install #11 0.426 Already on 'master' #11 0.427 refs/heads/master #11 0.429 HEAD is now at f9eedab server: Correct error check calling osmo_pcap_conn_process_data() #11 0.430 master #11 0.431 f9eedab949e5fd7dcfba728c5d525a0f9d6c4f27 #11 3.175 libtoolize: putting auxiliary files in `.'. #11 3.175 libtoolize: copying file `./ltmain.sh' #11 3.512 libtoolize: Consider adding `AC_CONFIG_MACRO_DIR([m4])' to configure.ac and #11 3.512 libtoolize: rerunning libtoolize, to keep the correct libtool macros in-tree. #11 3.512 libtoolize: Consider adding `-I m4' to ACLOCAL_AMFLAGS in Makefile.am. #11 3.515 libtoolize: `AC_PROG_RANLIB' is rendered obsolete by `LT_INIT' #11 5.726 configure.ac:63: installing './config.guess' #11 5.727 configure.ac:63: installing './config.sub' #11 5.728 configure.ac:6: installing './install-sh' #11 5.729 configure.ac:6: installing './missing' #11 5.826 src/Makefile.am: installing './depcomp' #11 5.923 checking for a BSD-compatible install... /usr/bin/install -c #11 5.942 checking whether build environment is sane... yes #11 5.965 checking for a thread-safe mkdir -p... /usr/bin/mkdir -p #11 5.970 checking for gawk... gawk #11 5.971 checking whether make sets $(MAKE)... yes #11 5.996 checking whether make supports nested variables... yes #11 6.013 checking whether make supports nested variables... (cached) yes #11 6.013 checking whether make sets $(MAKE)... (cached) yes #11 6.019 checking for gcc... gcc #11 6.069 checking whether the C compiler works... yes #11 6.165 checking for C compiler default output file name... a.out #11 6.166 checking for suffix of executables... #11 6.190 checking whether we are cross compiling... no #11 6.221 checking for suffix of object files... o #11 6.248 checking whether we are using the GNU C compiler... yes #11 6.284 checking whether gcc accepts -g... yes #11 6.322 checking for gcc option to accept ISO C89... none needed #11 6.361 checking for style of include used by make... GNU #11 6.368 checking dependency style of gcc... gcc3 #11 6.447 checking for ranlib... ranlib #11 6.473 checking build system type... x86_64-unknown-linux-gnu #11 6.578 checking host system type... x86_64-unknown-linux-gnu #11 6.578 checking how to print strings... printf #11 6.583 checking for a sed that does not truncate output... /usr/bin/sed #11 6.596 checking for grep that handles long lines and -e... /usr/bin/grep #11 6.601 checking for egrep... /usr/bin/grep -E #11 6.604 checking for fgrep... /usr/bin/grep -F #11 6.609 checking for ld used by gcc... /usr/bin/ld #11 6.619 checking if the linker (/usr/bin/ld) is GNU ld... yes #11 6.624 checking for BSD- or MS-compatible name lister (nm)... /usr/bin/nm -B #11 6.631 checking the name lister (/usr/bin/nm -B) interface... BSD nm #11 6.679 checking whether ln -s works... yes #11 6.679 checking the maximum length of command line arguments... 1572864 #11 6.690 checking whether the shell understands some XSI constructs... yes #11 6.692 checking whether the shell understands "+="... yes #11 6.700 checking how to convert x86_64-unknown-linux-gnu file names to x86_64-unknown-linux-gnu format... func_convert_file_noop #11 6.700 checking how to convert x86_64-unknown-linux-gnu file names to toolchain format... func_convert_file_noop #11 6.701 checking for /usr/bin/ld option to reload object files... -r #11 6.702 checking for objdump... objdump #11 6.702 checking how to recognize dependent libraries... pass_all #11 6.705 checking for dlltool... no #11 6.705 checking how to associate runtime and link libraries... printf %s\n #11 6.706 checking for ar... ar #11 6.707 checking for archiver @FILE support... @ #11 6.759 checking for strip... strip #11 6.761 checking for ranlib... (cached) ranlib #11 6.761 checking command to parse /usr/bin/nm -B output from gcc object... ok #11 6.879 checking for sysroot... no #11 6.890 ./configure: line 6418: /usr/bin/file: No such file or directory #11 6.891 checking for mt... no #11 6.892 checking if : is a manifest tool... no #11 6.897 checking how to run the C preprocessor... gcc -E #11 6.990 checking for ANSI C header files... yes #11 7.089 checking for sys/types.h... yes #11 7.120 checking for sys/stat.h... yes #11 7.162 checking for stdlib.h... yes #11 7.186 checking for string.h... yes #11 7.215 checking for memory.h... yes #11 7.251 checking for strings.h... yes #11 7.304 checking for inttypes.h... yes #11 7.347 checking for stdint.h... yes #11 7.385 checking for unistd.h... yes #11 7.420 checking for dlfcn.h... yes #11 7.444 checking for objdir... .libs #11 7.526 checking if gcc supports -fno-rtti -fno-exceptions... no #11 7.571 checking for gcc option to produce PIC... -fPIC -DPIC #11 7.571 checking if gcc PIC flag -fPIC -DPIC works... yes #11 7.613 checking if gcc static flag -static works... no #11 7.644 checking if gcc supports -c -o file.o... yes #11 7.711 checking if gcc supports -c -o file.o... (cached) yes #11 7.711 checking whether the gcc linker (/usr/bin/ld) supports shared libraries... yes #11 7.730 checking whether -lc should be explicitly linked in... no #11 7.790 checking dynamic linker characteristics... GNU/Linux ld.so #11 7.856 checking how to hardcode library paths into programs... immediate #11 7.856 checking whether stripping libraries is possible... yes #11 7.858 checking if libtool supports shared libraries... yes #11 7.859 checking whether to build shared libraries... yes #11 7.859 checking whether to build static libraries... yes #11 7.859 checking for pkg-config... /usr/bin/pkg-config #11 7.860 checking for pkg-config... /usr/bin/pkg-config #11 7.861 checking pkg-config is at least version 0.20... yes #11 7.862 checking for ANSI C header files... (cached) yes #11 7.867 checking whether to enable VTY tests... no #11 7.868 checking for pcap-config... /usr/bin/pcap-config #11 7.874 checking for LIBOSMOCORE... yes #11 7.895 checking for LIBOSMOGB... yes #11 7.917 checking for LIBOSMOGSM... yes #11 7.939 checking for LIBOSMOVTY... yes #11 7.960 checking for LIBOSMONETIF... no #11 7.978 configure: error: Package requirements (libosmo-netif >= 1.5.0) were not met: #11 7.978 #11 7.978 No package 'libosmo-netif' found #11 7.978 #11 7.978 Consider adjusting the PKG_CONFIG_PATH environment variable if you #11 7.978 installed software in a non-standard prefix. #11 7.978 #11 7.978 Alternatively, you may set the environment variables LIBOSMONETIF_CFLAGS #11 7.978 and LIBOSMONETIF_LIBS to avoid the need to call pkg-config. #11 7.978 See the pkg-config man page for more details. #11 ERROR: process "/bin/sh -c cd osmo-pcap && \tgit fetch && git checkout $OSMO_PCAP_BRANCH && \t(git symbolic-ref -q HEAD && git reset --hard origin/$OSMO_PCAP_BRANCH || exit 1); \tgit rev-parse --abbrev-ref HEAD && git rev-parse HEAD && \tautoreconf -fi && \t./configure && \tmake "-j$(nproc)" install" did not complete successfully: exit code: 1 ------
[6/8] RUN CD osmo-pcap && git fetch && git checkout master && (git symbolic-ref -q HEAD && git reset --hard origin/master || exit 1); git rev-parse --abbrev-ref HEAD && git rev-parse HEAD && autoreconf -fi && ./configure && make "-j$(nproc)" install:
7.978 configure: error: Package requirements (libosmo-netif >= 1.5.0) were not met: 7.978 7.978 No package 'libosmo-netif' found 7.978 7.978 Consider adjusting the PKG_CONFIG_PATH environment variable if you 7.978 installed software in a non-standard prefix. 7.978 7.978 Alternatively, you may set the environment variables LIBOSMONETIF_CFLAGS 7.978 and LIBOSMONETIF_LIBS to avoid the need to call pkg-config. 7.978 See the pkg-config man page for more details. ------
[33m1 warning found (use docker --debug to expand): [0m - InvalidDefaultArgInFrom: Default value for ARG $USER/$DISTRO-build results in empty or invalid base image name (line 3) Dockerfile:34 -------------------- 33 | 34 | >>> RUN cd osmo-pcap && \ 35 | >>> git fetch && git checkout $OSMO_PCAP_BRANCH && \ 36 | >>> (git symbolic-ref -q HEAD && git reset --hard origin/$OSMO_PCAP_BRANCH || exit 1); \ 37 | >>> git rev-parse --abbrev-ref HEAD && git rev-parse HEAD && \ 38 | >>> autoreconf -fi && \ 39 | >>> ./configure && \ 40 | >>> make "-j$(nproc)" install 41 | -------------------- ERROR: failed to solve: process "/bin/sh -c cd osmo-pcap && \tgit fetch && git checkout $OSMO_PCAP_BRANCH && \t(git symbolic-ref -q HEAD && git reset --hard origin/$OSMO_PCAP_BRANCH || exit 1); \tgit rev-parse --abbrev-ref HEAD && git rev-parse HEAD && \tautoreconf -fi && \t./configure && \tmake "-j$(nproc)" install" did not complete successfully: exit code: 1 make: *** [../make/Makefile:95: docker-build] Error 1 make: Leaving directory 'https://jenkins.osmocom.org/jenkins/job/TTCN3-centos7-pcap-client-test/ws/osmo-pcap-master' + exit 1 Build step 'Execute shell' marked build as failure Recording test results ERROR: Step ‘Publish JUnit test result report’ failed: No test report files were found. Configuration error?