Changes:
------------------------------------------ [...truncated 323.09 KiB...] update_record 1 update_record 2 update_record 3 select MF/ADF.USIM/DF.ProSe/EF.PROSE_PLMN update_record 1 update_record 2 update_record 3 select MF/ADF.USIM/DF.ProSe/EF.PROSE_GC update_binary select MF/ADF.USIM/DF.ProSe/EF.PST update_binary select MF/ADF.USIM/DF.ProSe/EF.UIRC update_binary select MF/ADF.USIM/DF.ProSe/EF.PROSE_GM_DISCOVERY update_record 1 update_record 2 update_record 3 select MF/ADF.USIM/DF.ProSe/EF.PROSE_RELAY update_record 1 update_record 2 update_record 3 select MF/ADF.USIM/DF.ProSe/EF.PROSE_RELAY_DISCOVERY update_binary select MF/ADF.USIM/DF.5GS select MF/ADF.USIM/DF.5GS/EF.5GS3GPPLOCI update_binary select MF/ADF.USIM/DF.5GS/EF.5GSN3GPPLOCI update_binary select MF/ADF.USIM/DF.5GS/EF.5GS3GPPNSC update_record 1 select MF/ADF.USIM/DF.5GS/EF.5GSN3GPPNSC update_record 1 select MF/ADF.USIM/DF.5GS/EF.5GAUTHKEYS update_binary select MF/ADF.USIM/DF.5GS/EF.UAC_AIC update_binary select MF/ADF.USIM/DF.5GS/EF.SUCI_Calc_Info update_binary select MF/ADF.USIM/DF.5GS/EF.OPL5G update_record 1 update_record 2 update_record 3 update_record 4 update_record 5 update_record 6 update_record 7 update_record 8 update_record 9 update_record 10 select MF/ADF.USIM/DF.5GS/EF.SUPI_NAI update_binary select MF/ADF.USIM/DF.5GS/EF.Routing_Indicator update_binary select MF/ADF.USIM/DF.5GS/EF.URSP update_binary select MF/ADF.USIM/DF.5GS/EF.TN3GPPSNN update_binary select MF/ADF.USIM/DF.5GS/EF.CAG select MF/ADF.USIM/DF.5GS/EF.SOR-CMCI select MF/ADF.USIM/DF.5GS/EF.DRI select MF/ADF.USIM/DF.5GS/EF.5GSEDRX select MF/ADF.USIM/DF.5GS/EF.5GNSWO_CONF select MF/ADF.USIM/DF.5GS/EF.MCHPPLMN select MF/ADF.USIM/DF.5GS/EF.KAUSF_DERIVATION select MF/ADF.USIM/DF.SNPN select MF/ADF.USIM/DF.SNPN/EF.PWS_SNPN select MF/ADF.USIM/DF.SNPN/EF.NID select MF/ADF.USIM/DF.5G_ProSe select MF/ADF.USIM/DF.5G_ProSe/EF.5G_PROSE_ST select MF/ADF.USIM/DF.5G_ProSe/EF.5G_PROSE_DD select MF/ADF.USIM/DF.5G_ProSe/EF.5G_PROSE_DC select MF/ADF.USIM/DF.5G_ProSe/EF.5G_PROSE_U2NRU select MF/ADF.USIM/DF.5G_ProSe/EF.5G_PROSE_RU select MF/ADF.USIM/DF.5G_ProSe/EF.5G_PROSE_UIR select MF/ADF.USIM/DF.SAIP select MF/ADF.USIM/DF.SAIP/EF.SUCI_Calc_Info select MF/ADF.USIM/EF.IMSI update_binary select MF/ADF.USIM/EF.USIM_AUTH_KEY select MF/ADF.USIM/EF.USIM_AUTH_KEY_2G select MF/ADF.USIM/EF.GBA_SK select MF/ADF.USIM/EF.GBA_REC_LIST select MF/ADF.USIM/EF.GBA_INT_KEY select MF/ADF.USIM/EF.USIM_SQN select MF/ADF.ISIM select MF/ADF.ISIM/EF.IMPI update_binary select MF/ADF.ISIM/EF.DOMAIN update_binary select MF/ADF.ISIM/EF.IMPU update_record 1 update_record 2 update_record 3 update_record 4 update_record 5 update_record 6 update_record 7 update_record 8 select MF/ADF.ISIM/EF.AD update_binary select MF/ADF.ISIM/EF.ARR update_record 1 update_record 2 update_record 3 update_record 4 select MF/ADF.ISIM/EF.IST update_binary select MF/ADF.ISIM/EF.P-CSCF update_record 1 update_record 2 update_record 3 update_record 4 update_record 5 update_record 6 update_record 7 update_record 8 select MF/ADF.ISIM/EF.GBABP update_binary select MF/ADF.ISIM/EF.GBANL update_record 1 update_record 2 update_record 3 update_record 4 update_record 5 update_record 6 update_record 7 update_record 8 select MF/ADF.ISIM/EF.NAFKCA update_record 1 update_record 2 update_record 3 update_record 4 update_record 5 update_record 6 update_record 7 update_record 8 select MF/ADF.ISIM/EF.UICCIARI update_record 1 update_record 2 update_record 3 update_record 4 update_record 5 update_record 6 update_record 7 update_record 8 select MF/ADF.ISIM/EF.FromPreferred update_binary select MF/ADF.ISIM/EF.IMSConfigData select MF/ADF.ISIM/EF.XCAPConfigData select MF/ADF.ISIM/EF.WebRTCURI update_record 1 update_record 2 update_record 3 update_record 4 update_record 5 update_record 6 update_record 7 update_record 8 update_record 9 update_record 10 select MF/ADF.ISIM/EF.MuDMiDConfigData select MF/ADF.ISIM/EF.ISIM_AUTH_KEY select MF/ADF.ISIM/EF.ISIM_AUTH_KEY_2G select MF/ADF.ISIM/EF.ISIM_SQN - select MF/ADF.ISD select MF/ADF.ARA-M aram_delete_all : File comparison: content export.script.tmp does not match content of export.script.ok -- test failed
====================================================================== FAIL: test (fsdump.test.test_case.test) ---------------------------------------------------------------------- Traceback (most recent call last): File "https://jenkins.osmocom.org/jenkins/job/master-pysim/JOB_TYPE=test,a1=default,a3=default,a4=default,label=simtester/ws/tests/pySim-shell_test/fsdump/test.py", line 41, in test self.assertEqualFiles("fsdump.json.tmp", File "https://jenkins.osmocom.org/jenkins/job/master-pysim/JOB_TYPE=test,a1=default,a3=default,a4=default,label=simtester/ws/tests/pySim-shell_test/utils.py", line 393, in assertEqualFiles self.assertEqual(ok_file_content, out_file_content, AssertionError: '{\n"[237292 chars]n}\n},\n"MF/ADF.ISD": {\n"path": [\n"MF",\n"AD[141 chars]}\n}' != '{\n"[237292 chars]n}\n}\n}\n}' : File comparison: content fsdump.json.tmp does not match content of fsdump.json.ok -- test failed
====================================================================== FAIL: test_est_scp02_csv (gp.test.test_case.test_est_scp02_csv) ---------------------------------------------------------------------- Traceback (most recent call last): File "https://jenkins.osmocom.org/jenkins/job/master-pysim/JOB_TYPE=test,a1=default,a3=default,a4=default,label=simtester/ws/tests/pySim-shell_test/gp/test.py", line 41, in test_est_scp02_csv self.runPySimShell(cardname, "test_est_scp02_csv.script", no_exceptions = True, add_csv = True) File "https://jenkins.osmocom.org/jenkins/job/master-pysim/JOB_TYPE=test,a1=default,a3=default,a4=default,label=simtester/ws/tests/pySim-shell_test/utils.py", line 282, in runPySimShell self.assertTrue(False, "Unexpected exceptions occurred!") AssertionError: False is not true : Unexpected exceptions occurred!
====================================================================== FAIL: test_est_scp02_direct (gp.test.test_case.test_est_scp02_direct) ---------------------------------------------------------------------- Traceback (most recent call last): File "https://jenkins.osmocom.org/jenkins/job/master-pysim/JOB_TYPE=test,a1=default,a3=default,a4=default,label=simtester/ws/tests/pySim-shell_test/gp/test.py", line 35, in test_est_scp02_direct self.runPySimShell(cardname, "test_est_scp02_direct.script", no_exceptions = True) File "https://jenkins.osmocom.org/jenkins/job/master-pysim/JOB_TYPE=test,a1=default,a3=default,a4=default,label=simtester/ws/tests/pySim-shell_test/utils.py", line 282, in runPySimShell self.assertTrue(False, "Unexpected exceptions occurred!") AssertionError: False is not true : Unexpected exceptions occurred!
====================================================================== FAIL: test_est_scp03_csv (gp.test.test_case.test_est_scp03_csv) ---------------------------------------------------------------------- Traceback (most recent call last): File "https://jenkins.osmocom.org/jenkins/job/master-pysim/JOB_TYPE=test,a1=default,a3=default,a4=default,label=simtester/ws/tests/pySim-shell_test/gp/test.py", line 56, in test_est_scp03_csv self.runPySimShell(cardname, "test_est_scp03_csv.script", no_exceptions = True, add_csv = True) File "https://jenkins.osmocom.org/jenkins/job/master-pysim/JOB_TYPE=test,a1=default,a3=default,a4=default,label=simtester/ws/tests/pySim-shell_test/utils.py", line 282, in runPySimShell self.assertTrue(False, "Unexpected exceptions occurred!") AssertionError: False is not true : Unexpected exceptions occurred!
====================================================================== FAIL: test_est_scp03_direct (gp.test.test_case.test_est_scp03_direct) ---------------------------------------------------------------------- Traceback (most recent call last): File "https://jenkins.osmocom.org/jenkins/job/master-pysim/JOB_TYPE=test,a1=default,a3=default,a4=default,label=simtester/ws/tests/pySim-shell_test/gp/test.py", line 51, in test_est_scp03_direct self.runPySimShell(cardname, "test_est_scp03_direct.script", no_exceptions = True) File "https://jenkins.osmocom.org/jenkins/job/master-pysim/JOB_TYPE=test,a1=default,a3=default,a4=default,label=simtester/ws/tests/pySim-shell_test/utils.py", line 282, in runPySimShell self.assertTrue(False, "Unexpected exceptions occurred!") AssertionError: False is not true : Unexpected exceptions occurred!
====================================================================== FAIL: test_get_status (gp.test.test_case.test_get_status) ---------------------------------------------------------------------- Traceback (most recent call last): File "https://jenkins.osmocom.org/jenkins/job/master-pysim/JOB_TYPE=test,a1=default,a3=default,a4=default,label=simtester/ws/tests/pySim-shell_test/gp/test.py", line 72, in test_get_status self.runPySimShell(cardname, "test_get_status.script", no_exceptions = True, add_csv = True) File "https://jenkins.osmocom.org/jenkins/job/master-pysim/JOB_TYPE=test,a1=default,a3=default,a4=default,label=simtester/ws/tests/pySim-shell_test/utils.py", line 282, in runPySimShell self.assertTrue(False, "Unexpected exceptions occurred!") AssertionError: False is not true : Unexpected exceptions occurred!
====================================================================== FAIL: test_put_delete_key (gp.test.test_case.test_put_delete_key) ---------------------------------------------------------------------- Traceback (most recent call last): File "https://jenkins.osmocom.org/jenkins/job/master-pysim/JOB_TYPE=test,a1=default,a3=default,a4=default,label=simtester/ws/tests/pySim-shell_test/gp/test.py", line 64, in test_put_delete_key self.runPySimShell(cardname, "test_put_delete_key.script", no_exceptions = True, add_csv = True) File "https://jenkins.osmocom.org/jenkins/job/master-pysim/JOB_TYPE=test,a1=default,a3=default,a4=default,label=simtester/ws/tests/pySim-shell_test/utils.py", line 282, in runPySimShell self.assertTrue(False, "Unexpected exceptions occurred!") AssertionError: False is not true : Unexpected exceptions occurred!
---------------------------------------------------------------------- Ran 35 tests in 388.221s
FAILED (failures=12, errors=1) Build step 'Execute shell' marked build as failure $ ssh-agent -k unset SSH_AUTH_SOCK; unset SSH_AGENT_PID; echo Agent pid 1448973 killed; [ssh-agent] Stopped. Archiving artifacts