Changes:
------------------------------------------ [...truncated 276.91 KiB...] ATR: 3B9F96801F878031E073FE211B674A357530350265F8 ICCID: 8949440000001155314 found ATR: 3b9f96803f87828031e073fe211f574543753130136502 -> no match, next card... found ATR: 3b991800118822334455667760 -> no match, next card... found ATR: 3b9f96801fc78031a073be21136744220610000001a9 -> no match, next card... found ATR: 3b9f96801fc78031a073be21136743200718000001a5 -> no match, next card... found ATR: 3b9f95801fc78031e073f62113674d4516004301008f -> no match, next card... found ATR: 3b9f96801f878031e073fe211b674a4c753034054ba9 -> no match, next card... found ATR: 3b9a940092027593110001020221 -> no match, next card... found ATR: 3b9f96801f878031e073fe211b674a357530350265f8 -> found ICCID: 8949440000001155314 searching for card: ATR: 3B9F96801F878031E073FE211B674A4C753034054BA9 ICCID: 8988211000000467343 found ATR: 3b9f96803f87828031e073fe211f574543753130136502 -> no match, next card... found ATR: 3b991800118822334455667760 -> no match, next card... found ATR: 3b9f96801fc78031a073be21136744220610000001a9 -> no match, next card... found ATR: 3b9f96801fc78031a073be21136743200718000001a5 -> no match, next card... found ATR: 3b9f95801fc78031e073f62113674d4516004301008f -> no match, next card... found ATR: 3b9f96801f878031e073fe211b674a4c753034054ba9 -> found ICCID: 8988211000000467343 searching for card: ATR: 3B9F96803F87828031E073FE211F574543753130136502 EID: 89049044900000000000000000102355 found ATR: 3b9f96803f87828031e073fe211f574543753130136502 -> found EID: 89049044900000000000000000102355 searching for card: ATR: 3B991800118822334455667760 ICCID: 2222334455667788990 found ATR: 3b9f96803f87828031e073fe211f574543753130136502 -> no match, next card... found ATR: 3b991800118822334455667760 -> found ICCID: 2222334455667788990 Cards: sysmoISIM-SJA5-S17: reader: 7 atr: 3B9F96801F878031E073FE211B674A357530350265F8 iccid: 8949440000001155314 eid: 0 adm1: 34173960 pin1: 0000 puk1: 15091909 SCP02_DEK_1: FFB53E96E5FF99731D51AD7BEAFD0E23 SCP02_ENC_1: 51D4FC44BCBA7C4589DFADA3297720AF SCP02_MAC_1: 0449699C472CE71E2FB7B56245EF7684 SCP03_DEK_1: 0 SCP03_ENC_1: 0 SCP03_MAC_1: 0 sysmoISIM-SJA2: reader: 5 atr: 3B9F96801F878031E073FE211B674A4C753034054BA9 iccid: 8988211000000467343 eid: 0 adm1: 67225880 pin1: 5563 puk1: 42936344 SCP02_DEK_1: AD1AF0EC5643FFD4986F0F00A48FF244 SCP02_ENC_1: 112788F75D15F678F51A8EB606766B16 SCP02_MAC_1: 02A6FC022F8F871611237F2A9FC72315 SCP03_DEK_1: 0 SCP03_ENC_1: 0 SCP03_MAC_1: 0 sysmoEUICC1-C2T: reader: 0 atr: 3B9F96803F87828031E073FE211F574543753130136502 eid: 89049044900000000000000000102355 iccid: 0 adm1: 0 pin1: 0 puk1: 0 SCP02_DEK_1: 0 SCP02_ENC_1: 0 SCP02_MAC_1: 0 SCP03_DEK_1: 9b3bf6fda1bc88d9bd6083bb704243f920702a9bd744a484482049ebdab40ef3 SCP03_ENC_1: 67230241fd09e4ff46f4b4db3450dd839bf8b545bdd70199ac2a7788e87e2243 SCP03_MAC_1: f80f4a71f6dbf7eca8cdc18a9c65c59abdd07e3da74b1c48e106954d76cb793f sysmoSIM-GR1: reader: 1 atr: 3B991800118822334455667760 iccid: 2222334455667788990 eid: 0 adm1: 0 pin1: 0 puk1: 0 SCP02_DEK_1: 0 SCP02_ENC_1: 0 SCP02_MAC_1: 0 SCP03_DEK_1: 0 SCP03_ENC_1: 0 SCP03_MAC_1: 0 initialization done -- continuing with testcase verify_adm.test ... ---------------------------------------------------------------------- Executing: https://jenkins.osmocom.org/jenkins/job/master-pysim/JOB_TYPE=test,a1=default,a3=default,a4=default,label=simtester/ws/pySim-shell.py -p 7 --script test_cmdline.script --noprompt --pin-adm 34173960 > pySim-shell_test_0.log 2>&1 Executing: https://jenkins.osmocom.org/jenkins/job/master-pysim/JOB_TYPE=test,a1=default,a3=default,a4=default,label=simtester/ws/pySim-shell.py -p 7 --script test_csv.script --noprompt --csv https://jenkins.osmocom.org/jenkins/job/master-pysim/JOB_TYPE=test,a1=default,a3=default,a4=default,label=simtester/ws/tests/pySim-shell_test/card_data.csv > pySim-shell_test_1.log 2>&1 Template: using template test_direct.template to generate file test_direct.script Executing: https://jenkins.osmocom.org/jenkins/job/master-pysim/JOB_TYPE=test,a1=default,a3=default,a4=default,label=simtester/ws/pySim-shell.py -p 7 --script test_direct.script --noprompt > pySim-shell_test_2.log 2>&1 ---------------------------------------------------------------------- testcase execution done -- cleaning up ... ok
====================================================================== ERROR: test (cardinfo.test.test_case.test) ---------------------------------------------------------------------- Traceback (most recent call last): File "https://jenkins.osmocom.org/jenkins/job/master-pysim/JOB_TYPE=test,a1=default,a3=default,a4=default,label=simtester/ws/tests/pySim-shell_test/cardinfo/test.py", line 30, in test self.runPySimShell(cardname, "test.script") File "https://jenkins.osmocom.org/jenkins/job/master-pysim/JOB_TYPE=test,a1=default,a3=default,a4=default,label=simtester/ws/tests/pySim-shell_test/utils.py", line 270, in runPySimShell raise RuntimeError("pySim-shell exits with error code %u" % rc) RuntimeError: pySim-shell exits with error code 512
====================================================================== ERROR: test_enable_disable_profile (euicc.test.test_case.test_enable_disable_profile) ---------------------------------------------------------------------- Traceback (most recent call last): File "https://jenkins.osmocom.org/jenkins/job/master-pysim/JOB_TYPE=test,a1=default,a3=default,a4=default,label=simtester/ws/tests/pySim-shell_test/euicc/test.py", line 62, in test_enable_disable_profile self.runPySimShell(cardname, "test_set_nickname.script") File "https://jenkins.osmocom.org/jenkins/job/master-pysim/JOB_TYPE=test,a1=default,a3=default,a4=default,label=simtester/ws/tests/pySim-shell_test/utils.py", line 270, in runPySimShell raise RuntimeError("pySim-shell exits with error code %u" % rc) RuntimeError: pySim-shell exits with error code 512
====================================================================== ERROR: test_get_eid (euicc.test.test_case.test_get_eid) ---------------------------------------------------------------------- Traceback (most recent call last): File "https://jenkins.osmocom.org/jenkins/job/master-pysim/JOB_TYPE=test,a1=default,a3=default,a4=default,label=simtester/ws/tests/pySim-shell_test/euicc/test.py", line 34, in test_get_eid self.runPySimShell(cardname, "test_get_eid.script") File "https://jenkins.osmocom.org/jenkins/job/master-pysim/JOB_TYPE=test,a1=default,a3=default,a4=default,label=simtester/ws/tests/pySim-shell_test/utils.py", line 270, in runPySimShell raise RuntimeError("pySim-shell exits with error code %u" % rc) RuntimeError: pySim-shell exits with error code 512
====================================================================== ERROR: test_get_euicc_info (euicc.test.test_case.test_get_euicc_info) ---------------------------------------------------------------------- Traceback (most recent call last): File "https://jenkins.osmocom.org/jenkins/job/master-pysim/JOB_TYPE=test,a1=default,a3=default,a4=default,label=simtester/ws/tests/pySim-shell_test/euicc/test.py", line 41, in test_get_euicc_info self.runPySimShell(cardname, "test_get_euicc_info.script") File "https://jenkins.osmocom.org/jenkins/job/master-pysim/JOB_TYPE=test,a1=default,a3=default,a4=default,label=simtester/ws/tests/pySim-shell_test/utils.py", line 270, in runPySimShell raise RuntimeError("pySim-shell exits with error code %u" % rc) RuntimeError: pySim-shell exits with error code 512
====================================================================== ERROR: test_get_profiles_info (euicc.test.test_case.test_get_profiles_info) ---------------------------------------------------------------------- Traceback (most recent call last): File "https://jenkins.osmocom.org/jenkins/job/master-pysim/JOB_TYPE=test,a1=default,a3=default,a4=default,label=simtester/ws/tests/pySim-shell_test/euicc/test.py", line 50, in test_get_profiles_info self.runPySimShell(cardname, "test_get_profiles_info.script") File "https://jenkins.osmocom.org/jenkins/job/master-pysim/JOB_TYPE=test,a1=default,a3=default,a4=default,label=simtester/ws/tests/pySim-shell_test/utils.py", line 270, in runPySimShell raise RuntimeError("pySim-shell exits with error code %u" % rc) RuntimeError: pySim-shell exits with error code 512
====================================================================== ERROR: test_list_and_rm_notif (euicc.test.test_case.test_list_and_rm_notif) ---------------------------------------------------------------------- Traceback (most recent call last): File "https://jenkins.osmocom.org/jenkins/job/master-pysim/JOB_TYPE=test,a1=default,a3=default,a4=default,label=simtester/ws/tests/pySim-shell_test/euicc/test.py", line 69, in test_list_and_rm_notif self.runPySimShell(cardname, "test_gen_notif.script") File "https://jenkins.osmocom.org/jenkins/job/master-pysim/JOB_TYPE=test,a1=default,a3=default,a4=default,label=simtester/ws/tests/pySim-shell_test/utils.py", line 270, in runPySimShell raise RuntimeError("pySim-shell exits with error code %u" % rc) RuntimeError: pySim-shell exits with error code 512
====================================================================== ERROR: test_est_scp03_csv (gp.test.test_case.test_est_scp03_csv) ---------------------------------------------------------------------- Traceback (most recent call last): File "https://jenkins.osmocom.org/jenkins/job/master-pysim/JOB_TYPE=test,a1=default,a3=default,a4=default,label=simtester/ws/tests/pySim-shell_test/gp/test.py", line 56, in test_est_scp03_csv self.runPySimShell(cardname, "test_est_scp03_csv.script", no_exceptions = True, add_csv = True) File "https://jenkins.osmocom.org/jenkins/job/master-pysim/JOB_TYPE=test,a1=default,a3=default,a4=default,label=simtester/ws/tests/pySim-shell_test/utils.py", line 270, in runPySimShell raise RuntimeError("pySim-shell exits with error code %u" % rc) RuntimeError: pySim-shell exits with error code 512
====================================================================== ERROR: test_est_scp03_direct (gp.test.test_case.test_est_scp03_direct) ---------------------------------------------------------------------- Traceback (most recent call last): File "https://jenkins.osmocom.org/jenkins/job/master-pysim/JOB_TYPE=test,a1=default,a3=default,a4=default,label=simtester/ws/tests/pySim-shell_test/gp/test.py", line 51, in test_est_scp03_direct self.runPySimShell(cardname, "test_est_scp03_direct.script", no_exceptions = True) File "https://jenkins.osmocom.org/jenkins/job/master-pysim/JOB_TYPE=test,a1=default,a3=default,a4=default,label=simtester/ws/tests/pySim-shell_test/utils.py", line 270, in runPySimShell raise RuntimeError("pySim-shell exits with error code %u" % rc) RuntimeError: pySim-shell exits with error code 512
====================================================================== ERROR: test_get_status (gp.test.test_case.test_get_status) ---------------------------------------------------------------------- Traceback (most recent call last): File "https://jenkins.osmocom.org/jenkins/job/master-pysim/JOB_TYPE=test,a1=default,a3=default,a4=default,label=simtester/ws/tests/pySim-shell_test/gp/test.py", line 72, in test_get_status self.runPySimShell(cardname, "test_get_status.script", no_exceptions = True, add_csv = True) File "https://jenkins.osmocom.org/jenkins/job/master-pysim/JOB_TYPE=test,a1=default,a3=default,a4=default,label=simtester/ws/tests/pySim-shell_test/utils.py", line 270, in runPySimShell raise RuntimeError("pySim-shell exits with error code %u" % rc) RuntimeError: pySim-shell exits with error code 512
====================================================================== ERROR: test_put_delete_key (gp.test.test_case.test_put_delete_key) ---------------------------------------------------------------------- Traceback (most recent call last): File "https://jenkins.osmocom.org/jenkins/job/master-pysim/JOB_TYPE=test,a1=default,a3=default,a4=default,label=simtester/ws/tests/pySim-shell_test/gp/test.py", line 64, in test_put_delete_key self.runPySimShell(cardname, "test_put_delete_key.script", no_exceptions = True, add_csv = True) File "https://jenkins.osmocom.org/jenkins/job/master-pysim/JOB_TYPE=test,a1=default,a3=default,a4=default,label=simtester/ws/tests/pySim-shell_test/utils.py", line 270, in runPySimShell raise RuntimeError("pySim-shell exits with error code %u" % rc) RuntimeError: pySim-shell exits with error code 512
====================================================================== FAIL: test (authenticate.test.test_case.test) ---------------------------------------------------------------------- Traceback (most recent call last): File "https://jenkins.osmocom.org/jenkins/job/master-pysim/JOB_TYPE=test,a1=default,a3=default,a4=default,label=simtester/ws/tests/pySim-shell_test/authenticate/test.py", line 31, in test self.assertEqualFiles("auth_result.tmp") File "https://jenkins.osmocom.org/jenkins/job/master-pysim/JOB_TYPE=test,a1=default,a3=default,a4=default,label=simtester/ws/tests/pySim-shell_test/utils.py", line 399, in assertEqualFiles self.assertEqual(ok_file_content, out_file_content, AssertionError: '{\n "successful_3g_authentication": {[179 chars]n}\n' != '' - { - "successful_3g_authentication": { - "res": "13484811d553ab35", - "ck": "0f93c4807f4ff57c6cd348fea590c06d", - "ik": "608e7bff4856c73e363e795b165a4158", - "kc": "35f08eda84d3b377" - } - } : File comparison: content auth_result.tmp does not match content of auth_result.ok -- test failed
====================================================================== FAIL: test_est_scp02_csv (gp.test.test_case.test_est_scp02_csv) ---------------------------------------------------------------------- Traceback (most recent call last): File "https://jenkins.osmocom.org/jenkins/job/master-pysim/JOB_TYPE=test,a1=default,a3=default,a4=default,label=simtester/ws/tests/pySim-shell_test/gp/test.py", line 41, in test_est_scp02_csv self.runPySimShell(cardname, "test_est_scp02_csv.script", no_exceptions = True, add_csv = True) File "https://jenkins.osmocom.org/jenkins/job/master-pysim/JOB_TYPE=test,a1=default,a3=default,a4=default,label=simtester/ws/tests/pySim-shell_test/utils.py", line 288, in runPySimShell self.assertTrue(False, "Unexpected exceptions occurred!") AssertionError: False is not true : Unexpected exceptions occurred!
====================================================================== FAIL: test_est_scp02_direct (gp.test.test_case.test_est_scp02_direct) ---------------------------------------------------------------------- Traceback (most recent call last): File "https://jenkins.osmocom.org/jenkins/job/master-pysim/JOB_TYPE=test,a1=default,a3=default,a4=default,label=simtester/ws/tests/pySim-shell_test/gp/test.py", line 35, in test_est_scp02_direct self.runPySimShell(cardname, "test_est_scp02_direct.script", no_exceptions = True) File "https://jenkins.osmocom.org/jenkins/job/master-pysim/JOB_TYPE=test,a1=default,a3=default,a4=default,label=simtester/ws/tests/pySim-shell_test/utils.py", line 288, in runPySimShell self.assertTrue(False, "Unexpected exceptions occurred!") AssertionError: False is not true : Unexpected exceptions occurred!
---------------------------------------------------------------------- Ran 35 tests in 441.722s
FAILED (failures=3, errors=10) Build step 'Execute shell' marked build as failure $ ssh-agent -k unset SSH_AUTH_SOCK; unset SSH_AGENT_PID; echo Agent pid 1600516 killed; [ssh-agent] Stopped. Archiving artifacts
jenkins-notifications@lists.osmocom.org