Build failed in Jenkins: master-osmo-bsc » a1=default,a2=default,a3=default,a4=default,osmocom-master-debian9 #15355

jenkins at lists.osmocom.org jenkins at lists.osmocom.org
Wed Aug 18 06:19:25 UTC 2021


See <https://jenkins.osmocom.org/jenkins/job/master-osmo-bsc/a1=default,a2=default,a3=default,a4=default,label=osmocom-master-debian9/15355/display/redirect>

Changes:


------------------------------------------
[...truncated 883.30 KB...]
build    15975  0.0  0.0   4280   712 ?        S    06:19   0:00 /bin/sh -c ps xua | grep osmo
build    15977  0.0  0.0  12784   972 ?        S    06:19   0:00 grep osmo

ok
test_unknown_command (__main__.TestVTY) ... Socket: in 1 tries, connected to 127.0.0.1:4242 <socket.socket fd=4, family=AddressFamily.AF_INET, type=SocketKind.SOCK_STREAM, proto=0, laddr=('127.0.0.1', 34844), raddr=('127.0.0.1', 4242)> (1 sockets open)
Socket: closing 127.0.0.1:4242 <socket.socket fd=4, family=AddressFamily.AF_INET, type=SocketKind.SOCK_STREAM, proto=0, laddr=('127.0.0.1', 34844), raddr=('127.0.0.1', 4242)> (0 sockets open)
Launch: ./src/osmo-bsc/osmo-bsc -c /build/doc/examples/osmo-bsc/osmo-bsc.cfg from /build
Launching: PWD=/build './src/osmo-bsc/osmo-bsc' '-c' '/build/doc/examples/osmo-bsc/osmo-bsc.cfg'

> ls -l /proc/15956/fd
total 0
lr-x------ 1 build build 64 Aug 18 06:19 0 -> pipe:[469417942]
l-wx------ 1 build build 64 Aug 18 06:19 1 -> pipe:[469417943]
l-wx------ 1 build build 64 Aug 18 06:19 2 -> pipe:[469417944]
l-wx------ 1 build build 64 Aug 18 06:19 3 -> /dev/null


> ss -tn
State      Recv-Q Send-Q Local Address:Port               Peer Address:Port              


> ss -tln
State      Recv-Q Send-Q Local Address:Port               Peer Address:Port              


> ps xua | grep osmo
build    15956 15.0  0.0  53672 20972 ?        S    06:19   0:00 /usr/bin/python3 /usr/local/bin/osmotestvty.py -p /build -w /build -v
build    15979  0.0  0.0 21474986468 35180 ?   R    06:19   0:00 ./src/osmo-bsc/osmo-bsc -c /build/doc/examples/osmo-bsc/osmo-bsc.cfg
build    15986  0.0  0.0   4280   796 ?        S    06:19   0:00 /bin/sh -c ps xua | grep osmo
build    15988  0.0  0.0  12784   980 ?        S    06:19   0:00 grep osmo

ok

----------------------------------------------------------------------
Ran 3 tests in 0.698s

OK
Socket: in 1 tries, connected to 127.0.0.1:4242 <socket.socket fd=4, family=AddressFamily.AF_INET, type=SocketKind.SOCK_STREAM, proto=0, laddr=('127.0.0.1', 34846), raddr=('127.0.0.1', 4242)> (1 sockets open)
Socket: closing 127.0.0.1:4242 <socket.socket fd=4, family=AddressFamily.AF_INET, type=SocketKind.SOCK_STREAM, proto=0, laddr=('127.0.0.1', 34846), raddr=('127.0.0.1', 4242)> (0 sockets open)
osmotestconfig.py -p /build -w /build -v
Verifying src/osmo-bsc/osmo-bsc -c /build/doc/examples/osmo-bsc/osmo-bsc.cfg, test verify_doc
Opening /dev/null
Launching: PWD=/build 'src/osmo-bsc/osmo-bsc' '-c' '/build/doc/examples/osmo-bsc/osmo-bsc.cfg'

> ls -l /proc/15990/fd
total 0
lr-x------ 1 build build 64 Aug 18 06:19 0 -> pipe:[469417942]
l-wx------ 1 build build 64 Aug 18 06:19 1 -> pipe:[469417943]
l-wx------ 1 build build 64 Aug 18 06:19 2 -> pipe:[469417944]
l-wx------ 1 build build 64 Aug 18 06:19 3 -> /dev/null
Warning: doc/examples/osmo-bsc/osmo-bsc-minimal.cfg is not being tested
Warning: doc/examples/osmo-bsc/siemens/osmo-bsc.bs11.cfg is not being tested
Warning: doc/examples/osmo-bsc/ericsson/osmo-bsc.rbs2308.cfg is not being tested
Warning: doc/examples/osmo-bsc/ericsson/osmo-bsc.dug20-rus02-4trx.cfg is not being tested
Warning: doc/examples/osmo-bsc/ericsson/osmo-bsc.dug20-rus02-8trx.cfg is not being tested
Warning: doc/examples/osmo-bsc/ericsson/osmo-bsc.dug20-rus01-4trx.cfg is not being tested
Warning: doc/examples/osmo-bsc/nokia/osmo-bsc.insite.cfg is not being tested


> ss -tn
State      Recv-Q Send-Q Local Address:Port               Peer Address:Port              


> ss -tln
State      Recv-Q Send-Q Local Address:Port               Peer Address:Port              


> ps xua | grep osmo
build    15990  0.0  0.0  53744 20632 ?        S    06:19   0:00 /usr/bin/python3 /usr/local/bin/osmotestconfig.py -p /build -w /build -v
build    15991  0.0  0.0 21474988588 36028 ?   S    06:19   0:00 src/osmo-bsc/osmo-bsc -c /build/doc/examples/osmo-bsc/osmo-bsc.cfg
build    15998  0.0  0.0   4280   748 ?        S    06:19   0:00 /bin/sh -c ps xua | grep osmo
build    16000  0.0  0.0  12784   928 ?        S    06:19   0:00 grep osmo

Socket: in 1 tries, connected to 127.0.0.1:4242 <socket.socket fd=4, family=AddressFamily.AF_INET, type=SocketKind.SOCK_STREAM, proto=0, laddr=('127.0.0.1', 34848), raddr=('127.0.0.1', 4242)> (1 sockets open)
Terminating took 0.897s
Socket: closing 127.0.0.1:4242 <socket.socket fd=4, family=AddressFamily.AF_INET, type=SocketKind.SOCK_STREAM, proto=0, laddr=('127.0.0.1', 34848), raddr=('127.0.0.1', 4242)> (0 sockets open)
Verifying src/osmo-bsc/osmo-bsc -c /build/writtenconfig/osmo-bsc.cfglye1b3f7, test write_config
Launching: PWD=/build 'src/osmo-bsc/osmo-bsc' '-c' '/build/writtenconfig/osmo-bsc.cfglye1b3f7'

> ls -l /proc/15990/fd
total 0
lr-x------ 1 build build 64 Aug 18 06:19 0 -> pipe:[469417942]
l-wx------ 1 build build 64 Aug 18 06:19 1 -> pipe:[469417943]
l-wx------ 1 build build 64 Aug 18 06:19 2 -> pipe:[469417944]
l-wx------ 1 build build 64 Aug 18 06:19 3 -> /dev/null
Documentation error (missing docs): 
<command id='no mgw reset-endpoint NAME'>
        <param name='NAME' doc='(null)' />



> ss -tn
State      Recv-Q Send-Q Local Address:Port               Peer Address:Port              


> ss -tln
State      Recv-Q Send-Q Local Address:Port               Peer Address:Port              


> ps xua | grep osmo
build    15990  9.5  0.0  54236 21212 ?        S    06:19   0:00 /usr/bin/python3 /usr/local/bin/osmotestconfig.py -p /build -w /build -v
build    16002  0.0  0.0 21474986304 34548 ?   R    06:19   0:00 src/osmo-bsc/osmo-bsc -c /build/writtenconfig/osmo-bsc.cfglye1b3f7
build    16009  0.0  0.0   4280   748 ?        S    06:19   0:00 /bin/sh -c ps xua | grep osmo
build    16011  0.0  0.0  12784   932 ?        R    06:19   0:00 grep osmo

Connecting socket failed, retrying...
Socket: in 2 tries, connected to 127.0.0.1:4242 <socket.socket fd=5, family=AddressFamily.AF_INET, type=SocketKind.SOCK_STREAM, proto=0, laddr=('127.0.0.1', 34858), raddr=('127.0.0.1', 4242)> (1 sockets open)
Terminating took 0.475s
Socket: closing 127.0.0.1:4242 <socket.socket fd=5, family=AddressFamily.AF_INET, type=SocketKind.SOCK_STREAM, proto=0, laddr=('127.0.0.1', 34858), raddr=('127.0.0.1', 4242)> (0 sockets open)
Verifying src/osmo-bsc/osmo-bsc -c /build/writtenconfig/osmo-bsc.cfglye1b3f7, test token_vty_command
Launching: PWD=/build 'src/osmo-bsc/osmo-bsc' '-c' '/build/writtenconfig/osmo-bsc.cfglye1b3f7'

> ls -l /proc/15990/fd
total 0
lr-x------ 1 build build 64 Aug 18 06:19 0 -> pipe:[469417942]
l-wx------ 1 build build 64 Aug 18 06:19 1 -> pipe:[469417943]
l-wx------ 1 build build 64 Aug 18 06:19 2 -> pipe:[469417944]
l-wx------ 1 build build 64 Aug 18 06:19 3 -> /dev/null


> ss -tn
State      Recv-Q Send-Q Local Address:Port               Peer Address:Port              


> ss -tln
State      Recv-Q Send-Q Local Address:Port               Peer Address:Port              


> ps xua | grep osmo
build    15990  6.3  0.0  54236 21276 ?        S    06:19   0:00 /usr/bin/python3 /usr/local/bin/osmotestconfig.py -p /build -w /build -v
build    16013  0.0  0.0 21474986304 31164 ?   R    06:19   0:00 src/osmo-bsc/osmo-bsc -c /build/writtenconfig/osmo-bsc.cfglye1b3f7
build    16020  0.0  0.0   4280   736 ?        S    06:19   0:00 /bin/sh -c ps xua | grep osmo
build    16022  0.0  0.0  12784   952 ?        S    06:19   0:00 grep osmo

Connecting socket failed, retrying...
Socket: in 2 tries, connected to 127.0.0.1:4242 <socket.socket fd=5, family=AddressFamily.AF_INET, type=SocketKind.SOCK_STREAM, proto=0, laddr=('127.0.0.1', 34864), raddr=('127.0.0.1', 4242)> (1 sockets open)
Socket: closing 127.0.0.1:4242 <socket.socket fd=5, family=AddressFamily.AF_INET, type=SocketKind.SOCK_STREAM, proto=0, laddr=('127.0.0.1', 34864), raddr=('127.0.0.1', 4242)> (0 sockets open)
Verifying src/osmo-bsc/osmo-bsc -c /build/doc/examples/osmo-bsc/osmo-bsc_custom-sccp.cfg, test verify_doc
Launching: PWD=/build 'src/osmo-bsc/osmo-bsc' '-c' '/build/doc/examples/osmo-bsc/osmo-bsc_custom-sccp.cfg'

> ls -l /proc/15990/fd
total 0
lr-x------ 1 build build 64 Aug 18 06:19 0 -> pipe:[469417942]
l-wx------ 1 build build 64 Aug 18 06:19 1 -> pipe:[469417943]
l-wx------ 1 build build 64 Aug 18 06:19 2 -> pipe:[469417944]
l-wx------ 1 build build 64 Aug 18 06:19 3 -> /dev/null


> ss -tn
State      Recv-Q Send-Q Local Address:Port               Peer Address:Port              


> ss -tln
State      Recv-Q Send-Q Local Address:Port               Peer Address:Port              


> ps xua | grep osmo
build    15990  6.3  0.0  54236 21276 ?        S    06:19   0:00 /usr/bin/python3 /usr/local/bin/osmotestconfig.py -p /build -w /build -v
build    16024  0.0  0.0 21474986304 34620 ?   R    06:19   0:00 src/osmo-bsc/osmo-bsc -c /build/doc/examples/osmo-bsc/osmo-bsc_custom-sccp.cfg
build    16031  0.0  0.0   4280   736 ?        S    06:19   0:00 /bin/sh -c ps xua | grep osmo
build    16033  0.0  0.0  12784   944 ?        S    06:19   0:00 grep osmo

Connecting socket failed, retrying...
Socket: in 2 tries, connected to 127.0.0.1:4242 <socket.socket fd=5, family=AddressFamily.AF_INET, type=SocketKind.SOCK_STREAM, proto=0, laddr=('127.0.0.1', 34868), raddr=('127.0.0.1', 4242)> (1 sockets open)
Terminating took 0.475s
Socket: closing 127.0.0.1:4242 <socket.socket fd=5, family=AddressFamily.AF_INET, type=SocketKind.SOCK_STREAM, proto=0, laddr=('127.0.0.1', 34868), raddr=('127.0.0.1', 4242)> (0 sockets open)
Verifying src/osmo-bsc/osmo-bsc -c /build/writtenconfig/osmo-bsc_custom-sccp.cfg3v5v0wpv, test write_config
Launching: PWD=/build 'src/osmo-bsc/osmo-bsc' '-c' '/build/writtenconfig/osmo-bsc_custom-sccp.cfg3v5v0wpv'

> ls -l /proc/15990/fd
total 0
lr-x------ 1 build build 64 Aug 18 06:19 0 -> pipe:[469417942]
l-wx------ 1 build build 64 Aug 18 06:19 1 -> pipe:[469417943]
l-wx------ 1 build build 64 Aug 18 06:19 2 -> pipe:[469417944]
l-wx------ 1 build build 64 Aug 18 06:19 3 -> /dev/null
Documentation error (missing docs): 
<command id='no mgw reset-endpoint NAME'>
        <param name='NAME' doc='(null)' />



> ss -tn
State      Recv-Q Send-Q Local Address:Port               Peer Address:Port              


> ss -tln
State      Recv-Q Send-Q Local Address:Port               Peer Address:Port              


> ps xua | grep osmo
build    15990  5.5  0.0  54344 21288 ?        S    06:19   0:00 /usr/bin/python3 /usr/local/bin/osmotestconfig.py -p /build -w /build -v
build    16035  0.0  0.0 21474986304 30860 ?   R    06:19   0:00 src/osmo-bsc/osmo-bsc -c /build/writtenconfig/osmo-bsc_custom-sccp.cfg3v5v0wpv
build    16042  0.0  0.0   4280   748 ?        S    06:19   0:00 /bin/sh -c ps xua | grep osmo
build    16044  0.0  0.0  12784   968 ?        S    06:19   0:00 grep osmo

Connecting socket failed, retrying...
Socket: in 2 tries, connected to 127.0.0.1:4242 <socket.socket fd=5, family=AddressFamily.AF_INET, type=SocketKind.SOCK_STREAM, proto=0, laddr=('127.0.0.1', 34878), raddr=('127.0.0.1', 4242)> (1 sockets open)
Terminating took 0.475s
Socket: closing 127.0.0.1:4242 <socket.socket fd=5, family=AddressFamily.AF_INET, type=SocketKind.SOCK_STREAM, proto=0, laddr=('127.0.0.1', 34878), raddr=('127.0.0.1', 4242)> (0 sockets open)
Verifying src/osmo-bsc/osmo-bsc -c /build/writtenconfig/osmo-bsc_custom-sccp.cfg3v5v0wpv, test token_vty_command
Launching: PWD=/build 'src/osmo-bsc/osmo-bsc' '-c' '/build/writtenconfig/osmo-bsc_custom-sccp.cfg3v5v0wpv'

> ls -l /proc/15990/fd
total 0
lr-x------ 1 build build 64 Aug 18 06:19 0 -> pipe:[469417942]
l-wx------ 1 build build 64 Aug 18 06:19 1 -> pipe:[469417943]
l-wx------ 1 build build 64 Aug 18 06:19 2 -> pipe:[469417944]
l-wx------ 1 build build 64 Aug 18 06:19 3 -> /dev/null


> ss -tn
State      Recv-Q Send-Q Local Address:Port               Peer Address:Port              


> ss -tln
State      Recv-Q Send-Q Local Address:Port               Peer Address:Port              


> ps xua | grep osmo
build    15990  3.8  0.0  54344 21288 ?        S    06:19   0:00 /usr/bin/python3 /usr/local/bin/osmotestconfig.py -p /build -w /build -v
build    16046  0.0  0.0 21474986304 30724 ?   R    06:19   0:00 src/osmo-bsc/osmo-bsc -c /build/writtenconfig/osmo-bsc_custom-sccp.cfg3v5v0wpv
build    16053  0.0  0.0   4280   752 ?        S    06:19   0:00 /bin/sh -c ps xua | grep osmo
build    16055  0.0  0.0  12784   948 ?        S    06:19   0:00 grep osmo

ERRORS: 2
Connecting socket failed, retrying...
Socket: in 2 tries, connected to 127.0.0.1:4242 <socket.socket fd=5, family=AddressFamily.AF_INET, type=SocketKind.SOCK_STREAM, proto=0, laddr=('127.0.0.1', 34886), raddr=('127.0.0.1', 4242)> (1 sockets open)
Terminating took 0.897s
Socket: closing 127.0.0.1:4242 <socket.socket fd=5, family=AddressFamily.AF_INET, type=SocketKind.SOCK_STREAM, proto=0, laddr=('127.0.0.1', 34886), raddr=('127.0.0.1', 4242)> (0 sockets open)
Makefile:708: recipe for target 'python-tests' failed
make[5]: Leaving directory '/build/tests'
make[5]: *** [python-tests] Error 2
make[4]: *** [check-local] Error 2
Makefile:730: recipe for target 'check-local' failed
make[4]: Leaving directory '/build/tests'
make[3]: *** [check-am] Error 2
Makefile:568: recipe for target 'check-am' failed
make[3]: Leaving directory '/build/tests'
make[2]: *** [check-recursive] Error 1
Makefile:420: recipe for target 'check-recursive' failed
make[2]: Leaving directory '/build/tests'
make[1]: *** [check-recursive] Error 1
Makefile:453: recipe for target 'check-recursive' failed
make[1]: Leaving directory '/build'
Makefile:744: recipe for target 'check' failed
make: *** [check] Error 2
+ cat-testlogs.sh
Build step 'Execute shell' marked build as failure
[WARNINGS]Skipping publisher since build result is FAILURE


More information about the jenkins-notifications mailing list