Build failed in Jenkins: master-osmo-bsc » a1=default,a2=default,a3=default,a4=default,osmocom-master-debian9 #15356

jenkins at lists.osmocom.org jenkins at lists.osmocom.org
Wed Aug 18 06:30:40 UTC 2021


See <https://jenkins.osmocom.org/jenkins/job/master-osmo-bsc/a1=default,a2=default,a3=default,a4=default,label=osmocom-master-debian9/15356/display/redirect>

Changes:


------------------------------------------
[...truncated 882.93 KB...]
test_unknown_command (__main__.TestVTY) ... Socket: in 1 tries, connected to 127.0.0.1:4242 <socket.socket fd=4, family=AddressFamily.AF_INET, type=SocketKind.SOCK_STREAM, proto=0, laddr=('127.0.0.1', 34230), raddr=('127.0.0.1', 4242)> (1 sockets open)
Socket: closing 127.0.0.1:4242 <socket.socket fd=4, family=AddressFamily.AF_INET, type=SocketKind.SOCK_STREAM, proto=0, laddr=('127.0.0.1', 34230), raddr=('127.0.0.1', 4242)> (0 sockets open)
Terminating took 0.897s
Launch: ./src/osmo-bsc/osmo-bsc -c /build/doc/examples/osmo-bsc/osmo-bsc.cfg from /build
Launching: PWD=/build './src/osmo-bsc/osmo-bsc' '-c' '/build/doc/examples/osmo-bsc/osmo-bsc.cfg'

> ls -l /proc/15952/fd
total 0
lr-x------ 1 build build 64 Aug 18 06:30 0 -> pipe:[1608609367]
l-wx------ 1 build build 64 Aug 18 06:30 1 -> pipe:[1608609368]
l-wx------ 1 build build 64 Aug 18 06:30 2 -> pipe:[1608609369]
l-wx------ 1 build build 64 Aug 18 06:30 3 -> /dev/null


> ss -tn
State      Recv-Q Send-Q Local Address:Port               Peer Address:Port              


> ss -tln
State      Recv-Q Send-Q Local Address:Port               Peer Address:Port              


> ps xua | grep osmo
build    15952  3.6  0.0  53720 20884 ?        S    06:30   0:00 /usr/bin/python3 /usr/local/bin/osmotestvty.py -p /build -w /build -v
build    15975  0.0  0.0 21474986304 41312 ?   R    06:30   0:00 ./src/osmo-bsc/osmo-bsc -c /build/doc/examples/osmo-bsc/osmo-bsc.cfg
build    15982  0.0  0.0   4280   740 ?        S    06:30   0:00 /bin/sh -c ps xua | grep osmo
build    15984  0.0  0.0  12784   968 ?        S    06:30   0:00 grep osmo

ok

----------------------------------------------------------------------
Ran 3 tests in 3.174s

OK
Connecting socket failed, retrying...
Socket: in 2 tries, connected to 127.0.0.1:4242 <socket.socket fd=5, family=AddressFamily.AF_INET, type=SocketKind.SOCK_STREAM, proto=0, laddr=('127.0.0.1', 34246), raddr=('127.0.0.1', 4242)> (1 sockets open)
Socket: closing 127.0.0.1:4242 <socket.socket fd=5, family=AddressFamily.AF_INET, type=SocketKind.SOCK_STREAM, proto=0, laddr=('127.0.0.1', 34246), raddr=('127.0.0.1', 4242)> (0 sockets open)
osmotestconfig.py -p /build -w /build -v
Verifying src/osmo-bsc/osmo-bsc -c /build/doc/examples/osmo-bsc/osmo-bsc.cfg, test verify_doc
Opening /dev/null
Launching: PWD=/build 'src/osmo-bsc/osmo-bsc' '-c' '/build/doc/examples/osmo-bsc/osmo-bsc.cfg'

> ls -l /proc/15986/fd
total 0
lr-x------ 1 build build 64 Aug 18 06:30 0 -> pipe:[1608609367]
l-wx------ 1 build build 64 Aug 18 06:30 1 -> pipe:[1608609368]
l-wx------ 1 build build 64 Aug 18 06:30 2 -> pipe:[1608609369]
l-wx------ 1 build build 64 Aug 18 06:30 3 -> /dev/null


> ss -tn
Warning: doc/examples/osmo-bsc/osmo-bsc-minimal.cfg is not being tested
Warning: doc/examples/osmo-bsc/ericsson/osmo-bsc.dug20-rus02-4trx.cfg is not being tested
Warning: doc/examples/osmo-bsc/ericsson/osmo-bsc.dug20-rus01-4trx.cfg is not being tested
Warning: doc/examples/osmo-bsc/ericsson/osmo-bsc.rbs2308.cfg is not being tested
Warning: doc/examples/osmo-bsc/ericsson/osmo-bsc.dug20-rus02-8trx.cfg is not being tested
Warning: doc/examples/osmo-bsc/siemens/osmo-bsc.bs11.cfg is not being tested
Warning: doc/examples/osmo-bsc/nokia/osmo-bsc.insite.cfg is not being tested
State      Recv-Q Send-Q Local Address:Port               Peer Address:Port              


> ss -tln
State      Recv-Q Send-Q Local Address:Port               Peer Address:Port              


> ps xua | grep osmo
build    15986  0.0  0.0  53808 20748 ?        S    06:30   0:00 /usr/bin/python3 /usr/local/bin/osmotestconfig.py -p /build -w /build -v
build    15987  0.0  0.0 21474986304 43944 ?   R    06:30   0:00 src/osmo-bsc/osmo-bsc -c /build/doc/examples/osmo-bsc/osmo-bsc.cfg
build    15994  0.0  0.0   4280   732 ?        S    06:30   0:00 /bin/sh -c ps xua | grep osmo
build    15996  0.0  0.0  12784   972 ?        S    06:30   0:00 grep osmo

Connecting socket failed, retrying...
Socket: in 2 tries, connected to 127.0.0.1:4242 <socket.socket fd=5, family=AddressFamily.AF_INET, type=SocketKind.SOCK_STREAM, proto=0, laddr=('127.0.0.1', 34250), raddr=('127.0.0.1', 4242)> (1 sockets open)
Terminating took 0.475s
Socket: closing 127.0.0.1:4242 <socket.socket fd=5, family=AddressFamily.AF_INET, type=SocketKind.SOCK_STREAM, proto=0, laddr=('127.0.0.1', 34250), raddr=('127.0.0.1', 4242)> (0 sockets open)
Verifying src/osmo-bsc/osmo-bsc -c /build/writtenconfig/osmo-bsc.cfg0_lhgqng, test write_config
Launching: PWD=/build 'src/osmo-bsc/osmo-bsc' '-c' '/build/writtenconfig/osmo-bsc.cfg0_lhgqng'

> ls -l /proc/15986/fd
total 0
lr-x------ 1 build build 64 Aug 18 06:30 0 -> pipe:[1608609367]
l-wx------ 1 build build 64 Aug 18 06:30 1 -> pipe:[1608609368]
l-wx------ 1 build build 64 Aug 18 06:30 2 -> pipe:[1608609369]
l-wx------ 1 build build 64 Aug 18 06:30 3 -> /dev/null


> ss -tn
Documentation error (missing docs): 
<command id='no mgw reset-endpoint NAME'>
        <param name='NAME' doc='(null)' />

State      Recv-Q Send-Q Local Address:Port               Peer Address:Port              


> ss -tln
State      Recv-Q Send-Q Local Address:Port               Peer Address:Port              


> ps xua | grep osmo
build    15986 13.0  0.0  54232 21452 ?        S    06:30   0:00 /usr/bin/python3 /usr/local/bin/osmotestconfig.py -p /build -w /build -v
build    15998  0.0  0.0 21474986304 40936 ?   R    06:30   0:00 src/osmo-bsc/osmo-bsc -c /build/writtenconfig/osmo-bsc.cfg0_lhgqng
build    16005  0.0  0.0   4280   716 ?        S    06:30   0:00 /bin/sh -c ps xua | grep osmo
build    16007  0.0  0.0  12784   956 ?        S    06:30   0:00 grep osmo

Connecting socket failed, retrying...
Socket: in 2 tries, connected to 127.0.0.1:4242 <socket.socket fd=5, family=AddressFamily.AF_INET, type=SocketKind.SOCK_STREAM, proto=0, laddr=('127.0.0.1', 34272), raddr=('127.0.0.1', 4242)> (1 sockets open)
Terminating took 0.897s
Socket: closing 127.0.0.1:4242 <socket.socket fd=5, family=AddressFamily.AF_INET, type=SocketKind.SOCK_STREAM, proto=0, laddr=('127.0.0.1', 34272), raddr=('127.0.0.1', 4242)> (0 sockets open)
Verifying src/osmo-bsc/osmo-bsc -c /build/writtenconfig/osmo-bsc.cfg0_lhgqng, test token_vty_command
Launching: PWD=/build 'src/osmo-bsc/osmo-bsc' '-c' '/build/writtenconfig/osmo-bsc.cfg0_lhgqng'

> ls -l /proc/15986/fd
total 0
lr-x------ 1 build build 64 Aug 18 06:30 0 -> pipe:[1608609367]
l-wx------ 1 build build 64 Aug 18 06:30 1 -> pipe:[1608609368]
l-wx------ 1 build build 64 Aug 18 06:30 2 -> pipe:[1608609369]
l-wx------ 1 build build 64 Aug 18 06:30 3 -> /dev/null


> ss -tn
State      Recv-Q Send-Q Local Address:Port               Peer Address:Port              


> ss -tln
State      Recv-Q Send-Q Local Address:Port               Peer Address:Port              


> ps xua | grep osmo
build    15986  4.6  0.0  54232 21452 ?        S    06:30   0:00 /usr/bin/python3 /usr/local/bin/osmotestconfig.py -p /build -w /build -v
build    16009  0.0  0.0 21474986304 43980 ?   R    06:30   0:00 src/osmo-bsc/osmo-bsc -c /build/writtenconfig/osmo-bsc.cfg0_lhgqng
build    16016  0.0  0.0   4280   752 ?        S    06:30   0:00 /bin/sh -c ps xua | grep osmo
build    16018  0.0  0.0  12784   964 ?        S    06:30   0:00 grep osmo

Connecting socket failed, retrying...
Socket: in 2 tries, connected to 127.0.0.1:4242 <socket.socket fd=5, family=AddressFamily.AF_INET, type=SocketKind.SOCK_STREAM, proto=0, laddr=('127.0.0.1', 34284), raddr=('127.0.0.1', 4242)> (1 sockets open)
Terminating took 0.897s
Socket: closing 127.0.0.1:4242 <socket.socket fd=5, family=AddressFamily.AF_INET, type=SocketKind.SOCK_STREAM, proto=0, laddr=('127.0.0.1', 34284), raddr=('127.0.0.1', 4242)> (0 sockets open)
Verifying src/osmo-bsc/osmo-bsc -c /build/doc/examples/osmo-bsc/osmo-bsc_custom-sccp.cfg, test verify_doc
Launching: PWD=/build 'src/osmo-bsc/osmo-bsc' '-c' '/build/doc/examples/osmo-bsc/osmo-bsc_custom-sccp.cfg'

> ls -l /proc/15986/fd
total 0
lr-x------ 1 build build 64 Aug 18 06:30 0 -> pipe:[1608609367]
l-wx------ 1 build build 64 Aug 18 06:30 1 -> pipe:[1608609368]
l-wx------ 1 build build 64 Aug 18 06:30 2 -> pipe:[1608609369]
l-wx------ 1 build build 64 Aug 18 06:30 3 -> /dev/null


> ss -tn
State      Recv-Q Send-Q Local Address:Port               Peer Address:Port              


> ss -tln
State      Recv-Q Send-Q Local Address:Port               Peer Address:Port              


> ps xua | grep osmo
build    15986  2.8  0.0  54232 21452 ?        S    06:30   0:00 /usr/bin/python3 /usr/local/bin/osmotestconfig.py -p /build -w /build -v
build    16020  0.0  0.0 21474986304 43304 ?   R    06:30   0:00 src/osmo-bsc/osmo-bsc -c /build/doc/examples/osmo-bsc/osmo-bsc_custom-sccp.cfg
build    16027  0.0  0.0   4280   752 ?        S    06:30   0:00 /bin/sh -c ps xua | grep osmo
build    16029  0.0  0.0  12784   940 ?        S    06:30   0:00 grep osmo

Connecting socket failed, retrying...
Socket: in 2 tries, connected to 127.0.0.1:4242 <socket.socket fd=5, family=AddressFamily.AF_INET, type=SocketKind.SOCK_STREAM, proto=0, laddr=('127.0.0.1', 34312), raddr=('127.0.0.1', 4242)> (1 sockets open)
Terminating took 0.475s
Socket: closing 127.0.0.1:4242 <socket.socket fd=5, family=AddressFamily.AF_INET, type=SocketKind.SOCK_STREAM, proto=0, laddr=('127.0.0.1', 34312), raddr=('127.0.0.1', 4242)> (0 sockets open)
Verifying src/osmo-bsc/osmo-bsc -c /build/writtenconfig/osmo-bsc_custom-sccp.cfgjkom588l, test write_config
Launching: PWD=/build 'src/osmo-bsc/osmo-bsc' '-c' '/build/writtenconfig/osmo-bsc_custom-sccp.cfgjkom588l'

> ls -l /proc/15986/fd
total 0
lr-x------ 1 build build 64 Aug 18 06:30 0 -> pipe:[1608609367]
l-wx------ 1 build build 64 Aug 18 06:30 1 -> pipe:[1608609368]
l-wx------ 1 build build 64 Aug 18 06:30 2 -> pipe:[1608609369]
l-wx------ 1 build build 64 Aug 18 06:30 3 -> /dev/null


> ss -tn
Documentation error (missing docs): 
<command id='no mgw reset-endpoint NAME'>
        <param name='NAME' doc='(null)' />

State      Recv-Q Send-Q Local Address:Port               Peer Address:Port              


> ss -tln
State      Recv-Q Send-Q Local Address:Port               Peer Address:Port              


> ps xua | grep osmo
build    15986  2.6  0.0  54368 21464 ?        S    06:30   0:00 /usr/bin/python3 /usr/local/bin/osmotestconfig.py -p /build -w /build -v
build    16031  0.0  0.0 21474986304 42436 ?   R    06:30   0:00 src/osmo-bsc/osmo-bsc -c /build/writtenconfig/osmo-bsc_custom-sccp.cfgjkom588l
build    16038  0.0  0.0   4280   748 ?        S    06:30   0:00 /bin/sh -c ps xua | grep osmo
build    16040  0.0  0.0  12784   940 ?        S    06:30   0:00 grep osmo

Connecting socket failed, retrying...
Socket: in 2 tries, connected to 127.0.0.1:4242 <socket.socket fd=5, family=AddressFamily.AF_INET, type=SocketKind.SOCK_STREAM, proto=0, laddr=('127.0.0.1', 34328), raddr=('127.0.0.1', 4242)> (1 sockets open)
Terminating took 0.897s
Socket: closing 127.0.0.1:4242 <socket.socket fd=5, family=AddressFamily.AF_INET, type=SocketKind.SOCK_STREAM, proto=0, laddr=('127.0.0.1', 34328), raddr=('127.0.0.1', 4242)> (0 sockets open)
Verifying src/osmo-bsc/osmo-bsc -c /build/writtenconfig/osmo-bsc_custom-sccp.cfgjkom588l, test token_vty_command
Launching: PWD=/build 'src/osmo-bsc/osmo-bsc' '-c' '/build/writtenconfig/osmo-bsc_custom-sccp.cfgjkom588l'

> ls -l /proc/15986/fd
total 0
lr-x------ 1 build build 64 Aug 18 06:30 0 -> pipe:[1608609367]
l-wx------ 1 build build 64 Aug 18 06:30 1 -> pipe:[1608609368]
l-wx------ 1 build build 64 Aug 18 06:30 2 -> pipe:[1608609369]
l-wx------ 1 build build 64 Aug 18 06:30 3 -> /dev/null


> ss -tn
State      Recv-Q Send-Q Local Address:Port               Peer Address:Port              


> ss -tln
State      Recv-Q Send-Q Local Address:Port               Peer Address:Port              


> ps xua | grep osmo
build    15986  2.4  0.0  54368 21464 ?        S    06:30   0:00 /usr/bin/python3 /usr/local/bin/osmotestconfig.py -p /build -w /build -v
build    16042  0.0  0.0 21474986304 42768 ?   R    06:30   0:00 src/osmo-bsc/osmo-bsc -c /build/writtenconfig/osmo-bsc_custom-sccp.cfgjkom588l
build    16049  0.0  0.0   4280   716 ?        S    06:30   0:00 /bin/sh -c ps xua | grep osmo
build    16051  0.0  0.0  12784  1012 ?        S    06:30   0:00 grep osmo

Connecting socket failed, retrying...
Socket: in 2 tries, connected to 127.0.0.1:4242 <socket.socket fd=5, family=AddressFamily.AF_INET, type=SocketKind.SOCK_STREAM, proto=0, laddr=('127.0.0.1', 34360), raddr=('127.0.0.1', 4242)> (1 sockets open)
Terminating took 0.897s
Socket: closing 127.0.0.1:4242 <socket.socket fd=5, family=AddressFamily.AF_INET, type=SocketKind.SOCK_STREAM, proto=0, laddr=('127.0.0.1', 34360), raddr=('127.0.0.1', 4242)> (0 sockets open)
ERRORS: 2
make[5]: *** [python-tests] Error 2
Makefile:708: recipe for target 'python-tests' failed
make[5]: Leaving directory '/build/tests'
Makefile:730: recipe for target 'check-local' failed
make[4]: Leaving directory '/build/tests'
make[4]: *** [check-local] Error 2
Makefile:568: recipe for target 'check-am' failed
make[3]: Leaving directory '/build/tests'
make[3]: *** [check-am] Error 2
Makefile:420: recipe for target 'check-recursive' failed
make[2]: Leaving directory '/build/tests'
make[2]: *** [check-recursive] Error 1
make[1]: *** [check-recursive] Error 1
Makefile:453: recipe for target 'check-recursive' failed
make[1]: Leaving directory '/build'
Makefile:744: recipe for target 'check' failed
make: *** [check] Error 2
+ cat-testlogs.sh
Build step 'Execute shell' marked build as failure
[WARNINGS]Skipping publisher since build result is FAILURE


More information about the jenkins-notifications mailing list