Build failed in Jenkins: master-osmo-bsc » a1=default,a2=default,a3=default,a4=default,osmocom-master-debian9 #15354

jenkins at lists.osmocom.org jenkins at lists.osmocom.org
Wed Aug 18 00:58:19 UTC 2021


See <https://jenkins.osmocom.org/jenkins/job/master-osmo-bsc/a1=default,a2=default,a3=default,a4=default,label=osmocom-master-debian9/15354/display/redirect>

Changes:


------------------------------------------
[...truncated 884.42 KB...]
test_unknown_command (__main__.TestVTY) ... Connecting socket failed, retrying...
Socket: in 2 tries, connected to 127.0.0.1:4242 <socket.socket fd=5, family=AddressFamily.AF_INET, type=SocketKind.SOCK_STREAM, proto=0, laddr=('127.0.0.1', 54844), raddr=('127.0.0.1', 4242)> (1 sockets open)
Socket: closing 127.0.0.1:4242 <socket.socket fd=5, family=AddressFamily.AF_INET, type=SocketKind.SOCK_STREAM, proto=0, laddr=('127.0.0.1', 54844), raddr=('127.0.0.1', 4242)> (0 sockets open)
Launch: ./src/osmo-bsc/osmo-bsc -c /build/doc/examples/osmo-bsc/osmo-bsc.cfg from /build
Launching: PWD=/build './src/osmo-bsc/osmo-bsc' '-c' '/build/doc/examples/osmo-bsc/osmo-bsc.cfg'

> ls -l /proc/15514/fd
total 0
lr-x------ 1 build build 64 Aug 18 00:58 0 -> pipe:[466141383]
l-wx------ 1 build build 64 Aug 18 00:58 1 -> pipe:[466141384]
l-wx------ 1 build build 64 Aug 18 00:58 2 -> pipe:[466141385]
l-wx------ 1 build build 64 Aug 18 00:58 3 -> /dev/null


> ss -tn
State      Recv-Q Send-Q Local Address:Port               Peer Address:Port              


> ss -tln
State      Recv-Q Send-Q Local Address:Port               Peer Address:Port              


> ps xua | grep osmo
build    15514  0.0  0.0  53672 21092 ?        S    00:58   0:00 /usr/bin/python3 /usr/local/bin/osmotestvty.py -p /build -w /build -v
build    15537  0.0  0.0 21474986304 30500 ?   R    00:58   0:00 ./src/osmo-bsc/osmo-bsc -c /build/doc/examples/osmo-bsc/osmo-bsc.cfg
build    15544  0.0  0.0   4280   736 ?        S    00:58   0:00 /bin/sh -c ps xua | grep osmo
build    15546  0.0  0.0  12784  1032 ?        S    00:58   0:00 grep osmo

ok

----------------------------------------------------------------------
Ran 3 tests in 0.800s

OK
Connecting socket failed, retrying...
Socket: in 2 tries, connected to 127.0.0.1:4242 <socket.socket fd=5, family=AddressFamily.AF_INET, type=SocketKind.SOCK_STREAM, proto=0, laddr=('127.0.0.1', 54848), raddr=('127.0.0.1', 4242)> (1 sockets open)
Socket: closing 127.0.0.1:4242 <socket.socket fd=5, family=AddressFamily.AF_INET, type=SocketKind.SOCK_STREAM, proto=0, laddr=('127.0.0.1', 54848), raddr=('127.0.0.1', 4242)> (0 sockets open)
osmotestconfig.py -p /build -w /build -v
Verifying src/osmo-bsc/osmo-bsc -c /build/doc/examples/osmo-bsc/osmo-bsc.cfg, test verify_doc
Opening /dev/null
Launching: PWD=/build 'src/osmo-bsc/osmo-bsc' '-c' '/build/doc/examples/osmo-bsc/osmo-bsc.cfg'

> ls -l /proc/15548/fd
total 0
lr-x------ 1 build build 64 Aug 18 00:58 0 -> pipe:[466141383]
l-wx------ 1 build build 64 Aug 18 00:58 1 -> pipe:[466141384]
l-wx------ 1 build build 64 Aug 18 00:58 2 -> pipe:[466141385]
l-wx------ 1 build build 64 Aug 18 00:58 3 -> /dev/null
Warning: doc/examples/osmo-bsc/osmo-bsc-minimal.cfg is not being tested
Warning: doc/examples/osmo-bsc/siemens/osmo-bsc.bs11.cfg is not being tested
Warning: doc/examples/osmo-bsc/ericsson/osmo-bsc.rbs2308.cfg is not being tested
Warning: doc/examples/osmo-bsc/ericsson/osmo-bsc.dug20-rus02-4trx.cfg is not being tested
Warning: doc/examples/osmo-bsc/ericsson/osmo-bsc.dug20-rus02-8trx.cfg is not being tested
Warning: doc/examples/osmo-bsc/ericsson/osmo-bsc.dug20-rus01-4trx.cfg is not being tested
Warning: doc/examples/osmo-bsc/nokia/osmo-bsc.insite.cfg is not being tested


> ss -tn
State      Recv-Q Send-Q Local Address:Port               Peer Address:Port              


> ss -tln
State      Recv-Q Send-Q Local Address:Port               Peer Address:Port              


> ps xua | grep osmo
build    15548  0.0  0.0  53768 20820 ?        S    00:58   0:00 /usr/bin/python3 /usr/local/bin/osmotestconfig.py -p /build -w /build -v
build    15549  0.0  0.0 21474986304 32372 ?   R    00:58   0:00 src/osmo-bsc/osmo-bsc -c /build/doc/examples/osmo-bsc/osmo-bsc.cfg
build    15556  0.0  0.0   4280   712 ?        S    00:58   0:00 /bin/sh -c ps xua | grep osmo
build    15558  0.0  0.0  12784   988 ?        S    00:58   0:00 grep osmo

Connecting socket failed, retrying...
Socket: in 2 tries, connected to 127.0.0.1:4242 <socket.socket fd=5, family=AddressFamily.AF_INET, type=SocketKind.SOCK_STREAM, proto=0, laddr=('127.0.0.1', 54852), raddr=('127.0.0.1', 4242)> (1 sockets open)
Terminating took 0.475s
Socket: closing 127.0.0.1:4242 <socket.socket fd=5, family=AddressFamily.AF_INET, type=SocketKind.SOCK_STREAM, proto=0, laddr=('127.0.0.1', 54852), raddr=('127.0.0.1', 4242)> (0 sockets open)
Verifying src/osmo-bsc/osmo-bsc -c /build/writtenconfig/osmo-bsc.cfgjxqbyby6, test write_config
Launching: PWD=/build 'src/osmo-bsc/osmo-bsc' '-c' '/build/writtenconfig/osmo-bsc.cfgjxqbyby6'

> ls -l /proc/15548/fd
total 0
lr-x------ 1 build build 64 Aug 18 00:58 0 -> pipe:[466141383]
l-wx------ 1 build build 64 Aug 18 00:58 1 -> pipe:[466141384]
l-wx------ 1 build build 64 Aug 18 00:58 2 -> pipe:[466141385]
l-wx------ 1 build build 64 Aug 18 00:58 3 -> /dev/null
Documentation error (missing docs): 
<command id='no mgw reset-endpoint NAME'>
        <param name='NAME' doc='(null)' />



> ss -tn
State      Recv-Q Send-Q Local Address:Port               Peer Address:Port              


> ss -tln
State      Recv-Q Send-Q Local Address:Port               Peer Address:Port              


> ps xua | grep osmo
build    15548 14.0  0.0  54236 21504 ?        S    00:58   0:00 /usr/bin/python3 /usr/local/bin/osmotestconfig.py -p /build -w /build -v
build    15560  0.0  0.0 21474985876 24440 ?   R    00:58   0:00 src/osmo-bsc/osmo-bsc -c /build/writtenconfig/osmo-bsc.cfgjxqbyby6
build    15567  0.0  0.0   4280   740 ?        S    00:58   0:00 /bin/sh -c ps xua | grep osmo
build    15569  0.0  0.0  12784   968 ?        S    00:58   0:00 grep osmo

Connecting socket failed, retrying...
Socket: in 2 tries, connected to 127.0.0.1:4242 <socket.socket fd=5, family=AddressFamily.AF_INET, type=SocketKind.SOCK_STREAM, proto=0, laddr=('127.0.0.1', 54856), raddr=('127.0.0.1', 4242)> (1 sockets open)
Terminating took 0.168s
Socket: closing 127.0.0.1:4242 <socket.socket fd=5, family=AddressFamily.AF_INET, type=SocketKind.SOCK_STREAM, proto=0, laddr=('127.0.0.1', 54856), raddr=('127.0.0.1', 4242)> (0 sockets open)
Verifying src/osmo-bsc/osmo-bsc -c /build/writtenconfig/osmo-bsc.cfgjxqbyby6, test token_vty_command
Launching: PWD=/build 'src/osmo-bsc/osmo-bsc' '-c' '/build/writtenconfig/osmo-bsc.cfgjxqbyby6'

> ls -l /proc/15548/fd
total 0
lr-x------ 1 build build 64 Aug 18 00:58 0 -> pipe:[466141383]
l-wx------ 1 build build 64 Aug 18 00:58 1 -> pipe:[466141384]
l-wx------ 1 build build 64 Aug 18 00:58 2 -> pipe:[466141385]
l-wx------ 1 build build 64 Aug 18 00:58 3 -> /dev/null


> ss -tn
State      Recv-Q Send-Q Local Address:Port               Peer Address:Port              


> ss -tln
State      Recv-Q Send-Q Local Address:Port               Peer Address:Port              


> ps xua | grep osmo
build    15548  7.5  0.0  54236 21504 ?        S    00:58   0:00 /usr/bin/python3 /usr/local/bin/osmotestconfig.py -p /build -w /build -v
build    15571  0.0  0.0 21474986304 31252 ?   R    00:58   0:00 src/osmo-bsc/osmo-bsc -c /build/writtenconfig/osmo-bsc.cfgjxqbyby6
build    15578  0.0  0.0   4280   756 ?        S    00:58   0:00 /bin/sh -c ps xua | grep osmo
build    15580  0.0  0.0  12784   976 ?        S    00:58   0:00 grep osmo

Connecting socket failed, retrying...
Socket: in 2 tries, connected to 127.0.0.1:4242 <socket.socket fd=5, family=AddressFamily.AF_INET, type=SocketKind.SOCK_STREAM, proto=0, laddr=('127.0.0.1', 54864), raddr=('127.0.0.1', 4242)> (1 sockets open)
Terminating took 0.897s
Socket: closing 127.0.0.1:4242 <socket.socket fd=5, family=AddressFamily.AF_INET, type=SocketKind.SOCK_STREAM, proto=0, laddr=('127.0.0.1', 54864), raddr=('127.0.0.1', 4242)> (0 sockets open)
Verifying src/osmo-bsc/osmo-bsc -c /build/doc/examples/osmo-bsc/osmo-bsc_custom-sccp.cfg, test verify_doc
Launching: PWD=/build 'src/osmo-bsc/osmo-bsc' '-c' '/build/doc/examples/osmo-bsc/osmo-bsc_custom-sccp.cfg'

> ls -l /proc/15548/fd
total 0
lr-x------ 1 build build 64 Aug 18 00:58 0 -> pipe:[466141383]
l-wx------ 1 build build 64 Aug 18 00:58 1 -> pipe:[466141384]
l-wx------ 1 build build 64 Aug 18 00:58 2 -> pipe:[466141385]
l-wx------ 1 build build 64 Aug 18 00:58 3 -> /dev/null


> ss -tn
State      Recv-Q Send-Q Local Address:Port               Peer Address:Port              


> ss -tln
State      Recv-Q Send-Q Local Address:Port               Peer Address:Port              


> ps xua | grep osmo
build    15548  3.7  0.0  54236 21504 ?        S    00:58   0:00 /usr/bin/python3 /usr/local/bin/osmotestconfig.py -p /build -w /build -v
build    15582  0.0  0.0 21474986304 33824 ?   R    00:58   0:00 src/osmo-bsc/osmo-bsc -c /build/doc/examples/osmo-bsc/osmo-bsc_custom-sccp.cfg
build    15589  0.0  0.0   4280   716 ?        S    00:58   0:00 /bin/sh -c ps xua | grep osmo
build    15591  0.0  0.0  12784   980 ?        S    00:58   0:00 grep osmo

Connecting socket failed, retrying...
Socket: in 2 tries, connected to 127.0.0.1:4242 <socket.socket fd=5, family=AddressFamily.AF_INET, type=SocketKind.SOCK_STREAM, proto=0, laddr=('127.0.0.1', 54870), raddr=('127.0.0.1', 4242)> (1 sockets open)
Terminating took 0.475s
Socket: closing 127.0.0.1:4242 <socket.socket fd=5, family=AddressFamily.AF_INET, type=SocketKind.SOCK_STREAM, proto=0, laddr=('127.0.0.1', 54870), raddr=('127.0.0.1', 4242)> (0 sockets open)
Verifying src/osmo-bsc/osmo-bsc -c /build/writtenconfig/osmo-bsc_custom-sccp.cfg0gcu_ob2, test write_config
Launching: PWD=/build 'src/osmo-bsc/osmo-bsc' '-c' '/build/writtenconfig/osmo-bsc_custom-sccp.cfg0gcu_ob2'

> ls -l /proc/15548/fd
total 0
lr-x------ 1 build build 64 Aug 18 00:58 0 -> pipe:[466141383]
l-wx------ 1 build build 64 Aug 18 00:58 1 -> pipe:[466141384]
l-wx------ 1 build build 64 Aug 18 00:58 2 -> pipe:[466141385]
l-wx------ 1 build build 64 Aug 18 00:58 3 -> /dev/null


> ss -tn
Documentation error (missing docs): 
<command id='no mgw reset-endpoint NAME'>
        <param name='NAME' doc='(null)' />

State      Recv-Q Send-Q Local Address:Port               Peer Address:Port              


> ss -tln
State      Recv-Q Send-Q Local Address:Port               Peer Address:Port              


> ps xua | grep osmo
build    15548  3.6  0.0  54244 21516 ?        S    00:58   0:00 /usr/bin/python3 /usr/local/bin/osmotestconfig.py -p /build -w /build -v
build    15593  0.0  0.0 21474986304 29960 ?   R    00:58   0:00 src/osmo-bsc/osmo-bsc -c /build/writtenconfig/osmo-bsc_custom-sccp.cfg0gcu_ob2
build    15600  0.0  0.0   4280   716 ?        S    00:58   0:00 /bin/sh -c ps xua | grep osmo
build    15602  0.0  0.0  12784  1028 ?        S    00:58   0:00 grep osmo

Connecting socket failed, retrying...
Socket: in 2 tries, connected to 127.0.0.1:4242 <socket.socket fd=5, family=AddressFamily.AF_INET, type=SocketKind.SOCK_STREAM, proto=0, laddr=('127.0.0.1', 54874), raddr=('127.0.0.1', 4242)> (1 sockets open)
Terminating took 0.168s
Socket: closing 127.0.0.1:4242 <socket.socket fd=5, family=AddressFamily.AF_INET, type=SocketKind.SOCK_STREAM, proto=0, laddr=('127.0.0.1', 54874), raddr=('127.0.0.1', 4242)> (0 sockets open)
Verifying src/osmo-bsc/osmo-bsc -c /build/writtenconfig/osmo-bsc_custom-sccp.cfg0gcu_ob2, test token_vty_command
Launching: PWD=/build 'src/osmo-bsc/osmo-bsc' '-c' '/build/writtenconfig/osmo-bsc_custom-sccp.cfg0gcu_ob2'

> ls -l /proc/15548/fd
total 0
lr-x------ 1 build build 64 Aug 18 00:58 0 -> pipe:[466141383]
l-wx------ 1 build build 64 Aug 18 00:58 1 -> pipe:[466141384]
l-wx------ 1 build build 64 Aug 18 00:58 2 -> pipe:[466141385]
l-wx------ 1 build build 64 Aug 18 00:58 3 -> /dev/null


> ss -tn
State      Recv-Q Send-Q Local Address:Port               Peer Address:Port              


> ss -tln
State      Recv-Q Send-Q Local Address:Port               Peer Address:Port              


> ps xua | grep osmo
build    15548  3.0  0.0  54244 21516 ?        S    00:58   0:00 /usr/bin/python3 /usr/local/bin/osmotestconfig.py -p /build -w /build -v
build    15604  0.0  0.0 21474986304 33688 ?   R    00:58   0:00 src/osmo-bsc/osmo-bsc -c /build/writtenconfig/osmo-bsc_custom-sccp.cfg0gcu_ob2
build    15611  0.0  0.0   4280   712 ?        S    00:58   0:00 /bin/sh -c ps xua | grep osmo
build    15613  0.0  0.0  12784   924 ?        S    00:58   0:00 grep osmo

ERRORS: 2
Connecting socket failed, retrying...
Socket: in 2 tries, connected to 127.0.0.1:4242 <socket.socket fd=5, family=AddressFamily.AF_INET, type=SocketKind.SOCK_STREAM, proto=0, laddr=('127.0.0.1', 54878), raddr=('127.0.0.1', 4242)> (1 sockets open)
Terminating took 0.897s
Socket: closing 127.0.0.1:4242 <socket.socket fd=5, family=AddressFamily.AF_INET, type=SocketKind.SOCK_STREAM, proto=0, laddr=('127.0.0.1', 54878), raddr=('127.0.0.1', 4242)> (0 sockets open)
Makefile:708: recipe for target 'python-tests' failed
make[5]: Leaving directory '/build/tests'
make[5]: *** [python-tests] Error 2
make[4]: *** [check-local] Error 2
Makefile:730: recipe for target 'check-local' failed
make[4]: Leaving directory '/build/tests'
Makefile:568: recipe for target 'check-am' failed
make[3]: Leaving directory '/build/tests'
make[3]: *** [check-am] Error 2
make[2]: *** [check-recursive] Error 1
Makefile:420: recipe for target 'check-recursive' failed
make[2]: Leaving directory '/build/tests'
Makefile:453: recipe for target 'check-recursive' failed
make[1]: *** [check-recursive] Error 1
make[1]: Leaving directory '/build'
Makefile:744: recipe for target 'check' failed
make: *** [check] Error 2
+ cat-testlogs.sh
Build step 'Execute shell' marked build as failure
[WARNINGS]Skipping publisher since build result is FAILURE


More information about the jenkins-notifications mailing list